Hospital Service Area,Hospital County,Operating Certificate Number,Permanent Facility Id,Facility Name,Age Group,Zip Code - 3 digits,Gender,Race,Ethnicity,Length of Stay,Type of Admission,Patient Disposition,Discharge Year,CCS Diagnosis Code,CCS Diagnosis Description,CCS Procedure Code,CCS Procedure Description,APR DRG Code,APR DRG Description,APR MDC Code,APR MDC Description,APR Severity of Illness Code,APR Severity of Illness Description,APR Risk of Mortality,APR Medical Surgical Description,Payment Typology 1,Payment Typology 2,Payment Typology 3,Birth Weight,Abortion Edit Indicator,Emergency Department Indicator,Total Charges,Total Costs
New York City,Bronx,7000006,001168,Montefiore Medical Center-Wakefield Hospital,70 or Older,104,M,Other Race,Not Span/Hispanic,4,Emergency,Skilled Nursing Home,2020,SYM016,OTHER GENERAL SIGNS AND SYMPTOMS,ADM017,ADMINISTRATION OF NUTRITIONAL AND ELECTROLYTIC SUBSTANCES,421,"MALNUTRITION, FAILURE TO THRIVE & OTHER NUTRITIONAL DISORDERS",10,"ENDOCRINE, NUTRITIONAL AND METABOLIC DISEASES AND DISORDERS",4,Extreme,Extreme,Medical,Medicare,Medicaid,,,,Y,58714.15,9235.61
New York City,Bronx,7000006,001169,Montefiore Medical Center - Henry & Lucy Moses Div,70 or Older,104,F,White,Spanish/Hispanic,7,Emergency,Skilled Nursing Home,2020,SYM016,OTHER GENERAL SIGNS AND SYMPTOMS,ADM017,ADMINISTRATION OF NUTRITIONAL AND ELECTROLYTIC SUBSTANCES,421,"MALNUTRITION, FAILURE TO THRIVE & OTHER NUTRITIONAL DISORDERS",10,"ENDOCRINE, NUTRITIONAL AND METABOLIC DISEASES AND DISORDERS",3,Major,Major,Medical,Medicare,Medicaid,,,,Y,82503.58,13751.64
New York City,Manhattan,7002024,001456,Mount Sinai Hospital,0 to 17,121,F,White,Multi-ethnic,3,Urgent,Home or Self Care,2020,SYM016,OTHER GENERAL SIGNS AND SYMPTOMS,ADM017,ADMINISTRATION OF NUTRITIONAL AND ELECTROLYTIC SUBSTANCES,421,"MALNUTRITION, FAILURE TO THRIVE & OTHER NUTRITIONAL DISORDERS",10,"ENDOCRINE, NUTRITIONAL AND METABOLIC DISEASES AND DISORDERS",2,Moderate,Moderate,Medical,Medicaid,Self-Pay,,,,N,35464.3,20711.88
New York City,Bronx,7000006,003058,Montefiore Med Center - Jack D Weiler Hosp of A Einstein College Div,50 to 69,104,M,White,Not Span/Hispanic,6,Emergency,Skilled Nursing Home,2020,SYM016,OTHER GENERAL SIGNS AND SYMPTOMS,ADM021,"ADMINISTRATION OF THERAPEUTIC SUBSTANCES, NEC",421,"MALNUTRITION, FAILURE TO THRIVE & OTHER NUTRITIONAL DISORDERS",10,"ENDOCRINE, NUTRITIONAL AND METABOLIC DISEASES AND DISORDERS",3,Major,Extreme,Medical,Medicare,,,,,N,71833.6,13039.82
New York City,Bronx,7000006,003058,Montefiore Med Center - Jack D Weiler Hosp of A Einstein College Div,30 to 49,104,F,Other Race,Spanish/Hispanic,9,Emergency,Home or Self Care,2020,SYM016,OTHER GENERAL SIGNS AND SYMPTOMS,GIS004,GI SYSTEM ENDOSCOPY WITHOUT BIOPSY (DIAGNOSTIC),421,"MALNUTRITION, FAILURE TO THRIVE & OTHER NUTRITIONAL DISORDERS",10,"ENDOCRINE, NUTRITIONAL AND METABOLIC DISEASES AND DISORDERS",3,Major,Major,Medical,Medicaid,,,,,Y,103524.78,19101.92
New York City,Bronx,7000006,001169,Montefiore Medical Center - Henry & Lucy Moses Div,70 or Older,104,F,Other Race,Spanish/Hispanic,1,Emergency,Home or Self Care,2020,SYM016,OTHER GENERAL SIGNS AND SYMPTOMS,ADM017,ADMINISTRATION OF NUTRITIONAL AND ELECTROLYTIC SUBSTANCES,421,"MALNUTRITION, FAILURE TO THRIVE & OTHER NUTRITIONAL DISORDERS",10,"ENDOCRINE, NUTRITIONAL AND METABOLIC DISEASES AND DISORDERS",2,Moderate,Moderate,Medical,Medicare,,,,,Y,22876.53,3792.86
New York City,Bronx,7000006,001169,Montefiore Medical Center - Henry & Lucy Moses Div,0 to 17,104,M,Other Race,Unknown,4,Emergency,Home or Self Care,2020,SYM016,OTHER GENERAL SIGNS AND SYMPTOMS,,,421,"MALNUTRITION, FAILURE TO THRIVE & OTHER NUTRITIONAL DISORDERS",10,"ENDOCRINE, NUTRITIONAL AND METABOLIC DISEASES AND DISORDERS",1,Minor,Minor,Medical,Private Health Insurance,,,,,N,44659.03,12493.73
New York City,Bronx,7000006,003058,Montefiore Med Center - Jack D Weiler Hosp of A Einstein College Div,70 or Older,104,F,Other Race,Spanish/Hispanic,3,Emergency,Home w/ Home Health Services,2020,SYM016,OTHER GENERAL SIGNS AND SYMPTOMS,ADM017,ADMINISTRATION OF NUTRITIONAL AND ELECTROLYTIC SUBSTANCES,421,"MALNUTRITION, FAILURE TO THRIVE & OTHER NUTRITIONAL DISORDERS",10,"ENDOCRINE, NUTRITIONAL AND METABOLIC DISEASES AND DISORDERS",3,Major,Major,Medical,Medicare,Medicaid,,,,Y,53291.98,6987.31
New York City,Bronx,7000006,003058,Montefiore Med Center - Jack D Weiler Hosp of A Einstein College Div,30 to 49,112,M,Other Race,Spanish/Hispanic,9,Emergency,Home or Self Care,2020,SYM016,OTHER GENERAL SIGNS AND SYMPTOMS,,,421,"MALNUTRITION, FAILURE TO THRIVE & OTHER NUTRITIONAL DISORDERS",10,"ENDOCRINE, NUTRITIONAL AND METABOLIC DISEASES AND DISORDERS",3,Major,Moderate,Medical,Medicaid,,,,,Y,96438.24,18430.81
New York City,Manhattan,7002024,001456,Mount Sinai Hospital,0 to 17,112,M,Black/African American,Not Span/Hispanic,5,Elective,Home or Self Care,2020,END008,MALNUTRITION,CAR024,VENOUS AND ARTERIAL CATHETER PLACEMENT,421,"MALNUTRITION, FAILURE TO THRIVE & OTHER NUTRITIONAL DISORDERS",10,"ENDOCRINE, NUTRITIONAL AND METABOLIC DISEASES AND DISORDERS",3,Major,Moderate,Medical,Medicaid,Self-Pay,,,,N,54884.96,32689.01
New York City,Manhattan,7002024,001456,Mount Sinai Hospital,70 or Older,112,M,Black/African American,Not Span/Hispanic,31,Emergency,Inpatient Rehabilitation Facility,2020,SYM016,OTHER GENERAL SIGNS AND SYMPTOMS,GIS017,GASTROSTOMY,421,"MALNUTRITION, FAILURE TO THRIVE & OTHER NUTRITIONAL DISORDERS",10,"ENDOCRINE, NUTRITIONAL AND METABOLIC DISEASES AND DISORDERS",4,Extreme,Major,Medical,Medicare,Medicaid,Self-Pay,,,Y,317064.17,83839.47
New York City,Bronx,7000006,003058,Montefiore Med Center - Jack D Weiler Hosp of A Einstein College Div,70 or Older,104,M,White,Not Span/Hispanic,5,Emergency,Skilled Nursing Home,2020,SYM016,OTHER GENERAL SIGNS AND SYMPTOMS,,,421,"MALNUTRITION, FAILURE TO THRIVE & OTHER NUTRITIONAL DISORDERS",10,"ENDOCRINE, NUTRITIONAL AND METABOLIC DISEASES AND DISORDERS",2,Moderate,Moderate,Medical,Medicare,Medicaid,,,,Y,51773.25,9847.32
New York City,Bronx,7000006,001168,Montefiore Medical Center-Wakefield Hospital,70 or Older,104,M,Black/African American,Spanish/Hispanic,11,Emergency,Skilled Nursing Home,2020,SYM016,OTHER GENERAL SIGNS AND SYMPTOMS,ESA001,HEMODIALYSIS,421,"MALNUTRITION, FAILURE TO THRIVE & OTHER NUTRITIONAL DISORDERS",10,"ENDOCRINE, NUTRITIONAL AND METABOLIC DISEASES AND DISORDERS",3,Major,Major,Medical,Medicare,Medicaid,,,,Y,145035.84,25452.03
New York City,Manhattan,7002002,001439,Mount Sinai Beth Israel,50 to 69,100,M,White,Not Span/Hispanic,7,Emergency,Skilled Nursing Home,2020,END007,NUTRITIONAL DEFICIENCIES,IMG005,MAGNETIC RESONANCE IMAGING (MRI),421,"MALNUTRITION, FAILURE TO THRIVE & OTHER NUTRITIONAL DISORDERS",10,"ENDOCRINE, NUTRITIONAL AND METABOLIC DISEASES AND DISORDERS",3,Major,Major,Medical,Medicaid,Medicaid,Self-Pay,,,Y,85270.35,17831.68
New York City,Bronx,7000006,003058,Montefiore Med Center - Jack D Weiler Hosp of A Einstein College Div,70 or Older,113,F,Other Race,Not Span/Hispanic,3,Emergency,Hospice - Home,2020,SYM016,OTHER GENERAL SIGNS AND SYMPTOMS,,,421,"MALNUTRITION, FAILURE TO THRIVE & OTHER NUTRITIONAL DISORDERS",10,"ENDOCRINE, NUTRITIONAL AND METABOLIC DISEASES AND DISORDERS",3,Major,Major,Medical,Medicare,Medicaid,,,,Y,34026.54,5785.27
New York City,Bronx,7000006,001169,Montefiore Medical Center - Henry & Lucy Moses Div,0 to 17,104,F,Other Race,Spanish/Hispanic,6,Emergency,Home or Self Care,2020,SYM016,OTHER GENERAL SIGNS AND SYMPTOMS,,,421,"MALNUTRITION, FAILURE TO THRIVE & OTHER NUTRITIONAL DISORDERS",10,"ENDOCRINE, NUTRITIONAL AND METABOLIC DISEASES AND DISORDERS",1,Minor,Minor,Medical,Medicaid,,,,,Y,82026,19403.42
New York City,Manhattan,7002024,001456,Mount Sinai Hospital,0 to 17,100,F,Other Race,Not Span/Hispanic,10,Urgent,Home w/ Home Health Services,2020,SYM016,OTHER GENERAL SIGNS AND SYMPTOMS,IMG009,PLAIN RADIOGRAPHY,421,"MALNUTRITION, FAILURE TO THRIVE & OTHER NUTRITIONAL DISORDERS",10,"ENDOCRINE, NUTRITIONAL AND METABOLIC DISEASES AND DISORDERS",2,Moderate,Moderate,Medical,Medicaid,Medicaid,Self-Pay,,,N,97803.45,63034.83
New York City,Manhattan,7002024,001456,Mount Sinai Hospital,70 or Older,112,F,White,Not Span/Hispanic,8,Elective,Home w/ Home Health Services,2020,END008,MALNUTRITION,GIS017,GASTROSTOMY,421,"MALNUTRITION, FAILURE TO THRIVE & OTHER NUTRITIONAL DISORDERS",10,"ENDOCRINE, NUTRITIONAL AND METABOLIC DISEASES AND DISORDERS",4,Extreme,Major,Medical,Medicare,Self-Pay,,,,N,92060.17,24748.19
New York City,Bronx,7000006,001169,Montefiore Medical Center - Henry & Lucy Moses Div,50 to 69,104,M,Other Race,Spanish/Hispanic,6,Emergency,Skilled Nursing Home,2020,SYM016,OTHER GENERAL SIGNS AND SYMPTOMS,GIS001,ESOPHAGOGASTRODUODENOSCOPY (EGD) WITH BIOPSY,421,"MALNUTRITION, FAILURE TO THRIVE & OTHER NUTRITIONAL DISORDERS",10,"ENDOCRINE, NUTRITIONAL AND METABOLIC DISEASES AND DISORDERS",2,Moderate,Moderate,Medical,Medicaid,,,,,Y,79329.04,15556.6
New York City,Bronx,7000006,001169,Montefiore Medical Center - Henry & Lucy Moses Div,0 to 17,104,M,Other Race,Unknown,4,Emergency,Home or Self Care,2020,SYM016,OTHER GENERAL SIGNS AND SYMPTOMS,GIS025,OTHER GI SYSTEM DEVICE PROCEDURES,421,"MALNUTRITION, FAILURE TO THRIVE & OTHER NUTRITIONAL DISORDERS",10,"ENDOCRINE, NUTRITIONAL AND METABOLIC DISEASES AND DISORDERS",4,Extreme,Major,Medical,Medicaid,,,,,N,123405.18,19154.4
New York City,Manhattan,7002054,003975,New York Presbyterian Hospital - Allen Hospital,70 or Older,,F,Multi-racial,Not Span/Hispanic,8,Emergency,Skilled Nursing Home,2020,SYM016,OTHER GENERAL SIGNS AND SYMPTOMS,,,421,"MALNUTRITION, FAILURE TO THRIVE & OTHER NUTRITIONAL DISORDERS",10,"ENDOCRINE, NUTRITIONAL AND METABOLIC DISEASES AND DISORDERS",2,Moderate,Moderate,Medical,Medicare,Medicare,Self-Pay,,,Y,101432.32,21600.02
New York City,Manhattan,7002054,003975,New York Presbyterian Hospital - Allen Hospital,50 to 69,100,F,Multi-racial,Not Span/Hispanic,6,Emergency,Skilled Nursing Home,2020,SYM016,OTHER GENERAL SIGNS AND SYMPTOMS,,,421,"MALNUTRITION, FAILURE TO THRIVE & OTHER NUTRITIONAL DISORDERS",10,"ENDOCRINE, NUTRITIONAL AND METABOLIC DISEASES AND DISORDERS",2,Moderate,Minor,Medical,Medicare,Self-Pay,,,,Y,71819.59,15546.65
New York City,Manhattan,7002054,001464,New York-Presbyterian Hospital - Columbia Presbyterian Center,0 to 17,100,F,White,Spanish/Hispanic,1,Emergency,Home or Self Care,2020,PNL012,NEONATAL DIGESTIVE AND FEEDING DISORDERS,,,421,"MALNUTRITION, FAILURE TO THRIVE & OTHER NUTRITIONAL DISORDERS",10,"ENDOCRINE, NUTRITIONAL AND METABOLIC DISEASES AND DISORDERS",2,Moderate,Minor,Medical,Medicaid,Medicaid,Self-Pay,03000,,Y,16460.07,3435.94
New York City,Manhattan,7002054,001464,New York-Presbyterian Hospital - Columbia Presbyterian Center,70 or Older,100,M,Other Race,Multi-ethnic,7,Emergency,Skilled Nursing Home,2020,SYM016,OTHER GENERAL SIGNS AND SYMPTOMS,ADM015,ADMINISTRATION OF ANTIBIOTICS,421,"MALNUTRITION, FAILURE TO THRIVE & OTHER NUTRITIONAL DISORDERS",10,"ENDOCRINE, NUTRITIONAL AND METABOLIC DISEASES AND DISORDERS",3,Major,Major,Medical,Medicare,Medicaid,Self-Pay,,,Y,85449.81,18277.23
New York City,Manhattan,7002054,001464,New York-Presbyterian Hospital - Columbia Presbyterian Center,0 to 17,100,M,Other Race,Spanish/Hispanic,3,Emergency,Home or Self Care,2020,SYM016,OTHER GENERAL SIGNS AND SYMPTOMS,,,421,"MALNUTRITION, FAILURE TO THRIVE & OTHER NUTRITIONAL DISORDERS",10,"ENDOCRINE, NUTRITIONAL AND METABOLIC DISEASES AND DISORDERS",2,Moderate,Minor,Medical,Medicaid,Medicaid,Self-Pay,,,Y,36230.46,7901.41
New York City,Manhattan,7002054,001464,New York-Presbyterian Hospital - Columbia Presbyterian Center,70 or Older,105,M,White,Not Span/Hispanic,3,Urgent,Home w/ Home Health Services,2020,END008,MALNUTRITION,MAM006,PACEMAKER AND DEFIBRILLATOR INTERROGATION,421,"MALNUTRITION, FAILURE TO THRIVE & OTHER NUTRITIONAL DISORDERS",10,"ENDOCRINE, NUTRITIONAL AND METABOLIC DISEASES AND DISORDERS",3,Major,Major,Medical,Medicare,Private Health Insurance,Self-Pay,,,N,54006.38,26300.91
New York City,Manhattan,7002054,001464,New York-Presbyterian Hospital - Columbia Presbyterian Center,50 to 69,100,F,Multi-racial,Spanish/Hispanic,1,Emergency,Home w/ Home Health Services,2020,END008,MALNUTRITION,ADM007,INTRAVENOUS INDUCTION OF LABOR,421,"MALNUTRITION, FAILURE TO THRIVE & OTHER NUTRITIONAL DISORDERS",10,"ENDOCRINE, NUTRITIONAL AND METABOLIC DISEASES AND DISORDERS",3,Major,Major,Medical,Medicare,Medicare,Medicaid,,,Y,17890.55,3854.89
New York City,Manhattan,7002054,001464,New York-Presbyterian Hospital - Columbia Presbyterian Center,50 to 69,100,M,Multi-racial,Not Span/Hispanic,3,Emergency,Skilled Nursing Home,2020,END008,MALNUTRITION,,,421,"MALNUTRITION, FAILURE TO THRIVE & OTHER NUTRITIONAL DISORDERS",10,"ENDOCRINE, NUTRITIONAL AND METABOLIC DISEASES AND DISORDERS",2,Moderate,Moderate,Medical,Medicare,Medicaid,Self-Pay,,,Y,35689.61,7797.64
New York City,Manhattan,7002024,001456,Mount Sinai Hospital,70 or Older,114,M,White,Not Span/Hispanic,37,Emergency,Skilled Nursing Home,2020,SYM016,OTHER GENERAL SIGNS AND SYMPTOMS,RAD004,"RADIATION THERAPY, NEC",421,"MALNUTRITION, FAILURE TO THRIVE & OTHER NUTRITIONAL DISORDERS",10,"ENDOCRINE, NUTRITIONAL AND METABOLIC DISEASES AND DISORDERS",3,Major,Major,Medical,Medicare,Medicare,Medicaid,,,Y,463808.53,112006.56
New York City,Queens,7003010,001637,New York - Presbyterian/Queens,0 to 17,113,F,Black/African American,Spanish/Hispanic,1,Emergency,Home or Self Care,2020,PNL012,NEONATAL DIGESTIVE AND FEEDING DISORDERS,,,421,"MALNUTRITION, FAILURE TO THRIVE & OTHER NUTRITIONAL DISORDERS",10,"ENDOCRINE, NUTRITIONAL AND METABOLIC DISEASES AND DISORDERS",2,Moderate,Minor,Medical,"Managed Care, Unspecified",Medicaid,Self-Pay,03500,,Y,13677.5,3169.19
New York City,Queens,7003010,001637,New York - Presbyterian/Queens,70 or Older,114,F,Other Race,Spanish/Hispanic,5,Emergency,Hospice - Home,2020,SYM016,OTHER GENERAL SIGNS AND SYMPTOMS,ADM017,ADMINISTRATION OF NUTRITIONAL AND ELECTROLYTIC SUBSTANCES,421,"MALNUTRITION, FAILURE TO THRIVE & OTHER NUTRITIONAL DISORDERS",10,"ENDOCRINE, NUTRITIONAL AND METABOLIC DISEASES AND DISORDERS",3,Major,Major,Medical,Medicare,Medicare,Medicaid,,,Y,37372.97,8986.06
New York City,Queens,7003010,001637,New York - Presbyterian/Queens,70 or Older,113,M,White,Not Span/Hispanic,7,Emergency,Skilled Nursing Home,2020,SYM016,OTHER GENERAL SIGNS AND SYMPTOMS,ADM017,ADMINISTRATION OF NUTRITIONAL AND ELECTROLYTIC SUBSTANCES,421,"MALNUTRITION, FAILURE TO THRIVE & OTHER NUTRITIONAL DISORDERS",10,"ENDOCRINE, NUTRITIONAL AND METABOLIC DISEASES AND DISORDERS",3,Major,Major,Medical,Medicare,Blue Cross/Blue Shield,Medicaid,,,Y,63378.2,14511.71
New York City,Kings,7001037,001320,University Hospital of Brooklyn,0 to 17,112,F,White,Spanish/Hispanic,1,Elective,Home or Self Care,2020,SYM016,OTHER GENERAL SIGNS AND SYMPTOMS,MAM013,MONITORING OF PERIPHERAL NERVES,421,"MALNUTRITION, FAILURE TO THRIVE & OTHER NUTRITIONAL DISORDERS",10,"ENDOCRINE, NUTRITIONAL AND METABOLIC DISEASES AND DISORDERS",1,Minor,Minor,Medical,Medicaid,Medicaid,Self-Pay,,,N,3794,10232.61
New York City,Manhattan,7002053,001463,NYU Langone Hospitals,70 or Older,100,M,Black/African American,Not Span/Hispanic,1,Emergency,Home w/ Home Health Services,2020,END008,MALNUTRITION,,,421,"MALNUTRITION, FAILURE TO THRIVE & OTHER NUTRITIONAL DISORDERS",10,"ENDOCRINE, NUTRITIONAL AND METABOLIC DISEASES AND DISORDERS",3,Major,Major,Medical,Medicare,Medicaid,,,,Y,54212.44,12921.48
New York City,Kings,7001037,001320,University Hospital of Brooklyn,0 to 17,112,F,Black/African American,Not Span/Hispanic,3,Emergency,Home or Self Care,2020,SYM016,OTHER GENERAL SIGNS AND SYMPTOMS,,,421,"MALNUTRITION, FAILURE TO THRIVE & OTHER NUTRITIONAL DISORDERS",10,"ENDOCRINE, NUTRITIONAL AND METABOLIC DISEASES AND DISORDERS",1,Minor,Minor,Medical,Medicaid,Medicaid,Self-Pay,,,Y,13152,31238.16
New York City,Manhattan,7002054,001458,New York-Presbyterian Hospital - New York Weill Cornell Center,0 to 17,114,F,White,Not Span/Hispanic,5,Elective,Home or Self Care,2020,END008,MALNUTRITION,GIS017,GASTROSTOMY,421,"MALNUTRITION, FAILURE TO THRIVE & OTHER NUTRITIONAL DISORDERS",10,"ENDOCRINE, NUTRITIONAL AND METABOLIC DISEASES AND DISORDERS",3,Major,Minor,Medical,Blue Cross/Blue Shield,Private Health Insurance,Self-Pay,,,N,93589.63,38480.34
New York City,Manhattan,7002054,001437,New York-Presbyterian/Lower Manhattan Hospital,70 or Older,100,M,Other Race,Not Span/Hispanic,5,Emergency,Home or Self Care,2020,END008,MALNUTRITION,ADM015,ADMINISTRATION OF ANTIBIOTICS,421,"MALNUTRITION, FAILURE TO THRIVE & OTHER NUTRITIONAL DISORDERS",10,"ENDOCRINE, NUTRITIONAL AND METABOLIC DISEASES AND DISORDERS",3,Major,Major,Medical,Medicare,Medicare,Self-Pay,,,Y,125939.26,58561.93
New York City,Kings,7001021,001306,New York - Presbyterian Brooklyn Methodist Hospital,70 or Older,112,F,Other Race,Spanish/Hispanic,13,Emergency,Skilled Nursing Home,2020,SYM016,OTHER GENERAL SIGNS AND SYMPTOMS,GIS001,ESOPHAGOGASTRODUODENOSCOPY (EGD) WITH BIOPSY,421,"MALNUTRITION, FAILURE TO THRIVE & OTHER NUTRITIONAL DISORDERS",10,"ENDOCRINE, NUTRITIONAL AND METABOLIC DISEASES AND DISORDERS",3,Major,Major,Medical,Medicare,Medicare,Self-Pay,,,Y,94790.18,26619.92
New York City,Manhattan,7002054,001458,New York-Presbyterian Hospital - New York Weill Cornell Center,70 or Older,100,M,White,Not Span/Hispanic,4,Elective,Home or Self Care,2020,SYM016,OTHER GENERAL SIGNS AND SYMPTOMS,,,421,"MALNUTRITION, FAILURE TO THRIVE & OTHER NUTRITIONAL DISORDERS",10,"ENDOCRINE, NUTRITIONAL AND METABOLIC DISEASES AND DISORDERS",2,Moderate,Moderate,Medical,Medicare,Private Health Insurance,Self-Pay,,,N,69544.03,34339.1
New York City,Manhattan,7002054,001458,New York-Presbyterian Hospital - New York Weill Cornell Center,70 or Older,100,F,White,Not Span/Hispanic,2,Emergency,Skilled Nursing Home,2020,SYM016,OTHER GENERAL SIGNS AND SYMPTOMS,GIS001,ESOPHAGOGASTRODUODENOSCOPY (EGD) WITH BIOPSY,421,"MALNUTRITION, FAILURE TO THRIVE & OTHER NUTRITIONAL DISORDERS",10,"ENDOCRINE, NUTRITIONAL AND METABOLIC DISEASES AND DISORDERS",3,Major,Moderate,Medical,Medicare,Medicaid,Self-Pay,,,N,35872.74,8581.8
New York City,Kings,7001021,001306,New York - Presbyterian Brooklyn Methodist Hospital,70 or Older,112,M,White,Not Span/Hispanic,1,Emergency,Skilled Nursing Home,2020,SYM016,OTHER GENERAL SIGNS AND SYMPTOMS,,,421,"MALNUTRITION, FAILURE TO THRIVE & OTHER NUTRITIONAL DISORDERS",10,"ENDOCRINE, NUTRITIONAL AND METABOLIC DISEASES AND DISORDERS",2,Moderate,Moderate,Medical,Medicare,Medicare,Self-Pay,,,Y,8697.6,2155.04
New York City,Manhattan,7002054,001458,New York-Presbyterian Hospital - New York Weill Cornell Center,50 to 69,114,M,Black/African American,Not Span/Hispanic,2,Emergency,Home w/ Home Health Services,2020,SYM016,OTHER GENERAL SIGNS AND SYMPTOMS,ADM021,"ADMINISTRATION OF THERAPEUTIC SUBSTANCES, NEC",421,"MALNUTRITION, FAILURE TO THRIVE & OTHER NUTRITIONAL DISORDERS",10,"ENDOCRINE, NUTRITIONAL AND METABOLIC DISEASES AND DISORDERS",3,Major,Major,Medical,Blue Cross/Blue Shield,Medicare,Medicaid,,,Y,34614.03,8144.84
New York City,Manhattan,7002054,001458,New York-Presbyterian Hospital - New York Weill Cornell Center,70 or Older,100,M,Multi-racial,Not Span/Hispanic,6,Emergency,Skilled Nursing Home,2020,SYM016,OTHER GENERAL SIGNS AND SYMPTOMS,,,421,"MALNUTRITION, FAILURE TO THRIVE & OTHER NUTRITIONAL DISORDERS",10,"ENDOCRINE, NUTRITIONAL AND METABOLIC DISEASES AND DISORDERS",2,Moderate,Moderate,Medical,Medicare,Self-Pay,,,,Y,78905.29,17190.38
New York City,Manhattan,7002054,001458,New York-Presbyterian Hospital - New York Weill Cornell Center,50 to 69,100,F,Other Race,Not Span/Hispanic,8,Emergency,Home w/ Home Health Services,2020,SYM016,OTHER GENERAL SIGNS AND SYMPTOMS,RAD004,"RADIATION THERAPY, NEC",421,"MALNUTRITION, FAILURE TO THRIVE & OTHER NUTRITIONAL DISORDERS",10,"ENDOCRINE, NUTRITIONAL AND METABOLIC DISEASES AND DISORDERS",2,Moderate,Major,Medical,Blue Cross/Blue Shield,Self-Pay,,,,Y,148158.13,30265.04
New York City,Kings,7001021,001306,New York - Presbyterian Brooklyn Methodist Hospital,70 or Older,112,F,Black/African American,Not Span/Hispanic,4,Emergency,Home w/ Home Health Services,2020,SYM016,OTHER GENERAL SIGNS AND SYMPTOMS,,,421,"MALNUTRITION, FAILURE TO THRIVE & OTHER NUTRITIONAL DISORDERS",10,"ENDOCRINE, NUTRITIONAL AND METABOLIC DISEASES AND DISORDERS",3,Major,Moderate,Medical,Medicare,Medicare,Self-Pay,,,Y,36355.56,7533.26
New York City,Manhattan,7002054,001458,New York-Presbyterian Hospital - New York Weill Cornell Center,70 or Older,112,F,White,Not Span/Hispanic,7,Emergency,Skilled Nursing Home,2020,SYM016,OTHER GENERAL SIGNS AND SYMPTOMS,URN005,NEPHROSTOMY AND URETEROSTOMY PROCEDURES (INCLUDING STENTS),421,"MALNUTRITION, FAILURE TO THRIVE & OTHER NUTRITIONAL DISORDERS",10,"ENDOCRINE, NUTRITIONAL AND METABOLIC DISEASES AND DISORDERS",2,Moderate,Major,Medical,Medicare,Private Health Insurance,Self-Pay,,,Y,124696.92,29119.73
New York City,Kings,7001021,001306,New York - Presbyterian Brooklyn Methodist Hospital,70 or Older,112,M,White,Not Span/Hispanic,7,Emergency,Inpatient Rehabilitation Facility,2020,SYM016,OTHER GENERAL SIGNS AND SYMPTOMS,,,421,"MALNUTRITION, FAILURE TO THRIVE & OTHER NUTRITIONAL DISORDERS",10,"ENDOCRINE, NUTRITIONAL AND METABOLIC DISEASES AND DISORDERS",2,Moderate,Major,Medical,Medicare,Blue Cross/Blue Shield,"Managed Care, Unspecified",,,Y,71927.28,13814.31
Long Island,Nassau,2950002,000528,Nassau University Medical Center,18 to 29,115,M,Other Race,Spanish/Hispanic,1,Elective,Home or Self Care,2020,END009,OBESITY,GIS010,GASTRECTOMY,421,"MALNUTRITION, FAILURE TO THRIVE & OTHER NUTRITIONAL DISORDERS",10,"ENDOCRINE, NUTRITIONAL AND METABOLIC DISEASES AND DISORDERS",1,Minor,Minor,Medical,Medicaid,Medicaid,Self-Pay,,,N,19405.82,12477.55
Long Island,Nassau,2950002,000528,Nassau University Medical Center,0 to 17,115,F,Other Race,Spanish/Hispanic,1,Elective,Home or Self Care,2020,SYM016,OTHER GENERAL SIGNS AND SYMPTOMS,ADM020,"ADMINISTRATION OF DIAGNOSTIC SUBSTANCES, NEC",421,"MALNUTRITION, FAILURE TO THRIVE & OTHER NUTRITIONAL DISORDERS",10,"ENDOCRINE, NUTRITIONAL AND METABOLIC DISEASES AND DISORDERS",2,Moderate,Moderate,Medical,Medicaid,Medicaid,Self-Pay,,,N,7823.1,6276.67
Long Island,Nassau,2950002,000528,Nassau University Medical Center,70 or Older,117,M,White,Not Span/Hispanic,4,Emergency,Skilled Nursing Home,2020,END008,MALNUTRITION,ADM017,ADMINISTRATION OF NUTRITIONAL AND ELECTROLYTIC SUBSTANCES,421,"MALNUTRITION, FAILURE TO THRIVE & OTHER NUTRITIONAL DISORDERS",10,"ENDOCRINE, NUTRITIONAL AND METABOLIC DISEASES AND DISORDERS",3,Major,Moderate,Medical,Medicare,Blue Cross/Blue Shield,Self-Pay,,,N,25587.04,8501.85
New York City,Bronx,7000006,003058,Montefiore Med Center - Jack D Weiler Hosp of A Einstein College Div,70 or Older,104,M,White,Not Span/Hispanic,3,Emergency,Skilled Nursing Home,2020,SYM016,OTHER GENERAL SIGNS AND SYMPTOMS,,,421,"MALNUTRITION, FAILURE TO THRIVE & OTHER NUTRITIONAL DISORDERS",10,"ENDOCRINE, NUTRITIONAL AND METABOLIC DISEASES AND DISORDERS",2,Moderate,Moderate,Medical,Medicare,Private Health Insurance,,,,Y,36724.66,5830.17
Western NY,Erie,1401005,000210,Erie County Medical Center,70 or Older,141,M,White,Not Span/Hispanic,2,Emergency,Home or Self Care,2020,END007,NUTRITIONAL DEFICIENCIES,,,421,"MALNUTRITION, FAILURE TO THRIVE & OTHER NUTRITIONAL DISORDERS",10,"ENDOCRINE, NUTRITIONAL AND METABOLIC DISEASES AND DISORDERS",2,Moderate,Minor,Medical,Blue Cross/Blue Shield,Medicare,,,,Y,12598.15,4831.57
Western NY,Erie,1401005,000210,Erie County Medical Center,70 or Older,142,F,White,Not Span/Hispanic,6,Emergency,Facility w/ Custodial/Supportive Care,2020,END008,MALNUTRITION,,,421,"MALNUTRITION, FAILURE TO THRIVE & OTHER NUTRITIONAL DISORDERS",10,"ENDOCRINE, NUTRITIONAL AND METABOLIC DISEASES AND DISORDERS",2,Moderate,Minor,Medical,Medicare,Medicare,,,,Y,17070.94,10727.32