Hospital Service Area,Hospital County,Operating Certificate Number,Permanent Facility Id,Facility Name,Age Group,Zip Code - 3 digits,Gender,Race,Ethnicity,Length of Stay,Type of Admission,Patient Disposition,Discharge Year,CCS Diagnosis Code,CCS Diagnosis Description,CCS Procedure Code,CCS Procedure Description,APR DRG Code,APR DRG Description,APR MDC Code,APR MDC Description,APR Severity of Illness Code,APR Severity of Illness Description,APR Risk of Mortality,APR Medical Surgical Description,Payment Typology 1,Payment Typology 2,Payment Typology 3,Birth Weight,Abortion Edit Indicator,Emergency Department Indicator,Total Charges,Total Costs
New York City,Manhattan,7002001,001438,Bellevue Hospital Center,70 or Older,113,F,Other Race,Spanish/Hispanic,1,Emergency,Home or Self Care,2020,SYM016,OTHER GENERAL SIGNS AND SYMPTOMS,IMG009,PLAIN RADIOGRAPHY,421,"MALNUTRITION, FAILURE TO THRIVE & OTHER NUTRITIONAL DISORDERS",10,"ENDOCRINE, NUTRITIONAL AND METABOLIC DISEASES AND DISORDERS",2,Moderate,Moderate,Medical,Medicaid,,,,,Y,9937.99,5715.18
New York City,Manhattan,7002001,001438,Bellevue Hospital Center,50 to 69,112,F,Other Race,Spanish/Hispanic,11,Emergency,Home or Self Care,2020,END008,MALNUTRITION,GIS017,GASTROSTOMY,421,"MALNUTRITION, FAILURE TO THRIVE & OTHER NUTRITIONAL DISORDERS",10,"ENDOCRINE, NUTRITIONAL AND METABOLIC DISEASES AND DISORDERS",3,Major,Moderate,Medical,Medicaid,,,,,Y,92606.04,53256.25
New York City,Manhattan,7002001,001438,Bellevue Hospital Center,0 to 17,104,M,Black/African American,Not Span/Hispanic,5,Elective,Home or Self Care,2020,SYM016,OTHER GENERAL SIGNS AND SYMPTOMS,MAM007,ELECTROCARDIOGRAM (ECG),421,"MALNUTRITION, FAILURE TO THRIVE & OTHER NUTRITIONAL DISORDERS",10,"ENDOCRINE, NUTRITIONAL AND METABOLIC DISEASES AND DISORDERS",3,Major,Moderate,Medical,Medicaid,,,,,N,33914.34,19503.59
New York City,Manhattan,7002001,001438,Bellevue Hospital Center,30 to 49,116,F,Other Race,Spanish/Hispanic,1,Emergency,Home or Self Care,2020,END009,OBESITY,ADM017,ADMINISTRATION OF NUTRITIONAL AND ELECTROLYTIC SUBSTANCES,421,"MALNUTRITION, FAILURE TO THRIVE & OTHER NUTRITIONAL DISORDERS",10,"ENDOCRINE, NUTRITIONAL AND METABOLIC DISEASES AND DISORDERS",1,Minor,Minor,Medical,Medicaid,,,,,Y,9025.45,5190.39
New York City,Manhattan,7002001,001438,Bellevue Hospital Center,70 or Older,111,F,Other Race,Spanish/Hispanic,6,Emergency,Home w/ Home Health Services,2020,SYM016,OTHER GENERAL SIGNS AND SYMPTOMS,IMG007,COMPUTERIZED TOMOGRAPHY (CT) WITHOUT CONTRAST,421,"MALNUTRITION, FAILURE TO THRIVE & OTHER NUTRITIONAL DISORDERS",10,"ENDOCRINE, NUTRITIONAL AND METABOLIC DISEASES AND DISORDERS",3,Major,Major,Medical,Medicaid,,,,,Y,42278.61,24313.75
New York City,Manhattan,7002001,001438,Bellevue Hospital Center,70 or Older,104,M,Black/African American,Not Span/Hispanic,13,Emergency,Home or Self Care,2020,END008,MALNUTRITION,MST003,"SUBCUTANEOUS TISSUE, FASCIA, AND MUSCLE BIOPSY",421,"MALNUTRITION, FAILURE TO THRIVE & OTHER NUTRITIONAL DISORDERS",10,"ENDOCRINE, NUTRITIONAL AND METABOLIC DISEASES AND DISORDERS",3,Major,Major,Medical,Medicare,Medicaid,,,,Y,82925.62,47689.2
New York City,Manhattan,7002001,001438,Bellevue Hospital Center,0 to 17,100,M,Other Race,Unknown,5,Elective,Home or Self Care,2020,SYM016,OTHER GENERAL SIGNS AND SYMPTOMS,IMG009,PLAIN RADIOGRAPHY,421,"MALNUTRITION, FAILURE TO THRIVE & OTHER NUTRITIONAL DISORDERS",10,"ENDOCRINE, NUTRITIONAL AND METABOLIC DISEASES AND DISORDERS",2,Moderate,Moderate,Medical,Medicaid,,,,,N,35462.09,20393.68
New York City,Manhattan,7002001,001438,Bellevue Hospital Center,0 to 17,112,M,Black/African American,Not Span/Hispanic,1,Urgent,Home or Self Care,2020,SYM016,OTHER GENERAL SIGNS AND SYMPTOMS,ADM010,VACCINATIONS,421,"MALNUTRITION, FAILURE TO THRIVE & OTHER NUTRITIONAL DISORDERS",10,"ENDOCRINE, NUTRITIONAL AND METABOLIC DISEASES AND DISORDERS",1,Minor,Minor,Medical,Medicaid,,,,,N,7390.87,4250.37
New York City,Manhattan,7002001,001438,Bellevue Hospital Center,50 to 69,112,F,Other Race,Not Span/Hispanic,13,Elective,Home or Self Care,2020,SYM016,OTHER GENERAL SIGNS AND SYMPTOMS,SKB008,SKIN EXCISION AND DEBRIDEMENT,421,"MALNUTRITION, FAILURE TO THRIVE & OTHER NUTRITIONAL DISORDERS",10,"ENDOCRINE, NUTRITIONAL AND METABOLIC DISEASES AND DISORDERS",3,Major,Major,Medical,Medicaid,,,,,N,90349.46,51958.53
New York City,Manhattan,7002001,001438,Bellevue Hospital Center,0 to 17,112,M,Black/African American,Spanish/Hispanic,4,Elective,Home or Self Care,2020,SYM016,OTHER GENERAL SIGNS AND SYMPTOMS,ADM021,"ADMINISTRATION OF THERAPEUTIC SUBSTANCES, NEC",421,"MALNUTRITION, FAILURE TO THRIVE & OTHER NUTRITIONAL DISORDERS",10,"ENDOCRINE, NUTRITIONAL AND METABOLIC DISEASES AND DISORDERS",2,Moderate,Moderate,Medical,Private Health Insurance,Medicaid,,,,N,22767.37,13093.15
New York City,Manhattan,7002001,001438,Bellevue Hospital Center,0 to 17,112,M,Black/African American,Spanish/Hispanic,4,Elective,Home or Self Care,2020,SYM016,OTHER GENERAL SIGNS AND SYMPTOMS,ADM021,"ADMINISTRATION OF THERAPEUTIC SUBSTANCES, NEC",421,"MALNUTRITION, FAILURE TO THRIVE & OTHER NUTRITIONAL DISORDERS",10,"ENDOCRINE, NUTRITIONAL AND METABOLIC DISEASES AND DISORDERS",2,Moderate,Moderate,Medical,Private Health Insurance,Medicaid,,,,N,22790.03,13106.18
New York City,Manhattan,7002001,001438,Bellevue Hospital Center,70 or Older,100,M,Black/African American,Not Span/Hispanic,3,Emergency,Home w/ Home Health Services,2020,SYM016,OTHER GENERAL SIGNS AND SYMPTOMS,CNS002,LUMBAR PUNCTURE,421,"MALNUTRITION, FAILURE TO THRIVE & OTHER NUTRITIONAL DISORDERS",10,"ENDOCRINE, NUTRITIONAL AND METABOLIC DISEASES AND DISORDERS",3,Major,Major,Medical,Medicare,Medicaid,,,,Y,30011.91,17259.37
New York City,Manhattan,7002001,001438,Bellevue Hospital Center,0 to 17,112,M,Black/African American,Spanish/Hispanic,4,Emergency,Home or Self Care,2020,SYM016,OTHER GENERAL SIGNS AND SYMPTOMS,ADM021,"ADMINISTRATION OF THERAPEUTIC SUBSTANCES, NEC",421,"MALNUTRITION, FAILURE TO THRIVE & OTHER NUTRITIONAL DISORDERS",10,"ENDOCRINE, NUTRITIONAL AND METABOLIC DISEASES AND DISORDERS",3,Major,Minor,Medical,Medicaid,,,,,Y,26003.2,14954.02
New York City,Manhattan,7002001,001438,Bellevue Hospital Center,70 or Older,112,M,Black/African American,Not Span/Hispanic,4,Emergency,Skilled Nursing Home,2020,SYM016,OTHER GENERAL SIGNS AND SYMPTOMS,ADM021,"ADMINISTRATION OF THERAPEUTIC SUBSTANCES, NEC",421,"MALNUTRITION, FAILURE TO THRIVE & OTHER NUTRITIONAL DISORDERS",10,"ENDOCRINE, NUTRITIONAL AND METABOLIC DISEASES AND DISORDERS",3,Major,Major,Medical,Medicare,Private Health Insurance,,,,Y,28390.53,16326.94
New York City,Manhattan,7002001,001438,Bellevue Hospital Center,0 to 17,112,F,Other Race,Not Span/Hispanic,4,Urgent,Home or Self Care,2020,SYM016,OTHER GENERAL SIGNS AND SYMPTOMS,ADM021,"ADMINISTRATION OF THERAPEUTIC SUBSTANCES, NEC",421,"MALNUTRITION, FAILURE TO THRIVE & OTHER NUTRITIONAL DISORDERS",10,"ENDOCRINE, NUTRITIONAL AND METABOLIC DISEASES AND DISORDERS",1,Minor,Minor,Medical,Medicaid,,,,,N,23158.62,13318.15
New York City,Manhattan,7002001,001438,Bellevue Hospital Center,50 to 69,100,M,Black/African American,Not Span/Hispanic,16,Emergency,Skilled Nursing Home,2020,SYM016,OTHER GENERAL SIGNS AND SYMPTOMS,IMG007,COMPUTERIZED TOMOGRAPHY (CT) WITHOUT CONTRAST,421,"MALNUTRITION, FAILURE TO THRIVE & OTHER NUTRITIONAL DISORDERS",10,"ENDOCRINE, NUTRITIONAL AND METABOLIC DISEASES AND DISORDERS",3,Major,Moderate,Medical,Medicaid,,,,,Y,111505.3,64124.91
New York City,Manhattan,7002001,001438,Bellevue Hospital Center,50 to 69,104,M,Other Race,Unknown,45,Elective,Skilled Nursing Home,2020,END007,NUTRITIONAL DEFICIENCIES,OTR004,ISOLATION PROCEDURES,421,"MALNUTRITION, FAILURE TO THRIVE & OTHER NUTRITIONAL DISORDERS",10,"ENDOCRINE, NUTRITIONAL AND METABOLIC DISEASES AND DISORDERS",2,Moderate,Moderate,Medical,Medicaid,,,,,N,279533.1,160755.01
New York City,Manhattan,7002001,001438,Bellevue Hospital Center,50 to 69,100,M,Other Race,Unknown,4,Urgent,Short-term Hospital,2020,END008,MALNUTRITION,ADM017,ADMINISTRATION OF NUTRITIONAL AND ELECTROLYTIC SUBSTANCES,421,"MALNUTRITION, FAILURE TO THRIVE & OTHER NUTRITIONAL DISORDERS",10,"ENDOCRINE, NUTRITIONAL AND METABOLIC DISEASES AND DISORDERS",3,Major,Major,Medical,Medicaid,,,,,N,27362.03,15735.47
New York City,Manhattan,7002001,001438,Bellevue Hospital Center,0 to 17,,M,Multi-racial,Spanish/Hispanic,65,Urgent,Short-term Hospital,2020,SYM016,OTHER GENERAL SIGNS AND SYMPTOMS,MAM011,ELECTROENCEPHALOGRAM (EEG),421,"MALNUTRITION, FAILURE TO THRIVE & OTHER NUTRITIONAL DISORDERS",10,"ENDOCRINE, NUTRITIONAL AND METABOLIC DISEASES AND DISORDERS",2,Moderate,Minor,Medical,Medicaid,,,,,N,261878.24,150601.99
New York City,Manhattan,7002001,001438,Bellevue Hospital Center,70 or Older,100,M,Other Race,Spanish/Hispanic,2,Emergency,Home or Self Care,2020,SYM016,OTHER GENERAL SIGNS AND SYMPTOMS,ADM021,"ADMINISTRATION OF THERAPEUTIC SUBSTANCES, NEC",421,"MALNUTRITION, FAILURE TO THRIVE & OTHER NUTRITIONAL DISORDERS",10,"ENDOCRINE, NUTRITIONAL AND METABOLIC DISEASES AND DISORDERS",2,Moderate,Moderate,Medical,Medicare,Medicaid,,,,Y,14919.88,8580.18
New York City,Manhattan,7002001,001438,Bellevue Hospital Center,30 to 49,100,F,White,Not Span/Hispanic,2,Emergency,Home or Self Care,2020,SYM016,OTHER GENERAL SIGNS AND SYMPTOMS,ADM021,"ADMINISTRATION OF THERAPEUTIC SUBSTANCES, NEC",421,"MALNUTRITION, FAILURE TO THRIVE & OTHER NUTRITIONAL DISORDERS",10,"ENDOCRINE, NUTRITIONAL AND METABOLIC DISEASES AND DISORDERS",2,Moderate,Minor,Medical,Medicaid,,,,,Y,29013.86,16685.41
New York City,Manhattan,7002001,001438,Bellevue Hospital Center,70 or Older,113,F,Other Race,Not Span/Hispanic,8,Emergency,Home or Self Care,2020,SYM016,OTHER GENERAL SIGNS AND SYMPTOMS,ADM015,ADMINISTRATION OF ANTIBIOTICS,421,"MALNUTRITION, FAILURE TO THRIVE & OTHER NUTRITIONAL DISORDERS",10,"ENDOCRINE, NUTRITIONAL AND METABOLIC DISEASES AND DISORDERS",4,Extreme,Major,Medical,Medicaid,,,,,Y,58558.4,33676
New York City,Manhattan,7002001,001438,Bellevue Hospital Center,0 to 17,104,M,Black/African American,Not Span/Hispanic,3,Emergency,Home w/ Home Health Services,2020,END008,MALNUTRITION,MAM011,ELECTROENCEPHALOGRAM (EEG),421,"MALNUTRITION, FAILURE TO THRIVE & OTHER NUTRITIONAL DISORDERS",10,"ENDOCRINE, NUTRITIONAL AND METABOLIC DISEASES AND DISORDERS",3,Major,Moderate,Medical,Medicaid,,,,,Y,24291.3,13969.54
New York City,Manhattan,7002001,001438,Bellevue Hospital Center,50 to 69,100,M,Other Race,Not Span/Hispanic,1,Emergency,Home or Self Care,2020,SYM016,OTHER GENERAL SIGNS AND SYMPTOMS,ADM021,"ADMINISTRATION OF THERAPEUTIC SUBSTANCES, NEC",421,"MALNUTRITION, FAILURE TO THRIVE & OTHER NUTRITIONAL DISORDERS",10,"ENDOCRINE, NUTRITIONAL AND METABOLIC DISEASES AND DISORDERS",2,Moderate,Moderate,Medical,Medicaid,,,,,Y,9776.33,5622.21
New York City,Manhattan,7002001,001438,Bellevue Hospital Center,70 or Older,104,F,Multi-racial,Not Span/Hispanic,7,Emergency,Inpatient Rehabilitation Facility,2020,SYM016,OTHER GENERAL SIGNS AND SYMPTOMS,ADM017,ADMINISTRATION OF NUTRITIONAL AND ELECTROLYTIC SUBSTANCES,421,"MALNUTRITION, FAILURE TO THRIVE & OTHER NUTRITIONAL DISORDERS",10,"ENDOCRINE, NUTRITIONAL AND METABOLIC DISEASES AND DISORDERS",4,Extreme,Major,Medical,Medicare,,,,,Y,47720.75,27443.44
New York City,Manhattan,7002001,001438,Bellevue Hospital Center,50 to 69,112,F,Black/African American,Not Span/Hispanic,6,Emergency,Home or Self Care,2020,SYM016,OTHER GENERAL SIGNS AND SYMPTOMS,ADM017,ADMINISTRATION OF NUTRITIONAL AND ELECTROLYTIC SUBSTANCES,421,"MALNUTRITION, FAILURE TO THRIVE & OTHER NUTRITIONAL DISORDERS",10,"ENDOCRINE, NUTRITIONAL AND METABOLIC DISEASES AND DISORDERS",3,Major,Moderate,Medical,Medicare,Medicaid,,,,Y,47500.06,27316.52
New York City,Manhattan,7002001,001438,Bellevue Hospital Center,0 to 17,111,F,Multi-racial,Not Span/Hispanic,3,Emergency,Home or Self Care,2020,SYM016,OTHER GENERAL SIGNS AND SYMPTOMS,ADM015,ADMINISTRATION OF ANTIBIOTICS,421,"MALNUTRITION, FAILURE TO THRIVE & OTHER NUTRITIONAL DISORDERS",10,"ENDOCRINE, NUTRITIONAL AND METABOLIC DISEASES AND DISORDERS",2,Moderate,Minor,Medical,Medicaid,,,,,Y,20317.79,11684.44
New York City,Manhattan,7002001,001438,Bellevue Hospital Center,50 to 69,100,M,Other Race,Unknown,2,Elective,Another Type Not Listed,2020,END008,MALNUTRITION,OTR004,ISOLATION PROCEDURES,421,"MALNUTRITION, FAILURE TO THRIVE & OTHER NUTRITIONAL DISORDERS",10,"ENDOCRINE, NUTRITIONAL AND METABOLIC DISEASES AND DISORDERS",4,Extreme,Extreme,Medical,Medicaid,,,,,N,13106.71,7537.46
New York City,Manhattan,7002001,001438,Bellevue Hospital Center,30 to 49,112,M,Black/African American,Not Span/Hispanic,8,Emergency,Home or Self Care,2020,END007,NUTRITIONAL DEFICIENCIES,ADM021,"ADMINISTRATION OF THERAPEUTIC SUBSTANCES, NEC",421,"MALNUTRITION, FAILURE TO THRIVE & OTHER NUTRITIONAL DISORDERS",10,"ENDOCRINE, NUTRITIONAL AND METABOLIC DISEASES AND DISORDERS",2,Moderate,Moderate,Medical,Medicaid,,,,,Y,61871.63,35581.38
New York City,Manhattan,7002001,001438,Bellevue Hospital Center,50 to 69,100,M,White,Not Span/Hispanic,7,Elective,Home or Self Care,2020,END007,NUTRITIONAL DEFICIENCIES,ADM021,"ADMINISTRATION OF THERAPEUTIC SUBSTANCES, NEC",421,"MALNUTRITION, FAILURE TO THRIVE & OTHER NUTRITIONAL DISORDERS",10,"ENDOCRINE, NUTRITIONAL AND METABOLIC DISEASES AND DISORDERS",3,Major,Minor,Medical,Medicare,,,,,N,54442.74,31309.15
New York City,Manhattan,7002001,001438,Bellevue Hospital Center,70 or Older,100,M,Other Race,Spanish/Hispanic,7,Emergency,Skilled Nursing Home,2020,SYM016,OTHER GENERAL SIGNS AND SYMPTOMS,ADM017,ADMINISTRATION OF NUTRITIONAL AND ELECTROLYTIC SUBSTANCES,421,"MALNUTRITION, FAILURE TO THRIVE & OTHER NUTRITIONAL DISORDERS",10,"ENDOCRINE, NUTRITIONAL AND METABOLIC DISEASES AND DISORDERS",3,Major,Major,Medical,Medicare,,,,,Y,55352.39,31832.27
New York City,Manhattan,7002001,001438,Bellevue Hospital Center,30 to 49,114,F,Black/African American,Not Span/Hispanic,1,Urgent,Another Type Not Listed,2020,END009,OBESITY,ADM021,"ADMINISTRATION OF THERAPEUTIC SUBSTANCES, NEC",421,"MALNUTRITION, FAILURE TO THRIVE & OTHER NUTRITIONAL DISORDERS",10,"ENDOCRINE, NUTRITIONAL AND METABOLIC DISEASES AND DISORDERS",1,Minor,Minor,Medical,Self-Pay,,,,,N,6665.17,3833.03
New York City,Manhattan,7002001,001438,Bellevue Hospital Center,0 to 17,112,M,Black/African American,Spanish/Hispanic,4,Emergency,Home or Self Care,2020,SYM016,OTHER GENERAL SIGNS AND SYMPTOMS,IMG008,ULTRASONOGRAPHY,421,"MALNUTRITION, FAILURE TO THRIVE & OTHER NUTRITIONAL DISORDERS",10,"ENDOCRINE, NUTRITIONAL AND METABOLIC DISEASES AND DISORDERS",3,Major,Minor,Medical,Medicaid,,,,,Y,27777.22,15974.23
New York City,Manhattan,7002001,001438,Bellevue Hospital Center,30 to 49,OOS,F,White,Not Span/Hispanic,2,Emergency,Home or Self Care,2020,END008,MALNUTRITION,ADM015,ADMINISTRATION OF ANTIBIOTICS,421,"MALNUTRITION, FAILURE TO THRIVE & OTHER NUTRITIONAL DISORDERS",10,"ENDOCRINE, NUTRITIONAL AND METABOLIC DISEASES AND DISORDERS",3,Major,Major,Medical,Medicaid,,,,,Y,19991.43,11496.75
New York City,Manhattan,7002001,001438,Bellevue Hospital Center,18 to 29,112,F,Other Race,Unknown,15,Elective,Home or Self Care,2020,END008,MALNUTRITION,GIS004,GI SYSTEM ENDOSCOPY WITHOUT BIOPSY (DIAGNOSTIC),421,"MALNUTRITION, FAILURE TO THRIVE & OTHER NUTRITIONAL DISORDERS",10,"ENDOCRINE, NUTRITIONAL AND METABOLIC DISEASES AND DISORDERS",3,Major,Moderate,Medical,Medicaid,,,,,Y,109361.97,62892.32
New York City,Manhattan,7002001,001438,Bellevue Hospital Center,70 or Older,104,F,Other Race,Spanish/Hispanic,1,Emergency,Home or Self Care,2020,SYM016,OTHER GENERAL SIGNS AND SYMPTOMS,ADM021,"ADMINISTRATION OF THERAPEUTIC SUBSTANCES, NEC",421,"MALNUTRITION, FAILURE TO THRIVE & OTHER NUTRITIONAL DISORDERS",10,"ENDOCRINE, NUTRITIONAL AND METABOLIC DISEASES AND DISORDERS",1,Minor,Moderate,Medical,Medicaid,,,,,Y,10013.65,5758.69
New York City,Manhattan,7002001,001438,Bellevue Hospital Center,50 to 69,111,M,Other Race,Not Span/Hispanic,4,Emergency,Home or Self Care,2020,SYM016,OTHER GENERAL SIGNS AND SYMPTOMS,IMG008,ULTRASONOGRAPHY,421,"MALNUTRITION, FAILURE TO THRIVE & OTHER NUTRITIONAL DISORDERS",10,"ENDOCRINE, NUTRITIONAL AND METABOLIC DISEASES AND DISORDERS",3,Major,Major,Medical,Medicaid,,,,,Y,29782.01,17127.16
New York City,Manhattan,7002001,001438,Bellevue Hospital Center,50 to 69,104,M,Other Race,Spanish/Hispanic,13,Emergency,Skilled Nursing Home,2020,SYM016,OTHER GENERAL SIGNS AND SYMPTOMS,ADM021,"ADMINISTRATION OF THERAPEUTIC SUBSTANCES, NEC",421,"MALNUTRITION, FAILURE TO THRIVE & OTHER NUTRITIONAL DISORDERS",10,"ENDOCRINE, NUTRITIONAL AND METABOLIC DISEASES AND DISORDERS",3,Major,Major,Medical,Medicare,Medicaid,,,,Y,88978.87,51170.32
New York City,Manhattan,7002001,001438,Bellevue Hospital Center,70 or Older,104,M,Other Race,Spanish/Hispanic,10,Emergency,Skilled Nursing Home,2020,END007,NUTRITIONAL DEFICIENCIES,IMG007,COMPUTERIZED TOMOGRAPHY (CT) WITHOUT CONTRAST,421,"MALNUTRITION, FAILURE TO THRIVE & OTHER NUTRITIONAL DISORDERS",10,"ENDOCRINE, NUTRITIONAL AND METABOLIC DISEASES AND DISORDERS",2,Moderate,Moderate,Medical,Medicare,Medicaid,,,,Y,71262.14,40981.72
New York City,Manhattan,7002001,001438,Bellevue Hospital Center,50 to 69,104,M,White,Not Span/Hispanic,2,Emergency,Left Against Medical Advice,2020,END007,NUTRITIONAL DEFICIENCIES,ADM021,"ADMINISTRATION OF THERAPEUTIC SUBSTANCES, NEC",421,"MALNUTRITION, FAILURE TO THRIVE & OTHER NUTRITIONAL DISORDERS",10,"ENDOCRINE, NUTRITIONAL AND METABOLIC DISEASES AND DISORDERS",2,Moderate,Minor,Medical,Self-Pay,,,,,Y,19098.53,10983.26
New York City,Manhattan,7002001,001438,Bellevue Hospital Center,50 to 69,100,M,White,Not Span/Hispanic,1,Emergency,Left Against Medical Advice,2020,SYM016,OTHER GENERAL SIGNS AND SYMPTOMS,,,421,"MALNUTRITION, FAILURE TO THRIVE & OTHER NUTRITIONAL DISORDERS",10,"ENDOCRINE, NUTRITIONAL AND METABOLIC DISEASES AND DISORDERS",2,Moderate,Minor,Medical,Medicare,Medicaid,,,,Y,14128.98,8125.35
New York City,Manhattan,7002001,001438,Bellevue Hospital Center,70 or Older,100,M,Other Race,Unknown,8,Emergency,Skilled Nursing Home,2020,END007,NUTRITIONAL DEFICIENCIES,ADM021,"ADMINISTRATION OF THERAPEUTIC SUBSTANCES, NEC",421,"MALNUTRITION, FAILURE TO THRIVE & OTHER NUTRITIONAL DISORDERS",10,"ENDOCRINE, NUTRITIONAL AND METABOLIC DISEASES AND DISORDERS",4,Extreme,Extreme,Medical,Medicare,Medicaid,,,,Y,75783.24,43581.73
New York City,Manhattan,7002001,001438,Bellevue Hospital Center,0 to 17,112,F,Other Race,Spanish/Hispanic,32,Elective,Another Type Not Listed,2020,END008,MALNUTRITION,ADM021,"ADMINISTRATION OF THERAPEUTIC SUBSTANCES, NEC",421,"MALNUTRITION, FAILURE TO THRIVE & OTHER NUTRITIONAL DISORDERS",10,"ENDOCRINE, NUTRITIONAL AND METABOLIC DISEASES AND DISORDERS",3,Major,Moderate,Medical,Medicaid,,,,,N,190020.23,109277.59
New York City,Manhattan,7002001,001438,Bellevue Hospital Center,50 to 69,100,M,White,Not Span/Hispanic,1,Emergency,Home or Self Care,2020,END007,NUTRITIONAL DEFICIENCIES,ADM021,"ADMINISTRATION OF THERAPEUTIC SUBSTANCES, NEC",421,"MALNUTRITION, FAILURE TO THRIVE & OTHER NUTRITIONAL DISORDERS",10,"ENDOCRINE, NUTRITIONAL AND METABOLIC DISEASES AND DISORDERS",2,Moderate,Minor,Medical,Medicaid,,,,,Y,12991.87,7471.42
New York City,Manhattan,7002001,001438,Bellevue Hospital Center,50 to 69,100,F,Other Race,Spanish/Hispanic,2,Emergency,Home w/ Home Health Services,2020,END008,MALNUTRITION,IMG007,COMPUTERIZED TOMOGRAPHY (CT) WITHOUT CONTRAST,421,"MALNUTRITION, FAILURE TO THRIVE & OTHER NUTRITIONAL DISORDERS",10,"ENDOCRINE, NUTRITIONAL AND METABOLIC DISEASES AND DISORDERS",3,Major,Moderate,Medical,Medicare,Medicaid,,,,Y,17597.1,10119.81
New York City,Manhattan,7002001,001438,Bellevue Hospital Center,50 to 69,112,F,Other Race,Spanish/Hispanic,14,Emergency,Left Against Medical Advice,2020,END008,MALNUTRITION,CAR024,VENOUS AND ARTERIAL CATHETER PLACEMENT,421,"MALNUTRITION, FAILURE TO THRIVE & OTHER NUTRITIONAL DISORDERS",10,"ENDOCRINE, NUTRITIONAL AND METABOLIC DISEASES AND DISORDERS",3,Major,Major,Medical,Medicaid,,,,,Y,109023.75,62697.81
New York City,Manhattan,7002001,001438,Bellevue Hospital Center,30 to 49,100,F,Other Race,Unknown,12,Emergency,Home or Self Care,2020,END008,MALNUTRITION,IMG006,COMPUTERIZED TOMOGRAPHY (CT) WITH CONTRAST,421,"MALNUTRITION, FAILURE TO THRIVE & OTHER NUTRITIONAL DISORDERS",10,"ENDOCRINE, NUTRITIONAL AND METABOLIC DISEASES AND DISORDERS",3,Major,Moderate,Medical,Private Health Insurance,,,,,Y,94522.32,54358.27
New York City,Manhattan,7002001,001438,Bellevue Hospital Center,50 to 69,114,F,Black/African American,Not Span/Hispanic,52,Urgent,Expired,2020,END008,MALNUTRITION,SKB001,SKIN BIOPSY AND DIAGNOSTIC DRAINAGE,421,"MALNUTRITION, FAILURE TO THRIVE & OTHER NUTRITIONAL DISORDERS",10,"ENDOCRINE, NUTRITIONAL AND METABOLIC DISEASES AND DISORDERS",4,Extreme,Extreme,Medical,Medicaid,,,,,N,482090.72,277242.66
New York City,Manhattan,7002001,001438,Bellevue Hospital Center,50 to 69,112,F,Black/African American,Unknown,29,Urgent,Expired,2020,SYM016,OTHER GENERAL SIGNS AND SYMPTOMS,CNS002,LUMBAR PUNCTURE,421,"MALNUTRITION, FAILURE TO THRIVE & OTHER NUTRITIONAL DISORDERS",10,"ENDOCRINE, NUTRITIONAL AND METABOLIC DISEASES AND DISORDERS",4,Extreme,Extreme,Medical,Medicare,Medicaid,,,,N,389133.08,223784.21
New York City,Manhattan,7002001,001438,Bellevue Hospital Center,50 to 69,100,M,White,Not Span/Hispanic,53,Emergency,Home or Self Care,2020,END007,NUTRITIONAL DEFICIENCIES,MAM013,MONITORING OF PERIPHERAL NERVES,421,"MALNUTRITION, FAILURE TO THRIVE & OTHER NUTRITIONAL DISORDERS",10,"ENDOCRINE, NUTRITIONAL AND METABOLIC DISEASES AND DISORDERS",3,Major,Moderate,Medical,Medicaid,,,,,Y,362571.76,208509.22
New York City,Manhattan,7002001,001438,Bellevue Hospital Center,50 to 69,100,M,Other Race,Spanish/Hispanic,97,Emergency,Expired,2020,SYM016,OTHER GENERAL SIGNS AND SYMPTOMS,ESA003,MECHANICAL VENTILATION,421,"MALNUTRITION, FAILURE TO THRIVE & OTHER NUTRITIONAL DISORDERS",10,"ENDOCRINE, NUTRITIONAL AND METABOLIC DISEASES AND DISORDERS",4,Extreme,Extreme,Medical,Medicaid,,,,,Y,703688.05,404679.74
New York City,Manhattan,7002001,001438,Bellevue Hospital Center,50 to 69,113,M,Other Race,Spanish/Hispanic,62,Emergency,Home or Self Care,2020,END008,MALNUTRITION,CAR024,VENOUS AND ARTERIAL CATHETER PLACEMENT,421,"MALNUTRITION, FAILURE TO THRIVE & OTHER NUTRITIONAL DISORDERS",10,"ENDOCRINE, NUTRITIONAL AND METABOLIC DISEASES AND DISORDERS",4,Extreme,Extreme,Medical,Medicaid,,,,,Y,459352.68,264166.38
New York City,Manhattan,7002001,001438,Bellevue Hospital Center,18 to 29,113,M,Multi-racial,Not Span/Hispanic,17,Emergency,Court/Law Enforcement,2020,END008,MALNUTRITION,ADM021,"ADMINISTRATION OF THERAPEUTIC SUBSTANCES, NEC",421,"MALNUTRITION, FAILURE TO THRIVE & OTHER NUTRITIONAL DISORDERS",10,"ENDOCRINE, NUTRITIONAL AND METABOLIC DISEASES AND DISORDERS",2,Moderate,Moderate,Medical,Medicaid,,,,,Y,114771.73,66003.39
New York City,Manhattan,7002001,001438,Bellevue Hospital Center,0 to 17,112,F,Other Race,Spanish/Hispanic,56,Urgent,Skilled Nursing Home,2020,PNL012,NEONATAL DIGESTIVE AND FEEDING DISORDERS,ADM017,ADMINISTRATION OF NUTRITIONAL AND ELECTROLYTIC SUBSTANCES,421,"MALNUTRITION, FAILURE TO THRIVE & OTHER NUTRITIONAL DISORDERS",10,"ENDOCRINE, NUTRITIONAL AND METABOLIC DISEASES AND DISORDERS",4,Extreme,Extreme,Medical,Medicaid,,,03200,,N,531858.25,305863.17
New York City,Manhattan,7002001,001438,Bellevue Hospital Center,50 to 69,100,F,Black/African American,Not Span/Hispanic,45,Emergency,Home or Self Care,2020,END007,NUTRITIONAL DEFICIENCIES,CNS002,LUMBAR PUNCTURE,421,"MALNUTRITION, FAILURE TO THRIVE & OTHER NUTRITIONAL DISORDERS",10,"ENDOCRINE, NUTRITIONAL AND METABOLIC DISEASES AND DISORDERS",2,Moderate,Major,Medical,Private Health Insurance,,,,,Y,320200.66,184142.28
