Hospital Service Area,Hospital County,Operating Certificate Number,Permanent Facility Id,Facility Name,Age Group,Zip Code - 3 digits,Gender,Race,Ethnicity,Length of Stay,Type of Admission,Patient Disposition,Discharge Year,CCS Diagnosis Code,CCS Diagnosis Description,CCS Procedure Code,CCS Procedure Description,APR DRG Code,APR DRG Description,APR MDC Code,APR MDC Description,APR Severity of Illness Code,APR Severity of Illness Description,APR Risk of Mortality,APR Medical Surgical Description,Payment Typology 1,Payment Typology 2,Payment Typology 3,Birth Weight,Abortion Edit Indicator,Emergency Department Indicator,Total Charges,Total Costs
New York City,Kings,7001020,001305,Maimonides Medical Center,70 or Older,112,F,Other Race,Not Span/Hispanic,8,Emergency,Skilled Nursing Home,2018,END011,FLUID AND ELECTROLYTE DISORDERS,,,422,HYPOVOLEMIA & RELATED ELECTROLYTE DISORDERS,10,"ENDOCRINE, NUTRITIONAL AND METABOLIC DISEASES AND DISORDERS",2,Moderate,Major,Medical,Medicare,Medicaid,Self-Pay,,,true,50278.09,14496.37
Central NY,Onondaga,3301007,000635,University Hospital SUNY Health Science Center,0 to 17,137,F,White,Not Span/Hispanic,5,Emergency,Home or Self Care,2018,END011,FLUID AND ELECTROLYTE DISORDERS,,,422,HYPOVOLEMIA & RELATED ELECTROLYTE DISORDERS,10,"ENDOCRINE, NUTRITIONAL AND METABOLIC DISEASES AND DISORDERS",1,Minor,Minor,Medical,Medicaid,,,,,true,24257.4,7007.22
Long Island,Suffolk,5157003,000943,St Catherine of Siena Hospital,70 or Older,117,F,White,Not Span/Hispanic,2,Emergency,Home or Self Care,2018,END011,FLUID AND ELECTROLYTE DISORDERS,,,422,HYPOVOLEMIA & RELATED ELECTROLYTE DISORDERS,10,"ENDOCRINE, NUTRITIONAL AND METABOLIC DISEASES AND DISORDERS",2,Moderate,Moderate,Medical,Medicare,Blue Cross/Blue Shield,,,,true,21949,4653.84
New York City,Manhattan,7002054,001464,New York-Presbyterian Hospital - Columbia Presbyterian Center,0 to 17,100,M,Multi-racial,Multi-ethnic,4,Emergency,Home or Self Care,2018,END011,FLUID AND ELECTROLYTE DISORDERS,ADM017,ADMINISTRATION OF NUTRITIONAL AND ELECTROLYTIC SUBSTANCES,422,HYPOVOLEMIA & RELATED ELECTROLYTE DISORDERS,10,"ENDOCRINE, NUTRITIONAL AND METABOLIC DISEASES AND DISORDERS",2,Moderate,Minor,Medical,Medicaid,Medicaid,Self-Pay,,,true,47318.63,11521.17
New York City,Kings,7001020,001305,Maimonides Medical Center,0 to 17,112,F,White,Not Span/Hispanic,3,Emergency,Home or Self Care,2018,END011,FLUID AND ELECTROLYTE DISORDERS,,,422,HYPOVOLEMIA & RELATED ELECTROLYTE DISORDERS,10,"ENDOCRINE, NUTRITIONAL AND METABOLIC DISEASES AND DISORDERS",3,Major,Minor,Medical,Medicaid,Medicaid,Self-Pay,,,false,16823.02,8954.19
New York City,Kings,7001021,001306,New York - Presbyterian Brooklyn Methodist Hospital,70 or Older,115,F,Other Race,Not Span/Hispanic,4,Emergency,Inpatient Rehabilitation Facility,2018,END011,FLUID AND ELECTROLYTE DISORDERS,,,422,HYPOVOLEMIA & RELATED ELECTROLYTE DISORDERS,10,"ENDOCRINE, NUTRITIONAL AND METABOLIC DISEASES AND DISORDERS",2,Moderate,Moderate,Medical,Medicare,Private Health Insurance,Self-Pay,,,true,43824.88,10794.67
Finger Lakes,Monroe,2701003,000411,Rochester General Hospital,70 or Older,146,F,White,Not Span/Hispanic,4,Emergency,Home or Self Care,2018,END011,FLUID AND ELECTROLYTE DISORDERS,,,422,HYPOVOLEMIA & RELATED ELECTROLYTE DISORDERS,10,"ENDOCRINE, NUTRITIONAL AND METABOLIC DISEASES AND DISORDERS",2,Moderate,Moderate,Medical,Medicare,,,,,true,12160.8,5656.18
Long Island,Suffolk,5153000,000913,Huntington Hospital,70 or Older,117,F,White,Not Span/Hispanic,6,Emergency,Home or Self Care,2018,END011,FLUID AND ELECTROLYTE DISORDERS,,,422,HYPOVOLEMIA & RELATED ELECTROLYTE DISORDERS,10,"ENDOCRINE, NUTRITIONAL AND METABOLIC DISEASES AND DISORDERS",3,Major,Major,Medical,Medicare,Blue Cross/Blue Shield,,,,true,56966.22,12689.4
Finger Lakes,Monroe,2701003,000411,Rochester General Hospital,70 or Older,146,F,White,Not Span/Hispanic,6,Emergency,Hospice - Medical Facility,2018,END011,FLUID AND ELECTROLYTE DISORDERS,,,422,HYPOVOLEMIA & RELATED ELECTROLYTE DISORDERS,10,"ENDOCRINE, NUTRITIONAL AND METABOLIC DISEASES AND DISORDERS",3,Major,Extreme,Medical,Medicare,,,,,true,16906.48,7184.35
New York City,Queens,7003010,001637,New York - Presbyterian/Queens,0 to 17,113,M,Other Race,Spanish/Hispanic,1,Emergency,Home or Self Care,2018,END011,FLUID AND ELECTROLYTE DISORDERS,ADM017,ADMINISTRATION OF NUTRITIONAL AND ELECTROLYTIC SUBSTANCES,422,HYPOVOLEMIA & RELATED ELECTROLYTE DISORDERS,10,"ENDOCRINE, NUTRITIONAL AND METABOLIC DISEASES AND DISORDERS",1,Minor,Minor,Medical,"Managed Care, Unspecified",Medicaid,Self-Pay,,,true,11812.74,3077.26
Finger Lakes,Monroe,2701003,000411,Rochester General Hospital,50 to 69,145,F,White,Not Span/Hispanic,8,Emergency,Home w/ Home Health Services,2018,END011,FLUID AND ELECTROLYTE DISORDERS,,,422,HYPOVOLEMIA & RELATED ELECTROLYTE DISORDERS,10,"ENDOCRINE, NUTRITIONAL AND METABOLIC DISEASES AND DISORDERS",3,Major,Major,Medical,Medicare,,,,,true,24285.12,11397.59
New York City,Manhattan,7002017,001450,Lenox Hill Hospital,50 to 69,100,F,White,Not Span/Hispanic,2,Emergency,Home w/ Home Health Services,2018,END011,FLUID AND ELECTROLYTE DISORDERS,,,422,HYPOVOLEMIA & RELATED ELECTROLYTE DISORDERS,10,"ENDOCRINE, NUTRITIONAL AND METABOLIC DISEASES AND DISORDERS",4,Extreme,Extreme,Medical,Medicare,Medicaid,,,,true,34184.94,6005.11
New York City,Manhattan,7002054,001464,New York-Presbyterian Hospital - Columbia Presbyterian Center,0 to 17,112,F,Black/African American,Not Span/Hispanic,1,Emergency,Home or Self Care,2018,END011,FLUID AND ELECTROLYTE DISORDERS,ADM021,"ADMINISTRATION OF THERAPEUTIC SUBSTANCES, NEC",422,HYPOVOLEMIA & RELATED ELECTROLYTE DISORDERS,10,"ENDOCRINE, NUTRITIONAL AND METABOLIC DISEASES AND DISORDERS",1,Minor,Minor,Medical,Medicaid,Medicaid,Self-Pay,,,true,17749.31,3773.43
Central NY,Cortland,1101000,000158,Guthrie Cortland Medical Center,70 or Older,130,F,White,Not Span/Hispanic,1,Emergency,Home w/ Home Health Services,2018,END011,FLUID AND ELECTROLYTE DISORDERS,,,422,HYPOVOLEMIA & RELATED ELECTROLYTE DISORDERS,10,"ENDOCRINE, NUTRITIONAL AND METABOLIC DISEASES AND DISORDERS",3,Major,Major,Medical,Medicare,Private Health Insurance,,,,true,7359.17,2770.06
New York City,Kings,7001016,001301,Kings County Hospital Center,0 to 17,112,M,Black/African American,Not Span/Hispanic,1,Emergency,Home or Self Care,2018,END011,FLUID AND ELECTROLYTE DISORDERS,ADM021,"ADMINISTRATION OF THERAPEUTIC SUBSTANCES, NEC",422,HYPOVOLEMIA & RELATED ELECTROLYTE DISORDERS,10,"ENDOCRINE, NUTRITIONAL AND METABOLIC DISEASES AND DISORDERS",2,Moderate,Minor,Medical,Blue Cross/Blue Shield,,,,,true,6303.79,4477.97
New York City,Bronx,7000006,001169,Montefiore Medical Center - Henry & Lucy Moses Div,0 to 17,104,M,White,Not Span/Hispanic,1,Emergency,Home or Self Care,2018,END011,FLUID AND ELECTROLYTE DISORDERS,ADM017,ADMINISTRATION OF NUTRITIONAL AND ELECTROLYTIC SUBSTANCES,422,HYPOVOLEMIA & RELATED ELECTROLYTE DISORDERS,10,"ENDOCRINE, NUTRITIONAL AND METABOLIC DISEASES AND DISORDERS",1,Minor,Minor,Medical,Blue Cross/Blue Shield,,,,,true,12339.58,3244.91
New York City,Manhattan,7002054,001464,New York-Presbyterian Hospital - Columbia Presbyterian Center,0 to 17,112,M,Multi-racial,Not Span/Hispanic,2,Emergency,Home w/ Home Health Services,2018,END011,FLUID AND ELECTROLYTE DISORDERS,,,422,HYPOVOLEMIA & RELATED ELECTROLYTE DISORDERS,10,"ENDOCRINE, NUTRITIONAL AND METABOLIC DISEASES AND DISORDERS",3,Major,Moderate,Medical,Medicaid,Medicaid,Self-Pay,,,true,30742.01,7696.56
Hudson Valley,Dutchess,5957001,000180,Mid-Hudson Valley Division of Westchester Medical Center,30 to 49,125,F,White,Not Span/Hispanic,5,Emergency,Skilled Nursing Home,2018,END011,FLUID AND ELECTROLYTE DISORDERS,,,422,HYPOVOLEMIA & RELATED ELECTROLYTE DISORDERS,10,"ENDOCRINE, NUTRITIONAL AND METABOLIC DISEASES AND DISORDERS",3,Major,Major,Medical,Blue Cross/Blue Shield,Medicare,Medicaid,,,true,66390.72,11075.15
Western NY,Erie,1401005,000210,Erie County Medical Center,50 to 69,142,M,White,Not Span/Hispanic,4,Emergency,Home or Self Care,2018,END011,FLUID AND ELECTROLYTE DISORDERS,,,422,HYPOVOLEMIA & RELATED ELECTROLYTE DISORDERS,10,"ENDOCRINE, NUTRITIONAL AND METABOLIC DISEASES AND DISORDERS",3,Major,Moderate,Medical,Blue Cross/Blue Shield,,,,,true,12278.77,7271.45
New York City,Queens,7003004,001630,Long Island Jewish Medical Center,70 or Older,115,F,White,Not Span/Hispanic,13,Emergency,Skilled Nursing Home,2018,END011,FLUID AND ELECTROLYTE DISORDERS,,,422,HYPOVOLEMIA & RELATED ELECTROLYTE DISORDERS,10,"ENDOCRINE, NUTRITIONAL AND METABOLIC DISEASES AND DISORDERS",3,Major,Major,Medical,Medicare,Private Health Insurance,Self-Pay,,,false,120556.64,21698.35
Long Island,Suffolk,5151001,000245,Stony Brook University Hospital,0 to 17,117,M,Other Race,Not Span/Hispanic,3,Emergency,Skilled Nursing Home,2018,END011,FLUID AND ELECTROLYTE DISORDERS,,,422,HYPOVOLEMIA & RELATED ELECTROLYTE DISORDERS,10,"ENDOCRINE, NUTRITIONAL AND METABOLIC DISEASES AND DISORDERS",3,Major,Moderate,Medical,Medicaid,,,,,true,24159.53,7485.56
New York City,Manhattan,7002054,001458,New York-Presbyterian Hospital - New York Weill Cornell Center,0 to 17,100,F,Multi-racial,Not Span/Hispanic,2,Emergency,Home or Self Care,2018,END011,FLUID AND ELECTROLYTE DISORDERS,ADM021,"ADMINISTRATION OF THERAPEUTIC SUBSTANCES, NEC",422,HYPOVOLEMIA & RELATED ELECTROLYTE DISORDERS,10,"ENDOCRINE, NUTRITIONAL AND METABOLIC DISEASES AND DISORDERS",1,Minor,Minor,Medical,Private Health Insurance,Self-Pay,,,,true,24655.66,5493.29
Long Island,Suffolk,5149001,000896,St. Charles Hospital,70 or Older,117,F,White,Not Span/Hispanic,4,Emergency,Skilled Nursing Home,2018,END011,FLUID AND ELECTROLYTE DISORDERS,,,422,HYPOVOLEMIA & RELATED ELECTROLYTE DISORDERS,10,"ENDOCRINE, NUTRITIONAL AND METABOLIC DISEASES AND DISORDERS",2,Moderate,Moderate,Medical,Medicare,,,,,true,29332,5612.63
Capital/Adirond,Albany,0101004,000005,St. Peter's Hospital,70 or Older,122,F,White,Not Span/Hispanic,3,Emergency,Home or Self Care,2018,END011,FLUID AND ELECTROLYTE DISORDERS,,,422,HYPOVOLEMIA & RELATED ELECTROLYTE DISORDERS,10,"ENDOCRINE, NUTRITIONAL AND METABOLIC DISEASES AND DISORDERS",2,Moderate,Major,Medical,Medicare,Medicare,,,,true,15337.3,5356.68
New York City,Manhattan,7002009,001445,Harlem Hospital Center,70 or Older,100,F,Black/African American,Not Span/Hispanic,1,Emergency,Home or Self Care,2018,END011,FLUID AND ELECTROLYTE DISORDERS,,,422,HYPOVOLEMIA & RELATED ELECTROLYTE DISORDERS,10,"ENDOCRINE, NUTRITIONAL AND METABOLIC DISEASES AND DISORDERS",2,Moderate,Minor,Medical,Medicare,Medicare,,,,true,9001.47,6689.27
Finger Lakes,Monroe,2701005,000413,Strong Memorial Hospital,70 or Older,145,F,White,Not Span/Hispanic,10,Emergency,Home w/ Home Health Services,2018,END011,FLUID AND ELECTROLYTE DISORDERS,,,422,HYPOVOLEMIA & RELATED ELECTROLYTE DISORDERS,10,"ENDOCRINE, NUTRITIONAL AND METABOLIC DISEASES AND DISORDERS",3,Major,Major,Medical,Medicare,,,,,true,28093.38,13031.86
Finger Lakes,Monroe,2701005,000413,Strong Memorial Hospital,50 to 69,140,M,White,Not Span/Hispanic,3,Urgent,Home or Self Care,2018,END011,FLUID AND ELECTROLYTE DISORDERS,,,422,HYPOVOLEMIA & RELATED ELECTROLYTE DISORDERS,10,"ENDOCRINE, NUTRITIONAL AND METABOLIC DISEASES AND DISORDERS",3,Major,Major,Medical,Private Health Insurance,,,,,false,6944.92,3985.25
Capital/Adirond,Albany,0101000,000001,Albany Medical Center Hospital,50 to 69,121,F,White,Not Span/Hispanic,3,Emergency,Home w/ Home Health Services,2018,END011,FLUID AND ELECTROLYTE DISORDERS,ADM017,ADMINISTRATION OF NUTRITIONAL AND ELECTROLYTIC SUBSTANCES,422,HYPOVOLEMIA & RELATED ELECTROLYTE DISORDERS,10,"ENDOCRINE, NUTRITIONAL AND METABOLIC DISEASES AND DISORDERS",3,Major,Moderate,Medical,Medicare,Blue Cross/Blue Shield,,,,true,17959.39,5646.3
Western NY,Erie,1401010,000216,Roswell Park Cancer Institute,70 or Older,140,M,White,Not Span/Hispanic,13,Elective,Inpatient Rehabilitation Facility,2018,END011,FLUID AND ELECTROLYTE DISORDERS,ADM015,ADMINISTRATION OF ANTIBIOTICS,422,HYPOVOLEMIA & RELATED ELECTROLYTE DISORDERS,10,"ENDOCRINE, NUTRITIONAL AND METABOLIC DISEASES AND DISORDERS",4,Extreme,Major,Medical,"Managed Care, Unspecified",,,,,false,142796,48805.73
New York City,Queens,7003001,001628,Flushing Hospital Medical Center,30 to 49,113,F,Other Race,Not Span/Hispanic,3,Emergency,Home or Self Care,2018,END011,FLUID AND ELECTROLYTE DISORDERS,,,422,HYPOVOLEMIA & RELATED ELECTROLYTE DISORDERS,10,"ENDOCRINE, NUTRITIONAL AND METABOLIC DISEASES AND DISORDERS",4,Extreme,Major,Medical,Medicaid,,,,,true,12191.75,6344.48
Finger Lakes,Monroe,2701003,000411,Rochester General Hospital,70 or Older,145,F,Black/African American,Not Span/Hispanic,7,Emergency,Hospice - Home,2018,END011,FLUID AND ELECTROLYTE DISORDERS,RES005,CHEST TUBE PLACEMENT AND THERAPEUTIC THORACENTESIS,422,HYPOVOLEMIA & RELATED ELECTROLYTE DISORDERS,10,"ENDOCRINE, NUTRITIONAL AND METABOLIC DISEASES AND DISORDERS",3,Major,Major,Medical,Medicare,,,,,true,24855.97,8758.91
New York City,Richmond,7004003,001737,Staten Island University Hospital Prince's Bay,70 or Older,103,F,White,Not Span/Hispanic,3,Emergency,Home w/ Home Health Services,2018,END011,FLUID AND ELECTROLYTE DISORDERS,,,422,HYPOVOLEMIA & RELATED ELECTROLYTE DISORDERS,10,"ENDOCRINE, NUTRITIONAL AND METABOLIC DISEASES AND DISORDERS",2,Moderate,Moderate,Medical,Medicare,Medicare,,,,true,26718.35,6122.68
Hudson Valley,Orange,3522000,000694,St Luke's Cornwall Hospital/Newburgh,70 or Older,109,F,White,Not Span/Hispanic,8,Emergency,Skilled Nursing Home,2018,END011,FLUID AND ELECTROLYTE DISORDERS,,,422,HYPOVOLEMIA & RELATED ELECTROLYTE DISORDERS,10,"ENDOCRINE, NUTRITIONAL AND METABOLIC DISEASES AND DISORDERS",4,Extreme,Extreme,Medical,Medicare,Private Health Insurance,,,,true,82181,17941.23
Long Island,Nassau,2950001,000527,Mount Sinai South Nassau,70 or Older,115,M,White,Not Span/Hispanic,11,Emergency,Skilled Nursing Home,2018,END011,FLUID AND ELECTROLYTE DISORDERS,GIS001,ESOPHAGOGASTRODUODENOSCOPY (EGD) WITH BIOPSY,422,HYPOVOLEMIA & RELATED ELECTROLYTE DISORDERS,10,"ENDOCRINE, NUTRITIONAL AND METABOLIC DISEASES AND DISORDERS",3,Major,Major,Medical,Medicare,,,,,true,118961.48,20818.7
Hudson Valley,Westchester,5904001,001072,Montefiore New Rochelle Hospital,50 to 69,108,F,White,Unknown,1,Emergency,Home or Self Care,2018,END011,FLUID AND ELECTROLYTE DISORDERS,ADM017,ADMINISTRATION OF NUTRITIONAL AND ELECTROLYTIC SUBSTANCES,422,HYPOVOLEMIA & RELATED ELECTROLYTE DISORDERS,10,"ENDOCRINE, NUTRITIONAL AND METABOLIC DISEASES AND DISORDERS",2,Moderate,Moderate,Medical,Private Health Insurance,Self-Pay,,,,true,7368.82,2098.65
Capital/Adirond,Schenectady,4601001,000829,Ellis Hospital,30 to 49,123,M,Other Race,Not Span/Hispanic,4,Emergency,Home or Self Care,2018,END011,FLUID AND ELECTROLYTE DISORDERS,MAM005,MEASUREMENT DURING CARDIAC CATHETERIZATION,422,HYPOVOLEMIA & RELATED ELECTROLYTE DISORDERS,10,"ENDOCRINE, NUTRITIONAL AND METABOLIC DISEASES AND DISORDERS",2,Moderate,Minor,Medical,Blue Cross/Blue Shield,,,,,false,66081.9,15125.47
New York City,Queens,7003003,001629,Jamaica Hospital Medical Center,0 to 17,114,M,Other Race,Not Span/Hispanic,2,Emergency,Home or Self Care,2018,END011,FLUID AND ELECTROLYTE DISORDERS,ADM017,ADMINISTRATION OF NUTRITIONAL AND ELECTROLYTIC SUBSTANCES,422,HYPOVOLEMIA & RELATED ELECTROLYTE DISORDERS,10,"ENDOCRINE, NUTRITIONAL AND METABOLIC DISEASES AND DISORDERS",2,Moderate,Minor,Medical,Medicaid,,,,,true,6048,7232.58
Long Island,Nassau,2952005,000552,Plainview Hospital,50 to 69,118,F,White,Not Span/Hispanic,4,Emergency,Home or Self Care,2018,END011,FLUID AND ELECTROLYTE DISORDERS,,,422,HYPOVOLEMIA & RELATED ELECTROLYTE DISORDERS,10,"ENDOCRINE, NUTRITIONAL AND METABOLIC DISEASES AND DISORDERS",2,Moderate,Moderate,Medical,Medicare,Blue Cross/Blue Shield,,,,true,37967.85,10763.24
Western NY,Erie,1401014,000208,John R. Oishei Children's Hospital,0 to 17,142,F,Black/African American,Not Span/Hispanic,1,Emergency,Home or Self Care,2018,END011,FLUID AND ELECTROLYTE DISORDERS,OTR004,ISOLATION PROCEDURES,422,HYPOVOLEMIA & RELATED ELECTROLYTE DISORDERS,10,"ENDOCRINE, NUTRITIONAL AND METABOLIC DISEASES AND DISORDERS",1,Minor,Minor,Medical,Private Health Insurance,Self-Pay,,,,true,6202.13,3441.02
Western NY,Erie,1401013,000292,Sisters of Charity Hospital - St. Joseph Campus,70 or Older,142,F,White,Not Span/Hispanic,9,Emergency,Skilled Nursing Home,2018,END011,FLUID AND ELECTROLYTE DISORDERS,,,422,HYPOVOLEMIA & RELATED ELECTROLYTE DISORDERS,10,"ENDOCRINE, NUTRITIONAL AND METABOLIC DISEASES AND DISORDERS",4,Extreme,Extreme,Medical,Medicare,Medicare,,,,true,32175.29,13357
Long Island,Nassau,2952005,000552,Plainview Hospital,50 to 69,117,F,White,Not Span/Hispanic,5,Emergency,Skilled Nursing Home,2018,END011,FLUID AND ELECTROLYTE DISORDERS,,,422,HYPOVOLEMIA & RELATED ELECTROLYTE DISORDERS,10,"ENDOCRINE, NUTRITIONAL AND METABOLIC DISEASES AND DISORDERS",2,Moderate,Moderate,Medical,Medicaid,Medicaid,,,,true,31238.87,8822.2
Western NY,Erie,1401014,000207,Buffalo General Medical Center,70 or Older,140,M,White,Not Span/Hispanic,4,Emergency,Skilled Nursing Home,2018,END011,FLUID AND ELECTROLYTE DISORDERS,,,422,HYPOVOLEMIA & RELATED ELECTROLYTE DISORDERS,10,"ENDOCRINE, NUTRITIONAL AND METABOLIC DISEASES AND DISORDERS",2,Moderate,Moderate,Medical,Medicare,Self-Pay,,,,true,12592.22,5528.37
New York City,Kings,7001016,001301,Kings County Hospital Center,0 to 17,112,F,Black/African American,Not Span/Hispanic,2,Emergency,Home or Self Care,2018,END011,FLUID AND ELECTROLYTE DISORDERS,,,422,HYPOVOLEMIA & RELATED ELECTROLYTE DISORDERS,10,"ENDOCRINE, NUTRITIONAL AND METABOLIC DISEASES AND DISORDERS",1,Minor,Minor,Medical,Blue Cross/Blue Shield,,,,,true,12244.52,8698.03
New York City,Kings,7001021,001306,New York - Presbyterian Brooklyn Methodist Hospital,70 or Older,112,M,Other Race,Spanish/Hispanic,3,Emergency,Home or Self Care,2018,END011,FLUID AND ELECTROLYTE DISORDERS,,,422,HYPOVOLEMIA & RELATED ELECTROLYTE DISORDERS,10,"ENDOCRINE, NUTRITIONAL AND METABOLIC DISEASES AND DISORDERS",3,Major,Major,Medical,Medicare,Medicare,Self-Pay,,,true,22271.39,5166.84
Long Island,Nassau,2951001,000541,North Shore University Hospital,70 or Older,113,M,White,Not Span/Hispanic,4,Emergency,Home w/ Home Health Services,2018,END011,FLUID AND ELECTROLYTE DISORDERS,,,422,HYPOVOLEMIA & RELATED ELECTROLYTE DISORDERS,10,"ENDOCRINE, NUTRITIONAL AND METABOLIC DISEASES AND DISORDERS",2,Moderate,Moderate,Medical,Medicare,Blue Cross/Blue Shield,,,,true,40030.64,6733.56
Long Island,Nassau,2950002,000528,Nassau University Medical Center,70 or Older,115,M,Black/African American,Not Span/Hispanic,4,Emergency,Home w/ Home Health Services,2018,END011,FLUID AND ELECTROLYTE DISORDERS,,,422,HYPOVOLEMIA & RELATED ELECTROLYTE DISORDERS,10,"ENDOCRINE, NUTRITIONAL AND METABOLIC DISEASES AND DISORDERS",3,Major,Major,Medical,Medicare,Medicare,Medicaid,,,false,27276.94,8900.1
Long Island,Nassau,2950002,000528,Nassau University Medical Center,70 or Older,117,F,White,Not Span/Hispanic,1,Trauma,Home w/ Home Health Services,2018,END011,FLUID AND ELECTROLYTE DISORDERS,IMG007,COMPUTERIZED TOMOGRAPHY (CT) WITHOUT CONTRAST,422,HYPOVOLEMIA & RELATED ELECTROLYTE DISORDERS,10,"ENDOCRINE, NUTRITIONAL AND METABOLIC DISEASES AND DISORDERS",2,Moderate,Moderate,Medical,Medicare,Private Health Insurance,Self-Pay,,,false,12428.11,3281.47
New York City,Manhattan,7002054,001464,New York-Presbyterian Hospital - Columbia Presbyterian Center,0 to 17,104,F,Multi-racial,Multi-ethnic,1,Emergency,Home or Self Care,2018,END011,FLUID AND ELECTROLYTE DISORDERS,,,422,HYPOVOLEMIA & RELATED ELECTROLYTE DISORDERS,10,"ENDOCRINE, NUTRITIONAL AND METABOLIC DISEASES AND DISORDERS",3,Major,Moderate,Medical,Medicaid,Medicaid,Self-Pay,,,false,15591.41,3233.02
Long Island,Nassau,2951001,000541,North Shore University Hospital,70 or Older,113,F,White,Not Span/Hispanic,3,Emergency,Skilled Nursing Home,2018,END011,FLUID AND ELECTROLYTE DISORDERS,,,422,HYPOVOLEMIA & RELATED ELECTROLYTE DISORDERS,10,"ENDOCRINE, NUTRITIONAL AND METABOLIC DISEASES AND DISORDERS",3,Major,Major,Medical,Medicare,Blue Cross/Blue Shield,,,,true,35004.47,5682.71
New York City,Kings,7001021,001306,New York - Presbyterian Brooklyn Methodist Hospital,70 or Older,112,M,White,Not Span/Hispanic,5,Emergency,Home or Self Care,2018,END011,FLUID AND ELECTROLYTE DISORDERS,GIS006,PARACENTESIS,422,HYPOVOLEMIA & RELATED ELECTROLYTE DISORDERS,10,"ENDOCRINE, NUTRITIONAL AND METABOLIC DISEASES AND DISORDERS",3,Major,Major,Medical,Medicare,Private Health Insurance,Self-Pay,,,true,48031.04,10009.68
New York City,Richmond,7004003,001737,Staten Island University Hospital Prince's Bay,70 or Older,103,F,White,Not Span/Hispanic,3,Emergency,Home or Self Care,2018,END011,FLUID AND ELECTROLYTE DISORDERS,,,422,HYPOVOLEMIA & RELATED ELECTROLYTE DISORDERS,10,"ENDOCRINE, NUTRITIONAL AND METABOLIC DISEASES AND DISORDERS",2,Moderate,Major,Medical,Medicare,Medicare,Medicaid,,,true,29952.06,7819.52
Hudson Valley,Orange,3523000,000699,Garnet Health Medical Center,50 to 69,124,M,White,Not Span/Hispanic,8,Emergency,Home or Self Care,2018,END011,FLUID AND ELECTROLYTE DISORDERS,ADM021,"ADMINISTRATION OF THERAPEUTIC SUBSTANCES, NEC",422,HYPOVOLEMIA & RELATED ELECTROLYTE DISORDERS,10,"ENDOCRINE, NUTRITIONAL AND METABOLIC DISEASES AND DISORDERS",3,Major,Moderate,Medical,Blue Cross/Blue Shield,,,,,true,61817.88,15434.4
Long Island,Suffolk,5154001,000925,Good Samaritan Hospital Medical Center,70 or Older,115,F,White,Not Span/Hispanic,4,Emergency,Skilled Nursing Home,2018,END011,FLUID AND ELECTROLYTE DISORDERS,,,422,HYPOVOLEMIA & RELATED ELECTROLYTE DISORDERS,10,"ENDOCRINE, NUTRITIONAL AND METABOLIC DISEASES AND DISORDERS",2,Moderate,Minor,Medical,Medicare,Medicaid,,,,true,36585,6788.88
Hudson Valley,Orange,3535001,000708,Bon Secours Community Hospital,50 to 69,127,F,White,Not Span/Hispanic,47,Emergency,Skilled Nursing Home,2018,END011,FLUID AND ELECTROLYTE DISORDERS,,,422,HYPOVOLEMIA & RELATED ELECTROLYTE DISORDERS,10,"ENDOCRINE, NUTRITIONAL AND METABOLIC DISEASES AND DISORDERS",2,Moderate,Moderate,Medical,Medicare,Blue Cross/Blue Shield,,,,true,389973.79,90069.03
Western NY,Niagara,3101000,000565,Eastern Niagara Hospital - Lockport Division,70 or Older,140,F,White,Not Span/Hispanic,7,Emergency,Home w/ Home Health Services,2018,END011,FLUID AND ELECTROLYTE DISORDERS,,,422,HYPOVOLEMIA & RELATED ELECTROLYTE DISORDERS,10,"ENDOCRINE, NUTRITIONAL AND METABOLIC DISEASES AND DISORDERS",2,Moderate,Moderate,Medical,Medicare,Medicare,,,,true,18415.9,6779.85
Long Island,Nassau,2950001,000527,Mount Sinai South Nassau,70 or Older,115,F,White,Not Span/Hispanic,5,Emergency,Home w/ Home Health Services,2018,END011,FLUID AND ELECTROLYTE DISORDERS,,,422,HYPOVOLEMIA & RELATED ELECTROLYTE DISORDERS,10,"ENDOCRINE, NUTRITIONAL AND METABOLIC DISEASES AND DISORDERS",2,Moderate,Moderate,Medical,Medicare,Medicaid,,,,true,40949.43,6720.59
New York City,Bronx,7000001,001178,BronxCare Hospital Center,70 or Older,104,F,Other Race,Spanish/Hispanic,3,Emergency,Home or Self Care,2018,END011,FLUID AND ELECTROLYTE DISORDERS,ADM017,ADMINISTRATION OF NUTRITIONAL AND ELECTROLYTIC SUBSTANCES,422,HYPOVOLEMIA & RELATED ELECTROLYTE DISORDERS,10,"ENDOCRINE, NUTRITIONAL AND METABOLIC DISEASES AND DISORDERS",2,Moderate,Moderate,Medical,Medicare,Medicare,,,,true,11768.28,12833.86
Western NY,Cattaraugus,0401001,000066,Olean General Hospital,70 or Older,147,F,White,Not Span/Hispanic,1,Emergency,Home or Self Care,2018,END011,FLUID AND ELECTROLYTE DISORDERS,,,422,HYPOVOLEMIA & RELATED ELECTROLYTE DISORDERS,10,"ENDOCRINE, NUTRITIONAL AND METABOLIC DISEASES AND DISORDERS",3,Major,Major,Medical,Medicare,Private Health Insurance,,,,true,5029.3,1220.88