Hospital Service Area,Hospital County,Operating Certificate Number,Permanent Facility Id,Facility Name,Age Group,Zip Code - 3 digits,Gender,Race,Ethnicity,Length of Stay,Type of Admission,Patient Disposition,Discharge Year,CCS Diagnosis Code,CCS Diagnosis Description,CCS Procedure Code,CCS Procedure Description,APR DRG Code,APR DRG Description,APR MDC Code,APR MDC Description,APR Severity of Illness Code,APR Severity of Illness Description,APR Risk of Mortality,APR Medical Surgical Description,Payment Typology 1,Payment Typology 2,Payment Typology 3,Birth Weight,Abortion Edit Indicator,Emergency Department Indicator,Total Charges,Total Costs
New York City,Kings,7002053,001304,NYU Langone Hospital-Brooklyn,50 to 69,112,M,Other Race,Not Span/Hispanic,2,Emergency,Home or Self Care,2020,END011,FLUID AND ELECTROLYTE DISORDERS,,,422,HYPOVOLEMIA & RELATED ELECTROLYTE DISORDERS,10,"ENDOCRINE, NUTRITIONAL AND METABOLIC DISEASES AND DISORDERS",2,Moderate,Major,Medical,Medicaid,,,,,Y,35528.4,8338.28
New York City,Kings,7002053,001304,NYU Langone Hospital-Brooklyn,0 to 17,112,F,Other Race,Not Span/Hispanic,2,Emergency,Home or Self Care,2020,END011,FLUID AND ELECTROLYTE DISORDERS,OTR004,ISOLATION PROCEDURES,422,HYPOVOLEMIA & RELATED ELECTROLYTE DISORDERS,10,"ENDOCRINE, NUTRITIONAL AND METABOLIC DISEASES AND DISORDERS",1,Minor,Minor,Medical,Medicaid,,,,,Y,20723.69,5187.57
New York City,Kings,7002053,001304,NYU Langone Hospital-Brooklyn,50 to 69,112,M,White,Not Span/Hispanic,1,Emergency,Home or Self Care,2020,END011,FLUID AND ELECTROLYTE DISORDERS,ESA001,HEMODIALYSIS,422,HYPOVOLEMIA & RELATED ELECTROLYTE DISORDERS,10,"ENDOCRINE, NUTRITIONAL AND METABOLIC DISEASES AND DISORDERS",3,Major,Major,Medical,Medicaid,,,,,Y,47739.35,10327.6
New York City,Kings,7002053,001304,NYU Langone Hospital-Brooklyn,18 to 29,112,M,Other Race,Spanish/Hispanic,1,Emergency,Home or Self Care,2020,END011,FLUID AND ELECTROLYTE DISORDERS,IMG008,ULTRASONOGRAPHY,422,HYPOVOLEMIA & RELATED ELECTROLYTE DISORDERS,10,"ENDOCRINE, NUTRITIONAL AND METABOLIC DISEASES AND DISORDERS",1,Minor,Minor,Medical,Medicaid,,,,,Y,36178.09,9522.25
New York City,Kings,7002053,001304,NYU Langone Hospital-Brooklyn,50 to 69,112,F,Other Race,Spanish/Hispanic,1,Emergency,Home or Self Care,2020,END011,FLUID AND ELECTROLYTE DISORDERS,,,422,HYPOVOLEMIA & RELATED ELECTROLYTE DISORDERS,10,"ENDOCRINE, NUTRITIONAL AND METABOLIC DISEASES AND DISORDERS",2,Moderate,Minor,Medical,Medicare,,,,,Y,30528.75,8268.3
New York City,Kings,7002053,001304,NYU Langone Hospital-Brooklyn,50 to 69,112,F,Black/African American,Not Span/Hispanic,3,Emergency,Home or Self Care,2020,END011,FLUID AND ELECTROLYTE DISORDERS,,,422,HYPOVOLEMIA & RELATED ELECTROLYTE DISORDERS,10,"ENDOCRINE, NUTRITIONAL AND METABOLIC DISEASES AND DISORDERS",2,Moderate,Major,Medical,Medicaid,,,,,Y,46889.99,11309.91
New York City,Kings,7002053,001304,NYU Langone Hospital-Brooklyn,50 to 69,112,F,White,Not Span/Hispanic,6,Emergency,Home or Self Care,2020,END011,FLUID AND ELECTROLYTE DISORDERS,OTR004,ISOLATION PROCEDURES,422,HYPOVOLEMIA & RELATED ELECTROLYTE DISORDERS,10,"ENDOCRINE, NUTRITIONAL AND METABOLIC DISEASES AND DISORDERS",3,Major,Major,Medical,Medicaid,,,,,Y,68537.86,24066.77
New York City,Kings,7002053,001304,NYU Langone Hospital-Brooklyn,0 to 17,112,F,Other Race,Spanish/Hispanic,1,Emergency,Home or Self Care,2020,END011,FLUID AND ELECTROLYTE DISORDERS,,,422,HYPOVOLEMIA & RELATED ELECTROLYTE DISORDERS,10,"ENDOCRINE, NUTRITIONAL AND METABOLIC DISEASES AND DISORDERS",2,Moderate,Minor,Medical,Medicaid,,,,,Y,14427.74,3092.37
New York City,Kings,7002053,001304,NYU Langone Hospital-Brooklyn,30 to 49,112,F,Other Race,Not Span/Hispanic,8,Emergency,Home w/ Home Health Services,2020,END011,FLUID AND ELECTROLYTE DISORDERS,,,422,HYPOVOLEMIA & RELATED ELECTROLYTE DISORDERS,10,"ENDOCRINE, NUTRITIONAL AND METABOLIC DISEASES AND DISORDERS",2,Moderate,Minor,Medical,Medicaid,,,,,Y,93335.94,30782.3
New York City,Kings,7002053,001304,NYU Langone Hospital-Brooklyn,70 or Older,112,M,Other Race,Not Span/Hispanic,4,Emergency,Home w/ Home Health Services,2020,END011,FLUID AND ELECTROLYTE DISORDERS,ADM021,"ADMINISTRATION OF THERAPEUTIC SUBSTANCES, NEC",422,HYPOVOLEMIA & RELATED ELECTROLYTE DISORDERS,10,"ENDOCRINE, NUTRITIONAL AND METABOLIC DISEASES AND DISORDERS",3,Major,Major,Medical,Medicaid,,,,,Y,60569.57,15817.02
New York City,Kings,7002053,001304,NYU Langone Hospital-Brooklyn,18 to 29,112,F,White,Unknown,1,Emergency,Home or Self Care,2020,END011,FLUID AND ELECTROLYTE DISORDERS,,,422,HYPOVOLEMIA & RELATED ELECTROLYTE DISORDERS,10,"ENDOCRINE, NUTRITIONAL AND METABOLIC DISEASES AND DISORDERS",1,Minor,Minor,Medical,Medicaid,,,,,Y,24981.42,5334.98
New York City,Kings,7002053,001304,NYU Langone Hospital-Brooklyn,50 to 69,112,M,Multi-racial,Not Span/Hispanic,1,Emergency,Home or Self Care,2020,END011,FLUID AND ELECTROLYTE DISORDERS,,,422,HYPOVOLEMIA & RELATED ELECTROLYTE DISORDERS,10,"ENDOCRINE, NUTRITIONAL AND METABOLIC DISEASES AND DISORDERS",2,Moderate,Moderate,Medical,Private Health Insurance,,,,,Y,32150.87,9146.68
New York City,Kings,7002053,001304,NYU Langone Hospital-Brooklyn,50 to 69,112,F,White,Not Span/Hispanic,2,Emergency,Home w/ Home Health Services,2020,END011,FLUID AND ELECTROLYTE DISORDERS,,,422,HYPOVOLEMIA & RELATED ELECTROLYTE DISORDERS,10,"ENDOCRINE, NUTRITIONAL AND METABOLIC DISEASES AND DISORDERS",2,Moderate,Moderate,Medical,Medicaid,,,,,Y,31535.24,8049.68
New York City,Kings,7002053,001304,NYU Langone Hospital-Brooklyn,30 to 49,112,F,Other Race,Not Span/Hispanic,6,Emergency,Home or Self Care,2020,END011,FLUID AND ELECTROLYTE DISORDERS,IMG004,FLUOROSCOPY OF NON-CIRCULATORY ORGANS,422,HYPOVOLEMIA & RELATED ELECTROLYTE DISORDERS,10,"ENDOCRINE, NUTRITIONAL AND METABOLIC DISEASES AND DISORDERS",2,Moderate,Moderate,Medical,Medicaid,,,,,Y,68665.08,23947.5
New York City,Kings,7002053,001304,NYU Langone Hospital-Brooklyn,50 to 69,112,F,Black/African American,Not Span/Hispanic,1,Emergency,Home or Self Care,2020,END011,FLUID AND ELECTROLYTE DISORDERS,,,422,HYPOVOLEMIA & RELATED ELECTROLYTE DISORDERS,10,"ENDOCRINE, NUTRITIONAL AND METABOLIC DISEASES AND DISORDERS",1,Minor,Minor,Medical,Medicare,,,,,Y,45500.95,10499.51
New York City,Kings,7002053,001304,NYU Langone Hospital-Brooklyn,70 or Older,112,M,White,Not Span/Hispanic,2,Emergency,Home or Self Care,2020,END011,FLUID AND ELECTROLYTE DISORDERS,ADM021,"ADMINISTRATION OF THERAPEUTIC SUBSTANCES, NEC",422,HYPOVOLEMIA & RELATED ELECTROLYTE DISORDERS,10,"ENDOCRINE, NUTRITIONAL AND METABOLIC DISEASES AND DISORDERS",2,Moderate,Major,Medical,Medicare,Blue Cross/Blue Shield,,,,Y,41356.39,8949.63
New York City,Kings,7002053,001304,NYU Langone Hospital-Brooklyn,50 to 69,112,M,Other Race,Not Span/Hispanic,1,Emergency,Home or Self Care,2020,END011,FLUID AND ELECTROLYTE DISORDERS,ADM021,"ADMINISTRATION OF THERAPEUTIC SUBSTANCES, NEC",422,HYPOVOLEMIA & RELATED ELECTROLYTE DISORDERS,10,"ENDOCRINE, NUTRITIONAL AND METABOLIC DISEASES AND DISORDERS",2,Moderate,Moderate,Medical,Blue Cross/Blue Shield,Medicare,,,,Y,30539.28,7894.96
New York City,Kings,7002053,001304,NYU Langone Hospital-Brooklyn,70 or Older,112,M,White,Not Span/Hispanic,2,Emergency,Home or Self Care,2020,END011,FLUID AND ELECTROLYTE DISORDERS,,,422,HYPOVOLEMIA & RELATED ELECTROLYTE DISORDERS,10,"ENDOCRINE, NUTRITIONAL AND METABOLIC DISEASES AND DISORDERS",2,Moderate,Minor,Medical,Medicare,,,,,Y,32568.46,8467.17
New York City,Kings,7002053,001304,NYU Langone Hospital-Brooklyn,50 to 69,112,F,Other Race,Not Span/Hispanic,1,Emergency,Home or Self Care,2020,END011,FLUID AND ELECTROLYTE DISORDERS,,,422,HYPOVOLEMIA & RELATED ELECTROLYTE DISORDERS,10,"ENDOCRINE, NUTRITIONAL AND METABOLIC DISEASES AND DISORDERS",1,Minor,Minor,Medical,Private Health Insurance,,,,,Y,17059.44,4393.5
New York City,Kings,7002053,001304,NYU Langone Hospital-Brooklyn,70 or Older,112,F,White,Not Span/Hispanic,2,Emergency,Skilled Nursing Home,2020,END011,FLUID AND ELECTROLYTE DISORDERS,,,422,HYPOVOLEMIA & RELATED ELECTROLYTE DISORDERS,10,"ENDOCRINE, NUTRITIONAL AND METABOLIC DISEASES AND DISORDERS",2,Moderate,Moderate,Medical,Medicare,,,,,Y,53788.49,15484.08
New York City,Kings,7002053,001304,NYU Langone Hospital-Brooklyn,50 to 69,112,M,Other Race,Spanish/Hispanic,4,Emergency,Home or Self Care,2020,END011,FLUID AND ELECTROLYTE DISORDERS,,,422,HYPOVOLEMIA & RELATED ELECTROLYTE DISORDERS,10,"ENDOCRINE, NUTRITIONAL AND METABOLIC DISEASES AND DISORDERS",2,Moderate,Moderate,Medical,Blue Cross/Blue Shield,,,,,Y,99384.98,21130.45
New York City,Kings,7002053,001304,NYU Langone Hospital-Brooklyn,70 or Older,112,F,Other Race,Not Span/Hispanic,2,Emergency,Home w/ Home Health Services,2020,END011,FLUID AND ELECTROLYTE DISORDERS,OTR004,ISOLATION PROCEDURES,422,HYPOVOLEMIA & RELATED ELECTROLYTE DISORDERS,10,"ENDOCRINE, NUTRITIONAL AND METABOLIC DISEASES AND DISORDERS",2,Moderate,Minor,Medical,Medicare,Medicaid,,,,Y,46960.06,10322.01
New York City,Kings,7002053,001304,NYU Langone Hospital-Brooklyn,50 to 69,112,F,Black/African American,Not Span/Hispanic,7,Emergency,Home w/ Home Health Services,2020,END011,FLUID AND ELECTROLYTE DISORDERS,ADM001,TRANSFUSION OF BLOOD AND BLOOD PRODUCTS,422,HYPOVOLEMIA & RELATED ELECTROLYTE DISORDERS,10,"ENDOCRINE, NUTRITIONAL AND METABOLIC DISEASES AND DISORDERS",3,Major,Extreme,Medical,Medicare,,,,,Y,100655.37,25334.65
New York City,Kings,7002053,001304,NYU Langone Hospital-Brooklyn,50 to 69,112,F,Other Race,Not Span/Hispanic,1,Emergency,Home w/ Home Health Services,2020,END011,FLUID AND ELECTROLYTE DISORDERS,IMG007,COMPUTERIZED TOMOGRAPHY (CT) WITHOUT CONTRAST,422,HYPOVOLEMIA & RELATED ELECTROLYTE DISORDERS,10,"ENDOCRINE, NUTRITIONAL AND METABOLIC DISEASES AND DISORDERS",2,Moderate,Major,Medical,Medicaid,,,,,Y,47624.89,7355.61
New York City,Kings,7002053,001304,NYU Langone Hospital-Brooklyn,70 or Older,112,M,Other Race,Not Span/Hispanic,2,Emergency,Home w/ Home Health Services,2020,END011,FLUID AND ELECTROLYTE DISORDERS,OTR004,ISOLATION PROCEDURES,422,HYPOVOLEMIA & RELATED ELECTROLYTE DISORDERS,10,"ENDOCRINE, NUTRITIONAL AND METABOLIC DISEASES AND DISORDERS",2,Moderate,Major,Medical,Medicare,,,,,Y,57707.19,11048.08
New York City,Kings,7002053,001304,NYU Langone Hospital-Brooklyn,70 or Older,112,F,White,Not Span/Hispanic,5,Emergency,Home w/ Home Health Services,2020,END011,FLUID AND ELECTROLYTE DISORDERS,,,422,HYPOVOLEMIA & RELATED ELECTROLYTE DISORDERS,10,"ENDOCRINE, NUTRITIONAL AND METABOLIC DISEASES AND DISORDERS",2,Moderate,Major,Medical,Medicare,Medicaid,,,,Y,64568.21,17900.83
New York City,Kings,7002053,001304,NYU Langone Hospital-Brooklyn,30 to 49,112,M,Other Race,Not Span/Hispanic,3,Emergency,Left Against Medical Advice,2020,END011,FLUID AND ELECTROLYTE DISORDERS,MAM005,MEASUREMENT DURING CARDIAC CATHETERIZATION,422,HYPOVOLEMIA & RELATED ELECTROLYTE DISORDERS,10,"ENDOCRINE, NUTRITIONAL AND METABOLIC DISEASES AND DISORDERS",2,Moderate,Major,Medical,Private Health Insurance,,,,,Y,100977.2,28512.79
New York City,Kings,7002053,001304,NYU Langone Hospital-Brooklyn,70 or Older,112,M,White,Not Span/Hispanic,3,Emergency,Home or Self Care,2020,END011,FLUID AND ELECTROLYTE DISORDERS,,,422,HYPOVOLEMIA & RELATED ELECTROLYTE DISORDERS,10,"ENDOCRINE, NUTRITIONAL AND METABOLIC DISEASES AND DISORDERS",2,Moderate,Minor,Medical,Medicare,Private Health Insurance,,,,Y,28452.72,10406.87
New York City,Kings,7002053,001304,NYU Langone Hospital-Brooklyn,50 to 69,112,M,Other Race,Not Span/Hispanic,1,Emergency,Home or Self Care,2020,END011,FLUID AND ELECTROLYTE DISORDERS,,,422,HYPOVOLEMIA & RELATED ELECTROLYTE DISORDERS,10,"ENDOCRINE, NUTRITIONAL AND METABOLIC DISEASES AND DISORDERS",2,Moderate,Moderate,Medical,Medicaid,,,,,Y,37153.16,6885.66
New York City,Kings,7002053,001304,NYU Langone Hospital-Brooklyn,50 to 69,112,M,Black/African American,Not Span/Hispanic,1,Emergency,Home or Self Care,2020,END011,FLUID AND ELECTROLYTE DISORDERS,,,422,HYPOVOLEMIA & RELATED ELECTROLYTE DISORDERS,10,"ENDOCRINE, NUTRITIONAL AND METABOLIC DISEASES AND DISORDERS",2,Moderate,Minor,Medical,Medicaid,,,,,Y,33504.74,10091.75
New York City,Kings,7002053,001304,NYU Langone Hospital-Brooklyn,18 to 29,112,F,Other Race,Unknown,1,Emergency,Home or Self Care,2020,END011,FLUID AND ELECTROLYTE DISORDERS,OTR004,ISOLATION PROCEDURES,422,HYPOVOLEMIA & RELATED ELECTROLYTE DISORDERS,10,"ENDOCRINE, NUTRITIONAL AND METABOLIC DISEASES AND DISORDERS",2,Moderate,Moderate,Medical,Medicaid,,,,,Y,22993.3,6231.95
New York City,Kings,7002053,001304,NYU Langone Hospital-Brooklyn,70 or Older,112,F,Other Race,Spanish/Hispanic,2,Emergency,Home or Self Care,2020,END011,FLUID AND ELECTROLYTE DISORDERS,ADM021,"ADMINISTRATION OF THERAPEUTIC SUBSTANCES, NEC",422,HYPOVOLEMIA & RELATED ELECTROLYTE DISORDERS,10,"ENDOCRINE, NUTRITIONAL AND METABOLIC DISEASES AND DISORDERS",2,Moderate,Major,Medical,Medicare,,,,,Y,49781.18,12349.08
New York City,Kings,7002053,001304,NYU Langone Hospital-Brooklyn,70 or Older,103,F,White,Not Span/Hispanic,7,Emergency,Skilled Nursing Home,2020,END011,FLUID AND ELECTROLYTE DISORDERS,ADM021,"ADMINISTRATION OF THERAPEUTIC SUBSTANCES, NEC",422,HYPOVOLEMIA & RELATED ELECTROLYTE DISORDERS,10,"ENDOCRINE, NUTRITIONAL AND METABOLIC DISEASES AND DISORDERS",3,Major,Major,Medical,Medicare,Blue Cross/Blue Shield,,,,Y,97472.34,32800.42
New York City,Kings,7002053,001304,NYU Langone Hospital-Brooklyn,50 to 69,112,F,Other Race,Spanish/Hispanic,2,Emergency,Home or Self Care,2020,END011,FLUID AND ELECTROLYTE DISORDERS,ADM021,"ADMINISTRATION OF THERAPEUTIC SUBSTANCES, NEC",422,HYPOVOLEMIA & RELATED ELECTROLYTE DISORDERS,10,"ENDOCRINE, NUTRITIONAL AND METABOLIC DISEASES AND DISORDERS",2,Moderate,Moderate,Medical,Blue Cross/Blue Shield,,,,,Y,55513.63,12639.75
New York City,Kings,7002053,001304,NYU Langone Hospital-Brooklyn,70 or Older,112,M,Other Race,Spanish/Hispanic,2,Emergency,Home or Self Care,2020,END011,FLUID AND ELECTROLYTE DISORDERS,ADM021,"ADMINISTRATION OF THERAPEUTIC SUBSTANCES, NEC",422,HYPOVOLEMIA & RELATED ELECTROLYTE DISORDERS,10,"ENDOCRINE, NUTRITIONAL AND METABOLIC DISEASES AND DISORDERS",2,Moderate,Moderate,Medical,Medicare,Medicaid,,,,Y,35717.67,10899.14
New York City,Kings,7002053,001304,NYU Langone Hospital-Brooklyn,70 or Older,112,M,Other Race,Spanish/Hispanic,1,Emergency,Home or Self Care,2020,END011,FLUID AND ELECTROLYTE DISORDERS,,,422,HYPOVOLEMIA & RELATED ELECTROLYTE DISORDERS,10,"ENDOCRINE, NUTRITIONAL AND METABOLIC DISEASES AND DISORDERS",1,Minor,Minor,Medical,Medicare,Medicaid,,,,Y,24933.34,6652.36
New York City,Kings,7002053,001304,NYU Langone Hospital-Brooklyn,30 to 49,112,F,Other Race,Not Span/Hispanic,1,Emergency,Home or Self Care,2020,END011,FLUID AND ELECTROLYTE DISORDERS,,,422,HYPOVOLEMIA & RELATED ELECTROLYTE DISORDERS,10,"ENDOCRINE, NUTRITIONAL AND METABOLIC DISEASES AND DISORDERS",1,Minor,Minor,Medical,Blue Cross/Blue Shield,,,,,Y,21112.74,6135.25
New York City,Kings,7002053,001304,NYU Langone Hospital-Brooklyn,0 to 17,112,F,Black/African American,Not Span/Hispanic,2,Emergency,Home or Self Care,2020,END011,FLUID AND ELECTROLYTE DISORDERS,IMG008,ULTRASONOGRAPHY,422,HYPOVOLEMIA & RELATED ELECTROLYTE DISORDERS,10,"ENDOCRINE, NUTRITIONAL AND METABOLIC DISEASES AND DISORDERS",2,Moderate,Minor,Medical,Blue Cross/Blue Shield,,,,,Y,28420.66,8843.35
New York City,Kings,7002053,001304,NYU Langone Hospital-Brooklyn,70 or Older,112,F,White,Not Span/Hispanic,4,Emergency,Home w/ Home Health Services,2020,END011,FLUID AND ELECTROLYTE DISORDERS,ADM001,TRANSFUSION OF BLOOD AND BLOOD PRODUCTS,422,HYPOVOLEMIA & RELATED ELECTROLYTE DISORDERS,10,"ENDOCRINE, NUTRITIONAL AND METABOLIC DISEASES AND DISORDERS",2,Moderate,Major,Medical,Medicare,Medicaid,,,,Y,52122.13,19515.37
New York City,Kings,7002053,001304,NYU Langone Hospital-Brooklyn,70 or Older,112,F,White,Not Span/Hispanic,1,Emergency,Home or Self Care,2020,END011,FLUID AND ELECTROLYTE DISORDERS,,,422,HYPOVOLEMIA & RELATED ELECTROLYTE DISORDERS,10,"ENDOCRINE, NUTRITIONAL AND METABOLIC DISEASES AND DISORDERS",1,Minor,Moderate,Medical,Medicare,,,,,Y,24527.57,6529.67
New York City,Kings,7002053,001304,NYU Langone Hospital-Brooklyn,70 or Older,112,F,Other Race,Spanish/Hispanic,4,Emergency,Home w/ Home Health Services,2020,END011,FLUID AND ELECTROLYTE DISORDERS,OTR004,ISOLATION PROCEDURES,422,HYPOVOLEMIA & RELATED ELECTROLYTE DISORDERS,10,"ENDOCRINE, NUTRITIONAL AND METABOLIC DISEASES AND DISORDERS",2,Moderate,Moderate,Medical,Medicare,,,,,Y,64719.68,20566.36
New York City,Kings,7002053,001304,NYU Langone Hospital-Brooklyn,70 or Older,112,F,White,Not Span/Hispanic,4,Emergency,Skilled Nursing Home,2020,END011,FLUID AND ELECTROLYTE DISORDERS,,,422,HYPOVOLEMIA & RELATED ELECTROLYTE DISORDERS,10,"ENDOCRINE, NUTRITIONAL AND METABOLIC DISEASES AND DISORDERS",3,Major,Major,Medical,Medicare,,,,,Y,86362.55,25036.69
New York City,Kings,7002053,001304,NYU Langone Hospital-Brooklyn,70 or Older,112,F,Other Race,Spanish/Hispanic,6,Emergency,Home or Self Care,2020,END011,FLUID AND ELECTROLYTE DISORDERS,ADM021,"ADMINISTRATION OF THERAPEUTIC SUBSTANCES, NEC",422,HYPOVOLEMIA & RELATED ELECTROLYTE DISORDERS,10,"ENDOCRINE, NUTRITIONAL AND METABOLIC DISEASES AND DISORDERS",3,Major,Major,Medical,Medicare,Private Health Insurance,,,,Y,91201.08,30126.7
New York City,Kings,7002053,001304,NYU Langone Hospital-Brooklyn,30 to 49,117,F,Other Race,Spanish/Hispanic,15,Emergency,Home w/ Home Health Services,2020,END011,FLUID AND ELECTROLYTE DISORDERS,ADM017,ADMINISTRATION OF NUTRITIONAL AND ELECTROLYTIC SUBSTANCES,422,HYPOVOLEMIA & RELATED ELECTROLYTE DISORDERS,10,"ENDOCRINE, NUTRITIONAL AND METABOLIC DISEASES AND DISORDERS",3,Major,Moderate,Medical,Medicaid,,,,,Y,193328.77,69678
New York City,Kings,7002053,001304,NYU Langone Hospital-Brooklyn,70 or Older,112,M,Other Race,Not Span/Hispanic,2,Emergency,Home w/ Home Health Services,2020,END011,FLUID AND ELECTROLYTE DISORDERS,OTR004,ISOLATION PROCEDURES,422,HYPOVOLEMIA & RELATED ELECTROLYTE DISORDERS,10,"ENDOCRINE, NUTRITIONAL AND METABOLIC DISEASES AND DISORDERS",2,Moderate,Major,Medical,Medicare,,,,,Y,68251.11,16329.87
New York City,Kings,7002053,001304,NYU Langone Hospital-Brooklyn,70 or Older,112,M,Other Race,Not Span/Hispanic,1,Emergency,Home or Self Care,2020,END011,FLUID AND ELECTROLYTE DISORDERS,ADM021,"ADMINISTRATION OF THERAPEUTIC SUBSTANCES, NEC",422,HYPOVOLEMIA & RELATED ELECTROLYTE DISORDERS,10,"ENDOCRINE, NUTRITIONAL AND METABOLIC DISEASES AND DISORDERS",2,Moderate,Moderate,Medical,Self-Pay,,,,,Y,22897.48,6076.89
New York City,Kings,7002053,001304,NYU Langone Hospital-Brooklyn,70 or Older,112,F,White,Not Span/Hispanic,10,Emergency,Skilled Nursing Home,2020,END011,FLUID AND ELECTROLYTE DISORDERS,,,422,HYPOVOLEMIA & RELATED ELECTROLYTE DISORDERS,10,"ENDOCRINE, NUTRITIONAL AND METABOLIC DISEASES AND DISORDERS",3,Major,Major,Medical,Medicare,Private Health Insurance,,,,Y,117096.92,47610.37
New York City,Kings,7002053,001304,NYU Langone Hospital-Brooklyn,70 or Older,112,M,White,Not Span/Hispanic,7,Emergency,Home w/ Home Health Services,2020,END011,FLUID AND ELECTROLYTE DISORDERS,,,422,HYPOVOLEMIA & RELATED ELECTROLYTE DISORDERS,10,"ENDOCRINE, NUTRITIONAL AND METABOLIC DISEASES AND DISORDERS",3,Major,Major,Medical,Medicare,Private Health Insurance,,,,Y,127627.71,37164.46
New York City,Kings,7002053,001304,NYU Langone Hospital-Brooklyn,50 to 69,112,F,Other Race,Spanish/Hispanic,2,Emergency,Home w/ Home Health Services,2020,END011,FLUID AND ELECTROLYTE DISORDERS,OTR004,ISOLATION PROCEDURES,422,HYPOVOLEMIA & RELATED ELECTROLYTE DISORDERS,10,"ENDOCRINE, NUTRITIONAL AND METABOLIC DISEASES AND DISORDERS",3,Major,Moderate,Medical,Medicare,Medicaid,,,,Y,47754.51,12221.36
New York City,Kings,7002053,001304,NYU Langone Hospital-Brooklyn,70 or Older,112,M,White,Not Span/Hispanic,3,Emergency,Home w/ Home Health Services,2020,END011,FLUID AND ELECTROLYTE DISORDERS,OTR004,ISOLATION PROCEDURES,422,HYPOVOLEMIA & RELATED ELECTROLYTE DISORDERS,10,"ENDOCRINE, NUTRITIONAL AND METABOLIC DISEASES AND DISORDERS",3,Major,Major,Medical,Medicare,,,,,Y,76209.91,18765.16
New York City,Kings,7002053,001304,NYU Langone Hospital-Brooklyn,30 to 49,117,F,Other Race,Spanish/Hispanic,6,Emergency,Home w/ Home Health Services,2020,END011,FLUID AND ELECTROLYTE DISORDERS,ADM017,ADMINISTRATION OF NUTRITIONAL AND ELECTROLYTIC SUBSTANCES,422,HYPOVOLEMIA & RELATED ELECTROLYTE DISORDERS,10,"ENDOCRINE, NUTRITIONAL AND METABOLIC DISEASES AND DISORDERS",3,Major,Moderate,Medical,Medicaid,,,,,Y,76546.76,28309.91
New York City,Kings,7002053,001304,NYU Langone Hospital-Brooklyn,70 or Older,112,M,Other Race,Not Span/Hispanic,1,Emergency,Home or Self Care,2020,END011,FLUID AND ELECTROLYTE DISORDERS,ADM021,"ADMINISTRATION OF THERAPEUTIC SUBSTANCES, NEC",422,HYPOVOLEMIA & RELATED ELECTROLYTE DISORDERS,10,"ENDOCRINE, NUTRITIONAL AND METABOLIC DISEASES AND DISORDERS",3,Major,Major,Medical,Medicare,Private Health Insurance,,,,Y,41577.52,11996.48
New York City,Kings,7002053,001304,NYU Langone Hospital-Brooklyn,30 to 49,112,M,White,Not Span/Hispanic,3,Emergency,Home or Self Care,2020,END011,FLUID AND ELECTROLYTE DISORDERS,ADM021,"ADMINISTRATION OF THERAPEUTIC SUBSTANCES, NEC",422,HYPOVOLEMIA & RELATED ELECTROLYTE DISORDERS,10,"ENDOCRINE, NUTRITIONAL AND METABOLIC DISEASES AND DISORDERS",2,Moderate,Major,Medical,Medicare,Medicaid,,,,Y,41678.54,15341.9
New York City,Kings,7002053,001304,NYU Langone Hospital-Brooklyn,70 or Older,112,F,White,Not Span/Hispanic,3,Emergency,Home w/ Home Health Services,2020,END011,FLUID AND ELECTROLYTE DISORDERS,,,422,HYPOVOLEMIA & RELATED ELECTROLYTE DISORDERS,10,"ENDOCRINE, NUTRITIONAL AND METABOLIC DISEASES AND DISORDERS",2,Moderate,Moderate,Medical,Medicare,Medicaid,,,,Y,65947.46,17387.25
New York City,Kings,7002053,001304,NYU Langone Hospital-Brooklyn,70 or Older,112,M,White,Not Span/Hispanic,8,Emergency,Skilled Nursing Home,2020,END011,FLUID AND ELECTROLYTE DISORDERS,OTR004,ISOLATION PROCEDURES,422,HYPOVOLEMIA & RELATED ELECTROLYTE DISORDERS,10,"ENDOCRINE, NUTRITIONAL AND METABOLIC DISEASES AND DISORDERS",3,Major,Major,Medical,Medicare,,,,,Y,104864.01,39185.62
New York City,Kings,7002053,001304,NYU Langone Hospital-Brooklyn,50 to 69,112,M,Other Race,Not Span/Hispanic,5,Emergency,Home or Self Care,2020,END011,FLUID AND ELECTROLYTE DISORDERS,ADM021,"ADMINISTRATION OF THERAPEUTIC SUBSTANCES, NEC",422,HYPOVOLEMIA & RELATED ELECTROLYTE DISORDERS,10,"ENDOCRINE, NUTRITIONAL AND METABOLIC DISEASES AND DISORDERS",2,Moderate,Major,Medical,Private Health Insurance,,,,,Y,122154.44,28782.45
New York City,Kings,7002053,001304,NYU Langone Hospital-Brooklyn,30 to 49,112,M,Other Race,Not Span/Hispanic,1,Emergency,Home or Self Care,2020,END011,FLUID AND ELECTROLYTE DISORDERS,ADM021,"ADMINISTRATION OF THERAPEUTIC SUBSTANCES, NEC",422,HYPOVOLEMIA & RELATED ELECTROLYTE DISORDERS,10,"ENDOCRINE, NUTRITIONAL AND METABOLIC DISEASES AND DISORDERS",2,Moderate,Moderate,Medical,Medicaid,,,,,Y,24303,6234.54
New York City,Kings,7002053,001304,NYU Langone Hospital-Brooklyn,70 or Older,112,M,White,Not Span/Hispanic,3,Emergency,Home w/ Home Health Services,2020,END011,FLUID AND ELECTROLYTE DISORDERS,,,422,HYPOVOLEMIA & RELATED ELECTROLYTE DISORDERS,10,"ENDOCRINE, NUTRITIONAL AND METABOLIC DISEASES AND DISORDERS",1,Minor,Minor,Medical,Private Health Insurance,,,,,Y,65228.26,16748.17
New York City,Kings,7002053,001304,NYU Langone Hospital-Brooklyn,70 or Older,112,M,White,Not Span/Hispanic,1,Emergency,Home w/ Home Health Services,2020,END011,FLUID AND ELECTROLYTE DISORDERS,ADM021,"ADMINISTRATION OF THERAPEUTIC SUBSTANCES, NEC",422,HYPOVOLEMIA & RELATED ELECTROLYTE DISORDERS,10,"ENDOCRINE, NUTRITIONAL AND METABOLIC DISEASES AND DISORDERS",3,Major,Major,Medical,Medicare,Medicaid,,,,Y,33257.96,10079.88