Hospital Service Area,Hospital County,Operating Certificate Number,Permanent Facility Id,Facility Name,Age Group,Zip Code - 3 digits,Gender,Race,Ethnicity,Length of Stay,Type of Admission,Patient Disposition,Discharge Year,CCS Diagnosis Code,CCS Diagnosis Description,CCS Procedure Code,CCS Procedure Description,APR DRG Code,APR DRG Description,APR MDC Code,APR MDC Description,APR Severity of Illness Code,APR Severity of Illness Description,APR Risk of Mortality,APR Medical Surgical Description,Payment Typology 1,Payment Typology 2,Payment Typology 3,Birth Weight,Abortion Edit Indicator,Emergency Department Indicator,Total Charges,Total Costs
New York City,Queens,7003004,003376,Cohen Children's Medical Center,0 to 17,114,M,Other Race,Not Span/Hispanic,2,Emergency,Home or Self Care,2018,END016,OTHER SPECIFIED AND UNSPECIFIED NUTRITIONAL AND METABOLIC DISORDERS,URN002,KIDNEY AND OTHER URINARY TRACT BIOPSY (NON-ENDOSCOPIC),423,INBORN ERRORS OF METABOLISM,10,"ENDOCRINE, NUTRITIONAL AND METABOLIC DISEASES AND DISORDERS",3,Major,Moderate,Medical,Blue Cross/Blue Shield,Medicaid,Self-Pay,,,false,22404.12,5235.7
New York City,Bronx,7000006,003058,Montefiore Med Center - Jack D Weiler Hosp of A Einstein College Div,18 to 29,104,F,Other Race,Unknown,1,Emergency,Home or Self Care,2018,END010,DISORDERS OF LIPID METABOLISM,IMG007,COMPUTERIZED TOMOGRAPHY (CT) WITHOUT CONTRAST,423,INBORN ERRORS OF METABOLISM,10,"ENDOCRINE, NUTRITIONAL AND METABOLIC DISEASES AND DISORDERS",2,Moderate,Minor,Medical,Medicaid,,,,,true,22526.52,2625.1
Finger Lakes,Monroe,2701005,000413,Strong Memorial Hospital,50 to 69,128,M,White,Not Span/Hispanic,2,Emergency,Home or Self Care,2018,END016,OTHER SPECIFIED AND UNSPECIFIED NUTRITIONAL AND METABOLIC DISORDERS,,,423,INBORN ERRORS OF METABOLISM,10,"ENDOCRINE, NUTRITIONAL AND METABOLIC DISEASES AND DISORDERS",3,Major,Major,Medical,Medicare,Medicare,Self-Pay,,,true,7186.44,3065.1
Long Island,Nassau,2951001,000541,North Shore University Hospital,30 to 49,117,M,White,Not Span/Hispanic,2,Emergency,Left Against Medical Advice,2018,END010,DISORDERS OF LIPID METABOLISM,,,423,INBORN ERRORS OF METABOLISM,10,"ENDOCRINE, NUTRITIONAL AND METABOLIC DISEASES AND DISORDERS",3,Major,Minor,Medical,Private Health Insurance,,,,,true,40485.45,7277.67
Central NY,Onondaga,3301007,000635,University Hospital SUNY Health Science Center,50 to 69,131,F,White,Not Span/Hispanic,5,Emergency,Home or Self Care,2018,END016,OTHER SPECIFIED AND UNSPECIFIED NUTRITIONAL AND METABOLIC DISORDERS,ADM003,ADMINISTRATION OF ALBUMIN AND GLOBULIN,423,INBORN ERRORS OF METABOLISM,10,"ENDOCRINE, NUTRITIONAL AND METABOLIC DISEASES AND DISORDERS",3,Major,Minor,Medical,Medicare,Medicaid,,,,false,115168.43,52766.24
Long Island,Nassau,7003004,000518,Long Island Jewish Valley Stream,70 or Older,114,F,Other Race,Unknown,3,Emergency,Skilled Nursing Home,2018,END016,OTHER SPECIFIED AND UNSPECIFIED NUTRITIONAL AND METABOLIC DISORDERS,,,423,INBORN ERRORS OF METABOLISM,10,"ENDOCRINE, NUTRITIONAL AND METABOLIC DISEASES AND DISORDERS",3,Major,Major,Medical,Medicare,Medicare,,,,true,49855.98,9439.58
New York City,Manhattan,7002054,001464,New York-Presbyterian Hospital - Columbia Presbyterian Center,0 to 17,112,M,Other Race,Not Span/Hispanic,29,Elective,Home w/ Home Health Services,2018,END016,OTHER SPECIFIED AND UNSPECIFIED NUTRITIONAL AND METABOLIC DISORDERS,,,423,INBORN ERRORS OF METABOLISM,10,"ENDOCRINE, NUTRITIONAL AND METABOLIC DISEASES AND DISORDERS",3,Major,Minor,Medical,Medicaid,Medicaid,Self-Pay,,,false,272291.37,58925.81
New York City,Bronx,7000001,001178,BronxCare Hospital Center,70 or Older,104,M,Black/African American,Not Span/Hispanic,4,Emergency,Skilled Nursing Home,2018,END016,OTHER SPECIFIED AND UNSPECIFIED NUTRITIONAL AND METABOLIC DISORDERS,,,423,INBORN ERRORS OF METABOLISM,10,"ENDOCRINE, NUTRITIONAL AND METABOLIC DISEASES AND DISORDERS",2,Moderate,Moderate,Medical,Medicare,Medicare,Medicaid,,,true,11803.59,15122.07
New York City,Manhattan,7002002,001439,Mount Sinai Beth Israel,70 or Older,116,M,Other Race,Not Span/Hispanic,13,Emergency,Skilled Nursing Home,2018,END016,OTHER SPECIFIED AND UNSPECIFIED NUTRITIONAL AND METABOLIC DISORDERS,MAM011,ELECTROENCEPHALOGRAM (EEG),423,INBORN ERRORS OF METABOLISM,10,"ENDOCRINE, NUTRITIONAL AND METABOLIC DISEASES AND DISORDERS",4,Extreme,Major,Medical,Medicare,Miscellaneous/Other,Medicaid,,,true,141096.05,37189.56
New York City,Bronx,7000002,001165,Jacobi Medical Center,30 to 49,104,M,Other Race,Not Span/Hispanic,28,Emergency,Skilled Nursing Home,2018,END016,OTHER SPECIFIED AND UNSPECIFIED NUTRITIONAL AND METABOLIC DISORDERS,GIS017,GASTROSTOMY,423,INBORN ERRORS OF METABOLISM,10,"ENDOCRINE, NUTRITIONAL AND METABOLIC DISEASES AND DISORDERS",4,Extreme,Major,Medical,Medicare,Medicare,,,,true,151647.81,89722.43
Long Island,Nassau,2951001,000541,North Shore University Hospital,30 to 49,114,M,Black/African American,Not Span/Hispanic,1,Emergency,Home or Self Care,2018,END016,OTHER SPECIFIED AND UNSPECIFIED NUTRITIONAL AND METABOLIC DISORDERS,,,423,INBORN ERRORS OF METABOLISM,10,"ENDOCRINE, NUTRITIONAL AND METABOLIC DISEASES AND DISORDERS",2,Moderate,Moderate,Medical,Medicaid,Medicaid,,,,true,17472.53,2976
Hudson Valley,Orange,3523000,000699,Garnet Health Medical Center,30 to 49,109,M,White,Not Span/Hispanic,2,Emergency,Home or Self Care,2018,END016,OTHER SPECIFIED AND UNSPECIFIED NUTRITIONAL AND METABOLIC DISORDERS,,,423,INBORN ERRORS OF METABOLISM,10,"ENDOCRINE, NUTRITIONAL AND METABOLIC DISEASES AND DISORDERS",3,Major,Moderate,Medical,Private Health Insurance,,,,,true,15421.77,3801.85
Long Island,Suffolk,5153000,000913,Huntington Hospital,50 to 69,117,M,Other Race,Not Span/Hispanic,2,Emergency,Left Against Medical Advice,2018,END016,OTHER SPECIFIED AND UNSPECIFIED NUTRITIONAL AND METABOLIC DISORDERS,,,423,INBORN ERRORS OF METABOLISM,10,"ENDOCRINE, NUTRITIONAL AND METABOLIC DISEASES AND DISORDERS",3,Major,Major,Medical,Medicaid,Medicaid,,,,true,20356.97,5458.03
New York City,Queens,7003004,003376,Cohen Children's Medical Center,18 to 29,113,F,White,Not Span/Hispanic,7,Emergency,Home or Self Care,2018,END010,DISORDERS OF LIPID METABOLISM,ADM017,ADMINISTRATION OF NUTRITIONAL AND ELECTROLYTIC SUBSTANCES,423,INBORN ERRORS OF METABOLISM,10,"ENDOCRINE, NUTRITIONAL AND METABOLIC DISEASES AND DISORDERS",3,Major,Minor,Medical,Private Health Insurance,Self-Pay,,,,true,103470,45927.56
New York City,Manhattan,7002024,001456,Mount Sinai Hospital,18 to 29,100,M,Black/African American,Not Span/Hispanic,11,Emergency,Home w/ Home Health Services,2018,END016,OTHER SPECIFIED AND UNSPECIFIED NUTRITIONAL AND METABOLIC DISORDERS,IMG008,ULTRASONOGRAPHY,423,INBORN ERRORS OF METABOLISM,10,"ENDOCRINE, NUTRITIONAL AND METABOLIC DISEASES AND DISORDERS",3,Major,Moderate,Medical,Medicaid,Self-Pay,,,,true,157161.75,42197.05
Hudson Valley,Westchester,5907001,001097,SJRH - St Johns Division,70 or Older,104,M,White,Not Span/Hispanic,2,Emergency,Home or Self Care,2018,END016,OTHER SPECIFIED AND UNSPECIFIED NUTRITIONAL AND METABOLIC DISORDERS,ADM021,"ADMINISTRATION OF THERAPEUTIC SUBSTANCES, NEC",423,INBORN ERRORS OF METABOLISM,10,"ENDOCRINE, NUTRITIONAL AND METABOLIC DISEASES AND DISORDERS",1,Minor,Moderate,Medical,Medicare,Private Health Insurance,,,,false,10519.28,4617.07
New York City,Manhattan,7002024,001456,Mount Sinai Hospital,0 to 17,113,M,Other Race,Spanish/Hispanic,3,Emergency,Home or Self Care,2018,END016,OTHER SPECIFIED AND UNSPECIFIED NUTRITIONAL AND METABOLIC DISORDERS,OTR004,ISOLATION PROCEDURES,423,INBORN ERRORS OF METABOLISM,10,"ENDOCRINE, NUTRITIONAL AND METABOLIC DISEASES AND DISORDERS",3,Major,Moderate,Medical,Medicaid,Medicaid,Self-Pay,,,true,43611.45,10946.69
New York City,Bronx,7000006,001169,Montefiore Medical Center - Henry & Lucy Moses Div,0 to 17,104,F,White,Not Span/Hispanic,1,Emergency,Home or Self Care,2018,END016,OTHER SPECIFIED AND UNSPECIFIED NUTRITIONAL AND METABOLIC DISORDERS,ADM017,ADMINISTRATION OF NUTRITIONAL AND ELECTROLYTIC SUBSTANCES,423,INBORN ERRORS OF METABOLISM,10,"ENDOCRINE, NUTRITIONAL AND METABOLIC DISEASES AND DISORDERS",3,Major,Minor,Medical,Private Health Insurance,,,,,false,12988.5,2942.16
New York City,Manhattan,7002017,001450,Lenox Hill Hospital,18 to 29,100,M,White,Not Span/Hispanic,5,Emergency,Home or Self Care,2018,END010,DISORDERS OF LIPID METABOLISM,,,423,INBORN ERRORS OF METABOLISM,10,"ENDOCRINE, NUTRITIONAL AND METABOLIC DISEASES AND DISORDERS",2,Moderate,Moderate,Medical,Private Health Insurance,,,,,true,101881.03,39401.61
Finger Lakes,Monroe,2701005,000413,Strong Memorial Hospital,18 to 29,144,F,White,Not Span/Hispanic,2,Emergency,Home or Self Care,2018,END016,OTHER SPECIFIED AND UNSPECIFIED NUTRITIONAL AND METABOLIC DISORDERS,,,423,INBORN ERRORS OF METABOLISM,10,"ENDOCRINE, NUTRITIONAL AND METABOLIC DISEASES AND DISORDERS",3,Major,Minor,Medical,Medicaid,,,,,true,9974.34,3715.58
Hudson Valley,Westchester,5902001,001045,White Plains Hospital Center,30 to 49,106,F,Other Race,Not Span/Hispanic,1,Emergency,Home or Self Care,2018,END016,OTHER SPECIFIED AND UNSPECIFIED NUTRITIONAL AND METABOLIC DISORDERS,,,423,INBORN ERRORS OF METABOLISM,10,"ENDOCRINE, NUTRITIONAL AND METABOLIC DISEASES AND DISORDERS",3,Major,Minor,Medical,Blue Cross/Blue Shield,,,,,true,9237,2866.12
New York City,Kings,7001021,001306,New York - Presbyterian Brooklyn Methodist Hospital,30 to 49,112,F,Black/African American,Not Span/Hispanic,6,Emergency,Home or Self Care,2018,END016,OTHER SPECIFIED AND UNSPECIFIED NUTRITIONAL AND METABOLIC DISORDERS,IMG005,MAGNETIC RESONANCE IMAGING (MRI),423,INBORN ERRORS OF METABOLISM,10,"ENDOCRINE, NUTRITIONAL AND METABOLIC DISEASES AND DISORDERS",2,Moderate,Moderate,Medical,Medicare,Medicaid,Self-Pay,,,true,49890.98,11217.7
New York City,Manhattan,7002021,001454,Metropolitan Hospital Center,50 to 69,100,M,Other Race,Spanish/Hispanic,4,Emergency,Home or Self Care,2018,END010,DISORDERS OF LIPID METABOLISM,ADM021,"ADMINISTRATION OF THERAPEUTIC SUBSTANCES, NEC",423,INBORN ERRORS OF METABOLISM,10,"ENDOCRINE, NUTRITIONAL AND METABOLIC DISEASES AND DISORDERS",2,Moderate,Minor,Medical,Medicaid,Medicaid,,,,true,22427.02,18119.91
New York City,Manhattan,7002020,001453,Memorial Hospital for Cancer and Allied Diseases,50 to 69,OOS,F,White,Not Span/Hispanic,2,Emergency,Home or Self Care,2018,END016,OTHER SPECIFIED AND UNSPECIFIED NUTRITIONAL AND METABOLIC DISORDERS,,,423,INBORN ERRORS OF METABOLISM,10,"ENDOCRINE, NUTRITIONAL AND METABOLIC DISEASES AND DISORDERS",2,Moderate,Major,Medical,Medicare,Private Health Insurance,,,,true,28994.51,10926.27
New York City,Queens,7003004,001630,Long Island Jewish Medical Center,30 to 49,114,M,Other Race,Not Span/Hispanic,3,Emergency,Home w/ Home Health Services,2018,END010,DISORDERS OF LIPID METABOLISM,,,423,INBORN ERRORS OF METABOLISM,10,"ENDOCRINE, NUTRITIONAL AND METABOLIC DISEASES AND DISORDERS",2,Moderate,Moderate,Medical,Blue Cross/Blue Shield,Self-Pay,,,,false,52010,19251.35
New York City,Manhattan,7002054,001437,New York-Presbyterian/Lower Manhattan Hospital,50 to 69,104,F,White,Not Span/Hispanic,24,Emergency,Skilled Nursing Home,2018,END016,OTHER SPECIFIED AND UNSPECIFIED NUTRITIONAL AND METABOLIC DISORDERS,ESA001,HEMODIALYSIS,423,INBORN ERRORS OF METABOLISM,10,"ENDOCRINE, NUTRITIONAL AND METABOLIC DISEASES AND DISORDERS",3,Major,Major,Medical,Medicaid,Self-Pay,,,,true,246964.07,55905.03
New York City,Kings,7001016,001301,Kings County Hospital Center,0 to 17,112,F,Black/African American,Not Span/Hispanic,2,Emergency,Home or Self Care,2018,END016,OTHER SPECIFIED AND UNSPECIFIED NUTRITIONAL AND METABOLIC DISORDERS,,,423,INBORN ERRORS OF METABOLISM,10,"ENDOCRINE, NUTRITIONAL AND METABOLIC DISEASES AND DISORDERS",2,Moderate,Moderate,Medical,Medicaid,Medicaid,,,,true,12738.52,9048.95
New York City,Kings,7001045,001692,Woodhull Medical & Mental Health Center,50 to 69,112,M,Black/African American,Not Span/Hispanic,7,Emergency,Hospice - Medical Facility,2018,END016,OTHER SPECIFIED AND UNSPECIFIED NUTRITIONAL AND METABOLIC DISORDERS,,,423,INBORN ERRORS OF METABOLISM,10,"ENDOCRINE, NUTRITIONAL AND METABOLIC DISEASES AND DISORDERS",4,Extreme,Major,Medical,Medicare,Medicare,Medicaid,,,true,38622.47,30155.77
New York City,Bronx,7000006,001169,Montefiore Medical Center - Henry & Lucy Moses Div,30 to 49,104,F,Other Race,Spanish/Hispanic,10,Emergency,Home or Self Care,2018,END016,OTHER SPECIFIED AND UNSPECIFIED NUTRITIONAL AND METABOLIC DISORDERS,ADM015,ADMINISTRATION OF ANTIBIOTICS,423,INBORN ERRORS OF METABOLISM,10,"ENDOCRINE, NUTRITIONAL AND METABOLIC DISEASES AND DISORDERS",2,Moderate,Minor,Medical,Medicaid,,,,,true,98076.43,20350.42
Western NY,Erie,1401014,000208,John R. Oishei Children's Hospital,0 to 17,141,M,White,Not Span/Hispanic,1,Emergency,Home or Self Care,2018,END016,OTHER SPECIFIED AND UNSPECIFIED NUTRITIONAL AND METABOLIC DISORDERS,ADM017,ADMINISTRATION OF NUTRITIONAL AND ELECTROLYTIC SUBSTANCES,423,INBORN ERRORS OF METABOLISM,10,"ENDOCRINE, NUTRITIONAL AND METABOLIC DISEASES AND DISORDERS",3,Major,Minor,Medical,Blue Cross/Blue Shield,Medicaid,Self-Pay,,,true,10951.12,4276.42
Central NY,Onondaga,3301008,000636,Crouse Hospital,70 or Older,130,F,White,Not Span/Hispanic,8,Emergency,Home w/ Home Health Services,2018,END010,DISORDERS OF LIPID METABOLISM,GIS006,PARACENTESIS,423,INBORN ERRORS OF METABOLISM,10,"ENDOCRINE, NUTRITIONAL AND METABOLIC DISEASES AND DISORDERS",2,Moderate,Moderate,Medical,Private Health Insurance,,,,,true,21730.16,9441.39
Hudson Valley,Westchester,5902001,001045,White Plains Hospital Center,30 to 49,OOS,M,Other Race,Not Span/Hispanic,1,Emergency,Home or Self Care,2018,END016,OTHER SPECIFIED AND UNSPECIFIED NUTRITIONAL AND METABOLIC DISORDERS,,,423,INBORN ERRORS OF METABOLISM,10,"ENDOCRINE, NUTRITIONAL AND METABOLIC DISEASES AND DISORDERS",2,Moderate,Minor,Medical,Private Health Insurance,,,,,true,12275,2903.36
Finger Lakes,Ontario,3402000,000671,Geneva General Hospital,30 to 49,145,F,White,Not Span/Hispanic,6,Urgent,Home w/ Home Health Services,2018,END016,OTHER SPECIFIED AND UNSPECIFIED NUTRITIONAL AND METABOLIC DISORDERS,ADM003,ADMINISTRATION OF ALBUMIN AND GLOBULIN,423,INBORN ERRORS OF METABOLISM,10,"ENDOCRINE, NUTRITIONAL AND METABOLIC DISEASES AND DISORDERS",3,Major,Major,Medical,Medicare,Medicaid,,,,false,17209.77,8718.29
New York City,Queens,7003004,003376,Cohen Children's Medical Center,0 to 17,114,M,Other Race,Spanish/Hispanic,2,Emergency,Home or Self Care,2018,END016,OTHER SPECIFIED AND UNSPECIFIED NUTRITIONAL AND METABOLIC DISORDERS,ESA003,MECHANICAL VENTILATION,423,INBORN ERRORS OF METABOLISM,10,"ENDOCRINE, NUTRITIONAL AND METABOLIC DISEASES AND DISORDERS",4,Extreme,Major,Medical,Medicaid,Medicaid,Self-Pay,,,true,31000.4,10534.81
New York City,Manhattan,7002024,001456,Mount Sinai Hospital,18 to 29,112,M,White,Not Span/Hispanic,13,Emergency,Home or Self Care,2018,END016,OTHER SPECIFIED AND UNSPECIFIED NUTRITIONAL AND METABOLIC DISORDERS,MAM007,ELECTROCARDIOGRAM (ECG),423,INBORN ERRORS OF METABOLISM,10,"ENDOCRINE, NUTRITIONAL AND METABOLIC DISEASES AND DISORDERS",3,Major,Major,Medical,Blue Cross/Blue Shield,Self-Pay,,,,true,246180.25,56140.42
New York City,Queens,7003004,001630,Long Island Jewish Medical Center,30 to 49,110,M,Other Race,Not Span/Hispanic,2,Emergency,Home or Self Care,2018,END010,DISORDERS OF LIPID METABOLISM,,,423,INBORN ERRORS OF METABOLISM,10,"ENDOCRINE, NUTRITIONAL AND METABOLIC DISEASES AND DISORDERS",2,Moderate,Minor,Medical,Medicaid,Medicaid,Self-Pay,,,false,28712.33,5364.17
New York City,Manhattan,7002032,001466,Mount Sinai West,50 to 69,100,M,White,Not Span/Hispanic,11,Emergency,Skilled Nursing Home,2018,END016,OTHER SPECIFIED AND UNSPECIFIED NUTRITIONAL AND METABOLIC DISORDERS,MAM011,ELECTROENCEPHALOGRAM (EEG),423,INBORN ERRORS OF METABOLISM,10,"ENDOCRINE, NUTRITIONAL AND METABOLIC DISEASES AND DISORDERS",2,Moderate,Major,Medical,Medicare,Medicare,Self-Pay,,,true,97698.96,23552.96
Long Island,Suffolk,5123000,000885,Long Island Community Hospital,18 to 29,119,F,White,Not Span/Hispanic,4,Emergency,Home or Self Care,2018,END016,OTHER SPECIFIED AND UNSPECIFIED NUTRITIONAL AND METABOLIC DISORDERS,,,423,INBORN ERRORS OF METABOLISM,10,"ENDOCRINE, NUTRITIONAL AND METABOLIC DISEASES AND DISORDERS",3,Major,Minor,Medical,Private Health Insurance,Medicaid,,,,true,39172.1,5924.56
Finger Lakes,Monroe,2701005,000413,Strong Memorial Hospital,50 to 69,144,F,White,Not Span/Hispanic,7,Emergency,Home or Self Care,2018,END016,OTHER SPECIFIED AND UNSPECIFIED NUTRITIONAL AND METABOLIC DISORDERS,,,423,INBORN ERRORS OF METABOLISM,10,"ENDOCRINE, NUTRITIONAL AND METABOLIC DISEASES AND DISORDERS",3,Major,Moderate,Medical,Medicaid,Medicaid,Self-Pay,,,true,16400.74,8584.1
New York City,Bronx,7000006,001169,Montefiore Medical Center - Henry & Lucy Moses Div,0 to 17,104,M,Other Race,Unknown,1,Emergency,Home or Self Care,2018,END016,OTHER SPECIFIED AND UNSPECIFIED NUTRITIONAL AND METABOLIC DISORDERS,ADM007,INTRAVENOUS INDUCTION OF LABOR,423,INBORN ERRORS OF METABOLISM,10,"ENDOCRINE, NUTRITIONAL AND METABOLIC DISEASES AND DISORDERS",2,Moderate,Minor,Medical,Medicaid,,,,,true,18277.25,3520.34
New York City,Queens,7003010,001637,New York - Presbyterian/Queens,30 to 49,114,M,Other Race,Spanish/Hispanic,6,Emergency,Home or Self Care,2018,END010,DISORDERS OF LIPID METABOLISM,CAR024,VENOUS AND ARTERIAL CATHETER PLACEMENT,423,INBORN ERRORS OF METABOLISM,10,"ENDOCRINE, NUTRITIONAL AND METABOLIC DISEASES AND DISORDERS",3,Major,Moderate,Medical,Medicare,Medicare,Self-Pay,,,true,87766.07,22811.74
Southern Tier,Broome,0301001,000043,Our Lady of Lourdes Memorial Hospital,0 to 17,137,M,White,Not Span/Hispanic,1,Emergency,Home or Self Care,2018,END016,OTHER SPECIFIED AND UNSPECIFIED NUTRITIONAL AND METABOLIC DISORDERS,,,423,INBORN ERRORS OF METABOLISM,10,"ENDOCRINE, NUTRITIONAL AND METABOLIC DISEASES AND DISORDERS",2,Moderate,Minor,Medical,Blue Cross/Blue Shield,Blue Cross/Blue Shield,Self-Pay,,,true,6403.43,2441.72
New York City,Richmond,7004010,001738,Richmond University Medical Center,50 to 69,103,M,White,Not Span/Hispanic,3,Emergency,Facility w/ Custodial/Supportive Care,2018,END016,OTHER SPECIFIED AND UNSPECIFIED NUTRITIONAL AND METABOLIC DISORDERS,,,423,INBORN ERRORS OF METABOLISM,10,"ENDOCRINE, NUTRITIONAL AND METABOLIC DISEASES AND DISORDERS",3,Major,Major,Medical,Medicare,Self-Pay,Self-Pay,,,true,22255.39,5389.67
Long Island,Nassau,2950002,000528,Nassau University Medical Center,50 to 69,115,M,White,Not Span/Hispanic,4,Emergency,Home or Self Care,2018,END016,OTHER SPECIFIED AND UNSPECIFIED NUTRITIONAL AND METABOLIC DISORDERS,MAM007,ELECTROCARDIOGRAM (ECG),423,INBORN ERRORS OF METABOLISM,10,"ENDOCRINE, NUTRITIONAL AND METABOLIC DISEASES AND DISORDERS",2,Moderate,Major,Medical,Medicare,Self-Pay,,,,false,35933.08,10550.94
Long Island,Nassau,2950002,000528,Nassau University Medical Center,30 to 49,117,M,White,Not Span/Hispanic,1,Emergency,Left Against Medical Advice,2018,END010,DISORDERS OF LIPID METABOLISM,ADM007,INTRAVENOUS INDUCTION OF LABOR,423,INBORN ERRORS OF METABOLISM,10,"ENDOCRINE, NUTRITIONAL AND METABOLIC DISEASES AND DISORDERS",2,Moderate,Minor,Medical,Blue Cross/Blue Shield,Self-Pay,,,,false,10156.23,2845.52
New York City,Queens,7003010,001637,New York - Presbyterian/Queens,18 to 29,113,M,White,Not Span/Hispanic,3,Emergency,Home or Self Care,2018,END010,DISORDERS OF LIPID METABOLISM,ADM015,ADMINISTRATION OF ANTIBIOTICS,423,INBORN ERRORS OF METABOLISM,10,"ENDOCRINE, NUTRITIONAL AND METABOLIC DISEASES AND DISORDERS",2,Moderate,Minor,Medical,Blue Cross/Blue Shield,Self-Pay,,,,true,23129.22,6202.93
Long Island,Suffolk,5151001,000245,Stony Brook University Hospital,30 to 49,117,M,White,Not Span/Hispanic,2,Emergency,Home or Self Care,2018,END010,DISORDERS OF LIPID METABOLISM,,,423,INBORN ERRORS OF METABOLISM,10,"ENDOCRINE, NUTRITIONAL AND METABOLIC DISEASES AND DISORDERS",1,Minor,Minor,Medical,Private Health Insurance,,,,,true,23488,6229.98
New York City,Bronx,7000006,001169,Montefiore Medical Center - Henry & Lucy Moses Div,0 to 17,109,F,White,Not Span/Hispanic,2,Emergency,Home or Self Care,2018,BLD008,IMMUNITY DISORDERS,ADM021,"ADMINISTRATION OF THERAPEUTIC SUBSTANCES, NEC",423,INBORN ERRORS OF METABOLISM,10,"ENDOCRINE, NUTRITIONAL AND METABOLIC DISEASES AND DISORDERS",2,Moderate,Minor,Medical,Medicaid,,,,,true,37509.06,7085.21
Hudson Valley,Westchester,5907001,001097,SJRH - St Johns Division,70 or Older,104,M,White,Not Span/Hispanic,2,Emergency,Home or Self Care,2018,END016,OTHER SPECIFIED AND UNSPECIFIED NUTRITIONAL AND METABOLIC DISORDERS,,,423,INBORN ERRORS OF METABOLISM,10,"ENDOCRINE, NUTRITIONAL AND METABOLIC DISEASES AND DISORDERS",1,Minor,Minor,Medical,Medicare,Private Health Insurance,,,,false,10268.37,4587.04
New York City,Bronx,7000006,003058,Montefiore Med Center - Jack D Weiler Hosp of A Einstein College Div,18 to 29,104,M,Other Race,Spanish/Hispanic,4,Emergency,Home w/ Home Health Services,2018,END010,DISORDERS OF LIPID METABOLISM,,,423,INBORN ERRORS OF METABOLISM,10,"ENDOCRINE, NUTRITIONAL AND METABOLIC DISEASES AND DISORDERS",2,Moderate,Minor,Medical,Medicaid,,,,,true,43385.63,8514.59
New York City,Manhattan,7002017,001450,Lenox Hill Hospital,70 or Older,113,F,White,Not Span/Hispanic,1,Emergency,Home or Self Care,2018,END010,DISORDERS OF LIPID METABOLISM,,,423,INBORN ERRORS OF METABOLISM,10,"ENDOCRINE, NUTRITIONAL AND METABOLIC DISEASES AND DISORDERS",1,Minor,Minor,Medical,Private Health Insurance,Medicare,,,,true,17346,3000.39
Long Island,Suffolk,5154001,000925,Good Samaritan Hospital Medical Center,30 to 49,117,F,White,Not Span/Hispanic,4,Emergency,Home or Self Care,2018,END016,OTHER SPECIFIED AND UNSPECIFIED NUTRITIONAL AND METABOLIC DISORDERS,MAM011,ELECTROENCEPHALOGRAM (EEG),423,INBORN ERRORS OF METABOLISM,10,"ENDOCRINE, NUTRITIONAL AND METABOLIC DISEASES AND DISORDERS",2,Moderate,Minor,Medical,Medicare,Medicaid,,,,true,42606,6987.61
Southern Tier,Broome,0303001,000058,United Health Services Hospitals Inc. - Wilson Medical Center,50 to 69,138,F,White,Not Span/Hispanic,3,Emergency,Home or Self Care,2018,END016,OTHER SPECIFIED AND UNSPECIFIED NUTRITIONAL AND METABOLIC DISORDERS,,,423,INBORN ERRORS OF METABOLISM,10,"ENDOCRINE, NUTRITIONAL AND METABOLIC DISEASES AND DISORDERS",3,Major,Minor,Medical,Medicare,Medicare,,,,true,41282,15936.56
Southern Tier,Broome,0303001,000058,United Health Services Hospitals Inc. - Wilson Medical Center,70 or Older,138,M,White,Not Span/Hispanic,4,Emergency,Home w/ Home Health Services,2018,END016,OTHER SPECIFIED AND UNSPECIFIED NUTRITIONAL AND METABOLIC DISORDERS,GIS002,COLONOSCOPY AND PROCTOSCOPY WITH BIOPSY,423,INBORN ERRORS OF METABOLISM,10,"ENDOCRINE, NUTRITIONAL AND METABOLIC DISEASES AND DISORDERS",3,Major,Major,Medical,Medicare,Medicare,Blue Cross/Blue Shield,,,true,16684.82,8161.77
Southern Tier,Broome,0301001,000043,Our Lady of Lourdes Memorial Hospital,18 to 29,138,F,White,Not Span/Hispanic,1,Emergency,Home or Self Care,2018,END016,OTHER SPECIFIED AND UNSPECIFIED NUTRITIONAL AND METABOLIC DISORDERS,,,423,INBORN ERRORS OF METABOLISM,10,"ENDOCRINE, NUTRITIONAL AND METABOLIC DISEASES AND DISORDERS",2,Moderate,Minor,Medical,Blue Cross/Blue Shield,Blue Cross/Blue Shield,Self-Pay,,,true,8052.03,1602.92
New York City,Manhattan,7002024,001456,Mount Sinai Hospital,0 to 17,113,M,Other Race,Spanish/Hispanic,2,Emergency,Home or Self Care,2018,END016,OTHER SPECIFIED AND UNSPECIFIED NUTRITIONAL AND METABOLIC DISORDERS,CAR024,VENOUS AND ARTERIAL CATHETER PLACEMENT,423,INBORN ERRORS OF METABOLISM,10,"ENDOCRINE, NUTRITIONAL AND METABOLIC DISEASES AND DISORDERS",2,Moderate,Moderate,Medical,Medicaid,Medicaid,Self-Pay,,,true,21571.58,17641.08