Hospital Service Area,Hospital County,Operating Certificate Number,Permanent Facility Id,Facility Name,Age Group,Zip Code - 3 digits,Gender,Race,Ethnicity,Length of Stay,Type of Admission,Patient Disposition,Discharge Year,CCS Diagnosis Code,CCS Diagnosis Description,CCS Procedure Code,CCS Procedure Description,APR DRG Code,APR DRG Description,APR MDC Code,APR MDC Description,APR Severity of Illness Code,APR Severity of Illness Description,APR Risk of Mortality,APR Medical Surgical Description,Payment Typology 1,Payment Typology 2,Payment Typology 3,Birth Weight,Abortion Edit Indicator,Emergency Department Indicator,Total Charges,Total Costs
New York City,Kings,7002053,001304,NYU Langone Hospital-Brooklyn,30 to 49,112,M,White,Not Span/Hispanic,3,Emergency,Home or Self Care,2019,END010,DISORDERS OF LIPID METABOLISM,SUD002,PHARMACOTHERAPY FOR SUBSTANCE USE,423,INBORN ERRORS OF METABOLISM,10,"ENDOCRINE, NUTRITIONAL AND METABOLIC DISEASES AND DISORDERS",3,Major,Moderate,Medical,Private Health Insurance,,,,,true,42409.64,13016.6
New York City,Kings,7002053,001304,NYU Langone Hospital-Brooklyn,30 to 49,112,F,White,Not Span/Hispanic,5,Emergency,Home or Self Care,2019,BLD008,IMMUNITY DISORDERS,,,423,INBORN ERRORS OF METABOLISM,10,"ENDOCRINE, NUTRITIONAL AND METABOLIC DISEASES AND DISORDERS",1,Minor,Minor,Medical,Federal/State/Local/VA,,,,,true,51843.55,17400.54
New York City,Kings,7002053,001304,NYU Langone Hospital-Brooklyn,30 to 49,112,F,White,Not Span/Hispanic,12,Emergency,Home or Self Care,2019,BLD008,IMMUNITY DISORDERS,,,423,INBORN ERRORS OF METABOLISM,10,"ENDOCRINE, NUTRITIONAL AND METABOLIC DISEASES AND DISORDERS",2,Moderate,Minor,Medical,Federal/State/Local/VA,,,,,true,114812.16,46146.63
New York City,Kings,7002053,001304,NYU Langone Hospital-Brooklyn,50 to 69,112,M,White,Unknown,2,Emergency,Home or Self Care,2019,END016,OTHER SPECIFIED AND UNSPECIFIED NUTRITIONAL AND METABOLIC DISORDERS,,,423,INBORN ERRORS OF METABOLISM,10,"ENDOCRINE, NUTRITIONAL AND METABOLIC DISEASES AND DISORDERS",2,Moderate,Minor,Medical,Private Health Insurance,,,,,true,34549.15,8941.69
New York City,Kings,7002053,001304,NYU Langone Hospital-Brooklyn,70 or Older,100,M,Black/African American,Not Span/Hispanic,3,Emergency,Left Against Medical Advice,2019,END016,OTHER SPECIFIED AND UNSPECIFIED NUTRITIONAL AND METABOLIC DISORDERS,,,423,INBORN ERRORS OF METABOLISM,10,"ENDOCRINE, NUTRITIONAL AND METABOLIC DISEASES AND DISORDERS",3,Major,Moderate,Medical,Medicare,Medicaid,,,,true,34076.93,11415.2
New York City,Kings,7002053,001304,NYU Langone Hospital-Brooklyn,70 or Older,112,F,Other Race,Not Span/Hispanic,3,Emergency,Home w/ Home Health Services,2019,END016,OTHER SPECIFIED AND UNSPECIFIED NUTRITIONAL AND METABOLIC DISORDERS,,,423,INBORN ERRORS OF METABOLISM,10,"ENDOCRINE, NUTRITIONAL AND METABOLIC DISEASES AND DISORDERS",3,Major,Moderate,Medical,Medicare,,,,,true,38562.9,11979.48
New York City,Kings,7002053,001304,NYU Langone Hospital-Brooklyn,50 to 69,112,F,Other Race,Spanish/Hispanic,2,Elective,Home or Self Care,2019,END010,DISORDERS OF LIPID METABOLISM,MAM011,ELECTROENCEPHALOGRAM (EEG),423,INBORN ERRORS OF METABOLISM,10,"ENDOCRINE, NUTRITIONAL AND METABOLIC DISEASES AND DISORDERS",2,Moderate,Minor,Medical,Medicare,Medicaid,,,,false,49274.11,13283.41
New York City,Kings,7002053,001304,NYU Langone Hospital-Brooklyn,50 to 69,100,M,White,Not Span/Hispanic,3,Emergency,Skilled Nursing Home,2019,END016,OTHER SPECIFIED AND UNSPECIFIED NUTRITIONAL AND METABOLIC DISORDERS,,,423,INBORN ERRORS OF METABOLISM,10,"ENDOCRINE, NUTRITIONAL AND METABOLIC DISEASES AND DISORDERS",3,Major,Moderate,Medical,Medicare,Medicare,,,,true,62370.3,17552.29
New York City,Kings,7002053,001304,NYU Langone Hospital-Brooklyn,50 to 69,112,F,Other Race,Spanish/Hispanic,2,Emergency,Home or Self Care,2019,END016,OTHER SPECIFIED AND UNSPECIFIED NUTRITIONAL AND METABOLIC DISORDERS,ESA001,HEMODIALYSIS,423,INBORN ERRORS OF METABOLISM,10,"ENDOCRINE, NUTRITIONAL AND METABOLIC DISEASES AND DISORDERS",3,Major,Major,Medical,Medicaid,,,,,true,43727.87,10201.65
