Hospital Service Area,Hospital County,Operating Certificate Number,Permanent Facility Id,Facility Name,Age Group,Zip Code - 3 digits,Gender,Race,Ethnicity,Length of Stay,Type of Admission,Patient Disposition,Discharge Year,CCS Diagnosis Code,CCS Diagnosis Description,CCS Procedure Code,CCS Procedure Description,APR DRG Code,APR DRG Description,APR MDC Code,APR MDC Description,APR Severity of Illness Code,APR Severity of Illness Description,APR Risk of Mortality,APR Medical Surgical Description,Payment Typology 1,Payment Typology 2,Payment Typology 3,Birth Weight,Abortion Edit Indicator,Emergency Department Indicator,Total Charges,Total Costs
New York City,Manhattan,7002001,001438,Bellevue Hospital Center,50 to 69,100,M,Black/African American,Not Span/Hispanic,1,Emergency,Home or Self Care,2019,END015,OTHER SPECIFIED AND UNSPECIFIED ENDOCRINE DISORDERS,SUD001,SUBSTANCE USE DETOXIFICATION,424,OTHER ENDOCRINE DISORDERS,10,"ENDOCRINE, NUTRITIONAL AND METABOLIC DISEASES AND DISORDERS",1,Minor,Minor,Medical,Medicaid,Medicaid,,,,true,7794.54,5180.25
New York City,Manhattan,7002001,001438,Bellevue Hospital Center,50 to 69,104,M,Other Race,Not Span/Hispanic,6,Emergency,Home or Self Care,2019,NEO073,BENIGN NEOPLASMS,HEP003,DIAGNOSTIC ERCP WITH OR WITHOUT BIOPSY,424,OTHER ENDOCRINE DISORDERS,10,"ENDOCRINE, NUTRITIONAL AND METABOLIC DISEASES AND DISORDERS",3,Major,Moderate,Medical,Medicaid,,,,,false,46260.13,30744.48
New York City,Manhattan,7002001,001438,Bellevue Hospital Center,30 to 49,100,M,White,Not Span/Hispanic,1,Emergency,Home or Self Care,2019,END015,OTHER SPECIFIED AND UNSPECIFIED ENDOCRINE DISORDERS,SUD001,SUBSTANCE USE DETOXIFICATION,424,OTHER ENDOCRINE DISORDERS,10,"ENDOCRINE, NUTRITIONAL AND METABOLIC DISEASES AND DISORDERS",1,Minor,Minor,Medical,Medicaid,,,,,true,6643.16,4415.04
New York City,Manhattan,7002001,001438,Bellevue Hospital Center,30 to 49,100,M,Other Race,Not Span/Hispanic,3,Emergency,Home or Self Care,2019,END015,OTHER SPECIFIED AND UNSPECIFIED ENDOCRINE DISORDERS,IMG008,ULTRASONOGRAPHY,424,OTHER ENDOCRINE DISORDERS,10,"ENDOCRINE, NUTRITIONAL AND METABOLIC DISEASES AND DISORDERS",2,Moderate,Minor,Medical,Medicaid,Medicaid,,,,true,19780.09,13145.85
New York City,Manhattan,7002001,001438,Bellevue Hospital Center,30 to 49,114,F,Other Race,Spanish/Hispanic,23,Emergency,Home or Self Care,2019,NEO053,ENDOCRINE SYSTEM CANCERS - ADRENOCORTICAL,IMG005,MAGNETIC RESONANCE IMAGING (MRI),424,OTHER ENDOCRINE DISORDERS,10,"ENDOCRINE, NUTRITIONAL AND METABOLIC DISEASES AND DISORDERS",4,Extreme,Major,Medical,Medicaid,,,,,false,125787.75,83598.54
New York City,Manhattan,7002001,001438,Bellevue Hospital Center,0 to 17,112,F,Other Race,Not Span/Hispanic,1,Elective,Home or Self Care,2019,END015,OTHER SPECIFIED AND UNSPECIFIED ENDOCRINE DISORDERS,FRS007,FEMALE GENITAL TRACT REPAIR (EXCLUDING VULVA),424,OTHER ENDOCRINE DISORDERS,10,"ENDOCRINE, NUTRITIONAL AND METABOLIC DISEASES AND DISORDERS",1,Minor,Minor,Medical,Medicaid,Medicaid,,,,false,2713.73,1803.54
New York City,Manhattan,7002001,001438,Bellevue Hospital Center,30 to 49,100,M,Black/African American,Spanish/Hispanic,1,Emergency,Left Against Medical Advice,2019,END015,OTHER SPECIFIED AND UNSPECIFIED ENDOCRINE DISORDERS,ADM021,"ADMINISTRATION OF THERAPEUTIC SUBSTANCES, NEC",424,OTHER ENDOCRINE DISORDERS,10,"ENDOCRINE, NUTRITIONAL AND METABOLIC DISEASES AND DISORDERS",1,Minor,Minor,Medical,Medicaid,,,,,true,10434.35,6934.67
New York City,Manhattan,7002001,001438,Bellevue Hospital Center,70 or Older,100,M,Black/African American,Not Span/Hispanic,2,Emergency,Home or Self Care,2019,END015,OTHER SPECIFIED AND UNSPECIFIED ENDOCRINE DISORDERS,ADM021,"ADMINISTRATION OF THERAPEUTIC SUBSTANCES, NEC",424,OTHER ENDOCRINE DISORDERS,10,"ENDOCRINE, NUTRITIONAL AND METABOLIC DISEASES AND DISORDERS",1,Minor,Moderate,Medical,Medicare,Medicaid,,,,true,14320.73,9517.56
New York City,Manhattan,7002001,001438,Bellevue Hospital Center,50 to 69,113,M,Other Race,Spanish/Hispanic,13,Emergency,Home or Self Care,2019,END015,OTHER SPECIFIED AND UNSPECIFIED ENDOCRINE DISORDERS,ADM007,INTRAVENOUS INDUCTION OF LABOR,424,OTHER ENDOCRINE DISORDERS,10,"ENDOCRINE, NUTRITIONAL AND METABOLIC DISEASES AND DISORDERS",3,Major,Moderate,Medical,Medicaid,,,,,true,93724.21,62289.11
New York City,Manhattan,7002001,001438,Bellevue Hospital Center,70 or Older,104,F,Black/African American,Not Span/Hispanic,14,Emergency,Home or Self Care,2019,END015,OTHER SPECIFIED AND UNSPECIFIED ENDOCRINE DISORDERS,IMG008,ULTRASONOGRAPHY,424,OTHER ENDOCRINE DISORDERS,10,"ENDOCRINE, NUTRITIONAL AND METABOLIC DISEASES AND DISORDERS",2,Moderate,Minor,Medical,Medicaid,,,,,true,98640.29,65556.34
New York City,Manhattan,7002001,001438,Bellevue Hospital Center,30 to 49,113,M,Other Race,Spanish/Hispanic,1,Emergency,Left Against Medical Advice,2019,NEO072,NEOPLASMS OF UNSPECIFIED NATURE OR UNCERTAIN BEHAVIOR,IMG007,COMPUTERIZED TOMOGRAPHY (CT) WITHOUT CONTRAST,424,OTHER ENDOCRINE DISORDERS,10,"ENDOCRINE, NUTRITIONAL AND METABOLIC DISEASES AND DISORDERS",3,Major,Moderate,Medical,Medicaid,,,,,true,13214.37,8782.27
New York City,Manhattan,7002001,001438,Bellevue Hospital Center,70 or Older,114,M,White,Spanish/Hispanic,7,Emergency,Home or Self Care,2019,SYM017,ABNORMAL FINDINGS WITHOUT DIAGNOSIS,IMG009,PLAIN RADIOGRAPHY,424,OTHER ENDOCRINE DISORDERS,10,"ENDOCRINE, NUTRITIONAL AND METABOLIC DISEASES AND DISORDERS",3,Major,Major,Medical,Medicaid,,,,,true,45438.13,30198.18
