Hospital Service Area,Hospital County,Operating Certificate Number,Permanent Facility Id,Facility Name,Age Group,Zip Code - 3 digits,Gender,Race,Ethnicity,Length of Stay,Type of Admission,Patient Disposition,Discharge Year,CCS Diagnosis Code,CCS Diagnosis Description,CCS Procedure Code,CCS Procedure Description,APR DRG Code,APR DRG Description,APR MDC Code,APR MDC Description,APR Severity of Illness Code,APR Severity of Illness Description,APR Risk of Mortality,APR Medical Surgical Description,Payment Typology 1,Payment Typology 2,Payment Typology 3,Birth Weight,Abortion Edit Indicator,Emergency Department Indicator,Total Charges,Total Costs
Long Island,Nassau,2908000,000511,NYU Langone Hospital-Long Island,0 to 17,117,M,White,Not Span/Hispanic,1,Emergency,Home or Self Care,2020,END015,OTHER SPECIFIED AND UNSPECIFIED ENDOCRINE DISORDERS,,,424,OTHER ENDOCRINE DISORDERS,10,"ENDOCRINE, NUTRITIONAL AND METABOLIC DISEASES AND DISORDERS",2,Moderate,Moderate,Medical,Blue Cross/Blue Shield,,,,,Y,16364.63,3402.97
Long Island,Nassau,2908000,000511,NYU Langone Hospital-Long Island,70 or Older,110,M,White,Not Span/Hispanic,6,Emergency,Skilled Nursing Home,2020,END015,OTHER SPECIFIED AND UNSPECIFIED ENDOCRINE DISORDERS,SKB009,NAIL PROCEDURES,424,OTHER ENDOCRINE DISORDERS,10,"ENDOCRINE, NUTRITIONAL AND METABOLIC DISEASES AND DISORDERS",3,Major,Major,Medical,Medicare,Medicare,,,,Y,79340.05,22870.5
Long Island,Nassau,2908000,000511,NYU Langone Hospital-Long Island,50 to 69,110,M,White,Not Span/Hispanic,7,Emergency,Home or Self Care,2020,END015,OTHER SPECIFIED AND UNSPECIFIED ENDOCRINE DISORDERS,OTR004,ISOLATION PROCEDURES,424,OTHER ENDOCRINE DISORDERS,10,"ENDOCRINE, NUTRITIONAL AND METABOLIC DISEASES AND DISORDERS",3,Major,Major,Medical,Medicare,Blue Cross/Blue Shield,,,,Y,82174.87,24997.19
Long Island,Nassau,2908000,000511,NYU Langone Hospital-Long Island,50 to 69,115,F,Black/African American,Not Span/Hispanic,4,Emergency,Home or Self Care,2020,END015,OTHER SPECIFIED AND UNSPECIFIED ENDOCRINE DISORDERS,,,424,OTHER ENDOCRINE DISORDERS,10,"ENDOCRINE, NUTRITIONAL AND METABOLIC DISEASES AND DISORDERS",1,Minor,Minor,Medical,Medicare,Private Health Insurance,,,,Y,188033.17,20949.22
Long Island,Nassau,2908000,000511,NYU Langone Hospital-Long Island,30 to 49,115,M,White,Not Span/Hispanic,3,Emergency,Home or Self Care,2020,INJ030,DRUG INDUCED OR TOXIC RELATED CONDITION,,,424,OTHER ENDOCRINE DISORDERS,10,"ENDOCRINE, NUTRITIONAL AND METABOLIC DISEASES AND DISORDERS",1,Minor,Minor,Medical,Blue Cross/Blue Shield,,,,,Y,34770.9,10790.03
Long Island,Nassau,2908000,000511,NYU Langone Hospital-Long Island,0 to 17,117,M,Other Race,Spanish/Hispanic,1,Emergency,Home or Self Care,2020,END015,OTHER SPECIFIED AND UNSPECIFIED ENDOCRINE DISORDERS,,,424,OTHER ENDOCRINE DISORDERS,10,"ENDOCRINE, NUTRITIONAL AND METABOLIC DISEASES AND DISORDERS",2,Moderate,Minor,Medical,Blue Cross/Blue Shield,,,,,Y,14263.11,3206.02
Long Island,Nassau,2908000,000511,NYU Langone Hospital-Long Island,30 to 49,117,F,White,Not Span/Hispanic,1,Emergency,Home or Self Care,2020,INJ030,DRUG INDUCED OR TOXIC RELATED CONDITION,,,424,OTHER ENDOCRINE DISORDERS,10,"ENDOCRINE, NUTRITIONAL AND METABOLIC DISEASES AND DISORDERS",1,Minor,Minor,Medical,Medicaid,,,,,Y,32211.27,6350.47
Long Island,Nassau,2908000,000511,NYU Langone Hospital-Long Island,18 to 29,OOS,M,White,Not Span/Hispanic,1,Emergency,Home or Self Care,2020,END015,OTHER SPECIFIED AND UNSPECIFIED ENDOCRINE DISORDERS,,,424,OTHER ENDOCRINE DISORDERS,10,"ENDOCRINE, NUTRITIONAL AND METABOLIC DISEASES AND DISORDERS",2,Moderate,Minor,Medical,Blue Cross/Blue Shield,,,,,Y,19932.07,4644.24
Long Island,Nassau,2908000,000511,NYU Langone Hospital-Long Island,30 to 49,115,M,Black/African American,Not Span/Hispanic,2,Emergency,Skilled Nursing Home,2020,END015,OTHER SPECIFIED AND UNSPECIFIED ENDOCRINE DISORDERS,MAM011,ELECTROENCEPHALOGRAM (EEG),424,OTHER ENDOCRINE DISORDERS,10,"ENDOCRINE, NUTRITIONAL AND METABOLIC DISEASES AND DISORDERS",1,Minor,Moderate,Medical,Medicaid,,,,,Y,64640.82,11496.24
Long Island,Nassau,2908000,000511,NYU Langone Hospital-Long Island,70 or Older,113,M,White,Not Span/Hispanic,4,Emergency,Home or Self Care,2020,END015,OTHER SPECIFIED AND UNSPECIFIED ENDOCRINE DISORDERS,,,424,OTHER ENDOCRINE DISORDERS,10,"ENDOCRINE, NUTRITIONAL AND METABOLIC DISEASES AND DISORDERS",1,Minor,Minor,Medical,Medicare,Private Health Insurance,,,,Y,53620.75,19878.58
Long Island,Nassau,2908000,000511,NYU Langone Hospital-Long Island,30 to 49,117,M,White,Not Span/Hispanic,2,Emergency,Home or Self Care,2020,END015,OTHER SPECIFIED AND UNSPECIFIED ENDOCRINE DISORDERS,ADM017,ADMINISTRATION OF NUTRITIONAL AND ELECTROLYTIC SUBSTANCES,424,OTHER ENDOCRINE DISORDERS,10,"ENDOCRINE, NUTRITIONAL AND METABOLIC DISEASES AND DISORDERS",3,Major,Major,Medical,Private Health Insurance,,,,,Y,32450.95,10470.34
Long Island,Nassau,2908000,000511,NYU Langone Hospital-Long Island,30 to 49,115,F,Other Race,Spanish/Hispanic,6,Emergency,Home or Self Care,2020,END013,PITUITARY DISORDERS,,,424,OTHER ENDOCRINE DISORDERS,10,"ENDOCRINE, NUTRITIONAL AND METABOLIC DISEASES AND DISORDERS",2,Moderate,Minor,Medical,Medicaid,,,,,Y,99676.86,31177.46
Long Island,Nassau,2908000,000511,NYU Langone Hospital-Long Island,0 to 17,115,F,White,Spanish/Hispanic,2,Emergency,Home or Self Care,2020,INJ030,DRUG INDUCED OR TOXIC RELATED CONDITION,,,424,OTHER ENDOCRINE DISORDERS,10,"ENDOCRINE, NUTRITIONAL AND METABOLIC DISEASES AND DISORDERS",4,Extreme,Major,Medical,Medicaid,,,,,Y,44531.68,11111.13
Long Island,Nassau,2908000,000511,NYU Langone Hospital-Long Island,50 to 69,115,M,Black/African American,Not Span/Hispanic,3,Emergency,Home or Self Care,2020,END015,OTHER SPECIFIED AND UNSPECIFIED ENDOCRINE DISORDERS,ADM017,ADMINISTRATION OF NUTRITIONAL AND ELECTROLYTIC SUBSTANCES,424,OTHER ENDOCRINE DISORDERS,10,"ENDOCRINE, NUTRITIONAL AND METABOLIC DISEASES AND DISORDERS",4,Extreme,Major,Medical,Private Health Insurance,Medicaid,,,,Y,47181.41,15351.02
Long Island,Nassau,2908000,000511,NYU Langone Hospital-Long Island,0 to 17,114,F,Black/African American,Not Span/Hispanic,1,Emergency,Home or Self Care,2020,END015,OTHER SPECIFIED AND UNSPECIFIED ENDOCRINE DISORDERS,,,424,OTHER ENDOCRINE DISORDERS,10,"ENDOCRINE, NUTRITIONAL AND METABOLIC DISEASES AND DISORDERS",1,Minor,Minor,Medical,Medicaid,,,,,Y,20407.32,5919.53
Long Island,Nassau,2908000,000511,NYU Langone Hospital-Long Island,70 or Older,117,M,White,Not Span/Hispanic,1,Elective,Home or Self Care,2020,END015,OTHER SPECIFIED AND UNSPECIFIED ENDOCRINE DISORDERS,,,424,OTHER ENDOCRINE DISORDERS,10,"ENDOCRINE, NUTRITIONAL AND METABOLIC DISEASES AND DISORDERS",2,Moderate,Minor,Medical,Medicare,Medicare,,,,N,14950.63,4997.08
Long Island,Nassau,2908000,000511,NYU Langone Hospital-Long Island,70 or Older,115,F,Black/African American,Not Span/Hispanic,3,Emergency,Home w/ Home Health Services,2020,END015,OTHER SPECIFIED AND UNSPECIFIED ENDOCRINE DISORDERS,,,424,OTHER ENDOCRINE DISORDERS,10,"ENDOCRINE, NUTRITIONAL AND METABOLIC DISEASES AND DISORDERS",3,Major,Major,Medical,Medicare,Private Health Insurance,,,,Y,50597.06,15849.91
Long Island,Nassau,2908000,000511,NYU Langone Hospital-Long Island,0 to 17,110,F,White,Not Span/Hispanic,2,Emergency,Home or Self Care,2020,END015,OTHER SPECIFIED AND UNSPECIFIED ENDOCRINE DISORDERS,,,424,OTHER ENDOCRINE DISORDERS,10,"ENDOCRINE, NUTRITIONAL AND METABOLIC DISEASES AND DISORDERS",1,Minor,Minor,Medical,Blue Cross/Blue Shield,,,,,Y,28012.56,7116.21
Long Island,Nassau,2908000,000511,NYU Langone Hospital-Long Island,0 to 17,117,F,White,Not Span/Hispanic,1,Emergency,Home or Self Care,2020,NEO073,BENIGN NEOPLASMS,OTR004,ISOLATION PROCEDURES,424,OTHER ENDOCRINE DISORDERS,10,"ENDOCRINE, NUTRITIONAL AND METABOLIC DISEASES AND DISORDERS",1,Minor,Minor,Medical,Blue Cross/Blue Shield,,,,,Y,37412.62,5371.8
Long Island,Nassau,2908000,000511,NYU Langone Hospital-Long Island,30 to 49,113,F,White,Not Span/Hispanic,2,Emergency,Home w/ Home Health Services,2020,END014,POSTPROCEDURAL OR POSTOPERATIVE ENDOCRINE OR METABOLIC COMPLICATION,OTR004,ISOLATION PROCEDURES,424,OTHER ENDOCRINE DISORDERS,10,"ENDOCRINE, NUTRITIONAL AND METABOLIC DISEASES AND DISORDERS",1,Minor,Minor,Medical,Medicaid,,,,,Y,63326.6,13025.09
