Hospital Service Area,Hospital County,Operating Certificate Number,Permanent Facility Id,Facility Name,Age Group,Zip Code - 3 digits,Gender,Race,Ethnicity,Length of Stay,Type of Admission,Patient Disposition,Discharge Year,CCS Diagnosis Code,CCS Diagnosis Description,CCS Procedure Code,CCS Procedure Description,APR DRG Code,APR DRG Description,APR MDC Code,APR MDC Description,APR Severity of Illness Code,APR Severity of Illness Description,APR Risk of Mortality,APR Medical Surgical Description,Payment Typology 1,Payment Typology 2,Payment Typology 3,Birth Weight,Abortion Edit Indicator,Emergency Department Indicator,Total Charges,Total Costs
New York City,Manhattan,7002001,001438,Bellevue Hospital Center,50 to 69,100,F,Black/African American,Not Span/Hispanic,120 +,Emergency,Skilled Nursing Home,2017,055,Fluid and electrolyte disorders,058,HEMODIALYSIS,425,Electrolyte disorders except hypovolemia related,10,"Endocrine, Nutritional and Metabolic Diseases and Disorders",3,Major,Moderate,Medical,Medicaid,Medicaid,,,N,Y,2129470.19,1372971.65
New York City,Manhattan,7002001,001438,Bellevue Hospital Center,50 to 69,112,F,Other Race,Spanish/Hispanic,31,Emergency,Home or Self Care,2017,058,Other nutritional; endocrine; and metabolic disorders,222,BLOOD TRANSFUSION,425,Electrolyte disorders except hypovolemia related,10,"Endocrine, Nutritional and Metabolic Diseases and Disorders",3,Major,Moderate,Medical,Medicaid,Medicaid,,,N,Y,158808.42,102391.41
New York City,Manhattan,7002001,001438,Bellevue Hospital Center,50 to 69,112,F,Other Race,Spanish/Hispanic,31,Emergency,Home or Self Care,2017,058,Other nutritional; endocrine; and metabolic disorders,222,BLOOD TRANSFUSION,425,Electrolyte disorders except hypovolemia related,10,"Endocrine, Nutritional and Metabolic Diseases and Disorders",3,Major,Moderate,Medical,Medicaid,Medicaid,,,N,Y,158808.42,102391.41
New York City,Manhattan,7002001,001438,Bellevue Hospital Center,70 or Older,113,M,White,Not Span/Hispanic,15,Emergency,Home or Self Care,2017,055,Fluid and electrolyte disorders,058,HEMODIALYSIS,425,Electrolyte disorders except hypovolemia related,10,"Endocrine, Nutritional and Metabolic Diseases and Disorders",3,Major,Major,Medical,Medicare,,,,N,Y,77054.84,49680.95
New York City,Manhattan,7002001,001438,Bellevue Hospital Center,50 to 69,100,F,Other Race,Not Span/Hispanic,2,Emergency,Home or Self Care,2017,055,Fluid and electrolyte disorders,000,NO PROC,425,Electrolyte disorders except hypovolemia related,10,"Endocrine, Nutritional and Metabolic Diseases and Disorders",3,Major,Major,Medical,Medicaid,Medicaid,,,N,Y,14322.57,9234.45
New York City,Manhattan,7002001,001438,Bellevue Hospital Center,70 or Older,100,F,Other Race,Spanish/Hispanic,13,Emergency,Home w/ Home Health Services,2017,055,Fluid and electrolyte disorders,058,HEMODIALYSIS,425,Electrolyte disorders except hypovolemia related,10,"Endocrine, Nutritional and Metabolic Diseases and Disorders",3,Major,Moderate,Medical,Medicare,Medicare,,,N,Y,66073.94,42601.04
New York City,Manhattan,7002001,001438,Bellevue Hospital Center,50 to 69,100,M,Other Race,Spanish/Hispanic,3,Emergency,Home or Self Care,2017,055,Fluid and electrolyte disorders,183,ROUTINE CHEST X-RAY,425,Electrolyte disorders except hypovolemia related,10,"Endocrine, Nutritional and Metabolic Diseases and Disorders",2,Moderate,Moderate,Medical,Medicare,Medicaid,,,N,Y,18960.51,12224.75
New York City,Manhattan,7002001,001438,Bellevue Hospital Center,70 or Older,100,M,Other Race,Not Span/Hispanic,9,Emergency,Home or Self Care,2017,055,Fluid and electrolyte disorders,231,OTHER THERAPEUTIC PRCS,425,Electrolyte disorders except hypovolemia related,10,"Endocrine, Nutritional and Metabolic Diseases and Disorders",2,Moderate,Moderate,Medical,Medicare,Medicare,Medicaid,,N,Y,52027.72,33544.77
New York City,Manhattan,7002001,001438,Bellevue Hospital Center,50 to 69,113,M,Other Race,Not Span/Hispanic,2,Emergency,Home or Self Care,2017,055,Fluid and electrolyte disorders,201,CARDIAC STRESS TESTS,425,Electrolyte disorders except hypovolemia related,10,"Endocrine, Nutritional and Metabolic Diseases and Disorders",2,Moderate,Minor,Medical,Medicaid,Medicaid,,,N,Y,16427.03,10591.29
New York City,Manhattan,7002001,001438,Bellevue Hospital Center,70 or Older,107,M,Other Race,Spanish/Hispanic,1,Emergency,Home or Self Care,2017,055,Fluid and electrolyte disorders,000,NO PROC,425,Electrolyte disorders except hypovolemia related,10,"Endocrine, Nutritional and Metabolic Diseases and Disorders",2,Moderate,Moderate,Medical,Medicare,Medicare,Medicaid,,N,Y,6901.34,4449.63
New York City,Manhattan,7002001,001438,Bellevue Hospital Center,70 or Older,100,M,Other Race,Not Span/Hispanic,3,Emergency,Home or Self Care,2017,055,Fluid and electrolyte disorders,000,NO PROC,425,Electrolyte disorders except hypovolemia related,10,"Endocrine, Nutritional and Metabolic Diseases and Disorders",2,Moderate,Minor,Medical,Medicare,Medicaid,,,N,Y,23270.98,15003.92
New York City,Manhattan,7002001,001438,Bellevue Hospital Center,30 to 49,113,M,Black/African American,Not Span/Hispanic,3,Emergency,Home or Self Care,2017,055,Fluid and electrolyte disorders,058,HEMODIALYSIS,425,Electrolyte disorders except hypovolemia related,10,"Endocrine, Nutritional and Metabolic Diseases and Disorders",2,Moderate,Moderate,Medical,Medicare,Medicaid,,,N,Y,22855.90,14736.30
New York City,Manhattan,7002001,001438,Bellevue Hospital Center,30 to 49,113,M,Black/African American,Not Span/Hispanic,3,Emergency,Home or Self Care,2017,055,Fluid and electrolyte disorders,058,HEMODIALYSIS,425,Electrolyte disorders except hypovolemia related,10,"Endocrine, Nutritional and Metabolic Diseases and Disorders",3,Major,Moderate,Medical,Medicaid,,,,N,N,17369.80,11199.14
New York City,Manhattan,7002001,001438,Bellevue Hospital Center,30 to 49,113,M,Black/African American,Not Span/Hispanic,1,Emergency,Home or Self Care,2017,055,Fluid and electrolyte disorders,058,HEMODIALYSIS,425,Electrolyte disorders except hypovolemia related,10,"Endocrine, Nutritional and Metabolic Diseases and Disorders",2,Moderate,Moderate,Medical,Medicare,Medicaid,,,N,Y,7194.24,4638.47
New York City,Manhattan,7002001,001438,Bellevue Hospital Center,70 or Older,100,F,Black/African American,Not Span/Hispanic,29,Emergency,Skilled Nursing Home,2017,055,Fluid and electrolyte disorders,000,NO PROC,425,Electrolyte disorders except hypovolemia related,10,"Endocrine, Nutritional and Metabolic Diseases and Disorders",2,Moderate,Moderate,Medical,Medicare,Medicaid,,,N,N,142454.88,91847.50
New York City,Manhattan,7002001,001438,Bellevue Hospital Center,30 to 49,100,M,Other Race,Spanish/Hispanic,2,Emergency,Home or Self Care,2017,055,Fluid and electrolyte disorders,222,BLOOD TRANSFUSION,425,Electrolyte disorders except hypovolemia related,10,"Endocrine, Nutritional and Metabolic Diseases and Disorders",3,Major,Moderate,Medical,Medicaid,,,,N,Y,14840.34,9568.28
New York City,Manhattan,7002001,001438,Bellevue Hospital Center,70 or Older,100,F,Black/African American,Spanish/Hispanic,1,Emergency,Home w/ Home Health Services,2017,055,Fluid and electrolyte disorders,222,BLOOD TRANSFUSION,425,Electrolyte disorders except hypovolemia related,10,"Endocrine, Nutritional and Metabolic Diseases and Disorders",2,Moderate,Moderate,Medical,Medicare,Medicaid,,,N,Y,7162.01,4617.69
New York City,Manhattan,7002001,001438,Bellevue Hospital Center,50 to 69,113,M,Other Race,Not Span/Hispanic,1,Emergency,Home or Self Care,2017,055,Fluid and electrolyte disorders,000,NO PROC,425,Electrolyte disorders except hypovolemia related,10,"Endocrine, Nutritional and Metabolic Diseases and Disorders",2,Moderate,Moderate,Medical,Medicaid,,,,N,Y,7846.61,5059.09
New York City,Manhattan,7002001,001438,Bellevue Hospital Center,30 to 49,113,M,Black/African American,Not Span/Hispanic,2,Emergency,Home or Self Care,2017,055,Fluid and electrolyte disorders,058,HEMODIALYSIS,425,Electrolyte disorders except hypovolemia related,10,"Endocrine, Nutritional and Metabolic Diseases and Disorders",2,Moderate,Moderate,Medical,Medicare,Medicaid,,,N,N,12359.93,7969.04
New York City,Manhattan,7002001,001438,Bellevue Hospital Center,50 to 69,100,M,Black/African American,Not Span/Hispanic,5,Emergency,Expired,2017,055,Fluid and electrolyte disorders,058,HEMODIALYSIS,425,Electrolyte disorders except hypovolemia related,10,"Endocrine, Nutritional and Metabolic Diseases and Disorders",4,Extreme,Extreme,Medical,Medicaid,Medicaid,,,N,Y,36200.83,23340.41
New York City,Manhattan,7002001,001438,Bellevue Hospital Center,50 to 69,104,F,Other Race,Not Span/Hispanic,2,Emergency,Home or Self Care,2017,055,Fluid and electrolyte disorders,000,NO PROC,425,Electrolyte disorders except hypovolemia related,10,"Endocrine, Nutritional and Metabolic Diseases and Disorders",2,Moderate,Minor,Medical,Medicare,Medicare,Medicaid,,N,Y,24624.91,15876.86
New York City,Manhattan,7002001,001438,Bellevue Hospital Center,50 to 69,100,F,Black/African American,Not Span/Hispanic,3,Emergency,Home or Self Care,2017,055,Fluid and electrolyte disorders,000,NO PROC,425,Electrolyte disorders except hypovolemia related,10,"Endocrine, Nutritional and Metabolic Diseases and Disorders",3,Major,Moderate,Medical,Medicare,Medicaid,,,N,Y,20874.86,13459.02
New York City,Manhattan,7002001,001438,Bellevue Hospital Center,50 to 69,112,M,Black/African American,Not Span/Hispanic,5,Emergency,Home or Self Care,2017,055,Fluid and electrolyte disorders,000,NO PROC,425,Electrolyte disorders except hypovolemia related,10,"Endocrine, Nutritional and Metabolic Diseases and Disorders",3,Major,Moderate,Medical,Medicare,Medicare,,,N,Y,29372.84,18938.08
New York City,Manhattan,7002001,001438,Bellevue Hospital Center,50 to 69,103,F,Other Race,Not Span/Hispanic,2,Emergency,Home or Self Care,2017,055,Fluid and electrolyte disorders,000,NO PROC,425,Electrolyte disorders except hypovolemia related,10,"Endocrine, Nutritional and Metabolic Diseases and Disorders",1,Minor,Minor,Medical,Blue Cross/Blue Shield,,,,N,Y,19339.64,12469.19
New York City,Manhattan,7002001,001438,Bellevue Hospital Center,0 to 17,100,F,Other Race,Not Span/Hispanic,17,Emergency,Home or Self Care,2017,224,Other perinatal conditions,216,RESP INTUB/MECH VENTIL,425,Electrolyte disorders except hypovolemia related,10,"Endocrine, Nutritional and Metabolic Diseases and Disorders",2,Moderate,Moderate,Medical,Medicaid,Medicaid,,03100,N,N,69757.12,44975.76
New York City,Manhattan,7002001,001438,Bellevue Hospital Center,30 to 49,112,F,Black/African American,Not Span/Hispanic,40,Emergency,Home or Self Care,2017,055,Fluid and electrolyte disorders,092,OTHER BOWEL DX PRCS,425,Electrolyte disorders except hypovolemia related,10,"Endocrine, Nutritional and Metabolic Diseases and Disorders",3,Major,Major,Medical,Medicare,Medicare,Medicaid,,N,Y,231060.41,148975.74
New York City,Manhattan,7002001,001438,Bellevue Hospital Center,30 to 49,104,M,Black/African American,Not Span/Hispanic,4,Emergency,Home or Self Care,2017,055,Fluid and electrolyte disorders,058,HEMODIALYSIS,425,Electrolyte disorders except hypovolemia related,10,"Endocrine, Nutritional and Metabolic Diseases and Disorders",2,Moderate,Moderate,Medical,Medicaid,Medicaid,,,N,Y,24064.85,15515.76
New York City,Manhattan,7002001,001438,Bellevue Hospital Center,30 to 49,100,M,Other Race,Not Span/Hispanic,3,Emergency,Home or Self Care,2017,058,Other nutritional; endocrine; and metabolic disorders,222,BLOOD TRANSFUSION,425,Electrolyte disorders except hypovolemia related,10,"Endocrine, Nutritional and Metabolic Diseases and Disorders",1,Minor,Minor,Medical,Medicaid,Medicaid,,,N,Y,19073.44,12297.56
New York City,Manhattan,7002001,001438,Bellevue Hospital Center,30 to 49,100,M,Other Race,Not Span/Hispanic,3,Emergency,Home or Self Care,2017,058,Other nutritional; endocrine; and metabolic disorders,222,BLOOD TRANSFUSION,425,Electrolyte disorders except hypovolemia related,10,"Endocrine, Nutritional and Metabolic Diseases and Disorders",1,Minor,Minor,Medical,Medicaid,Medicaid,,,N,Y,19073.44,12297.56
New York City,Manhattan,7002001,001438,Bellevue Hospital Center,50 to 69,100,M,Other Race,Spanish/Hispanic,7,Emergency,Home or Self Care,2017,055,Fluid and electrolyte disorders,058,HEMODIALYSIS,425,Electrolyte disorders except hypovolemia related,10,"Endocrine, Nutritional and Metabolic Diseases and Disorders",2,Moderate,Minor,Medical,Medicaid,Medicaid,,,N,Y,37981.54,24488.52
New York City,Manhattan,7002001,001438,Bellevue Hospital Center,70 or Older,112,F,Other Race,Not Span/Hispanic,5,Emergency,Home or Self Care,2017,055,Fluid and electrolyte disorders,222,BLOOD TRANSFUSION,425,Electrolyte disorders except hypovolemia related,10,"Endocrine, Nutritional and Metabolic Diseases and Disorders",2,Moderate,Moderate,Medical,Medicare,Medicaid,,,N,N,27549.07,17762.21
New York City,Manhattan,7002001,001438,Bellevue Hospital Center,50 to 69,100,M,Other Race,Spanish/Hispanic,3,Emergency,Skilled Nursing Home,2017,055,Fluid and electrolyte disorders,058,HEMODIALYSIS,425,Electrolyte disorders except hypovolemia related,10,"Endocrine, Nutritional and Metabolic Diseases and Disorders",3,Major,Moderate,Medical,Medicaid,Medicaid,,,N,Y,17640.28,11373.54
New York City,Manhattan,7002001,001438,Bellevue Hospital Center,50 to 69,100,M,Black/African American,Not Span/Hispanic,3,Emergency,Home or Self Care,2017,055,Fluid and electrolyte disorders,000,NO PROC,425,Electrolyte disorders except hypovolemia related,10,"Endocrine, Nutritional and Metabolic Diseases and Disorders",2,Moderate,Minor,Medical,Medicaid,,,,N,Y,21541.71,13888.97
New York City,Manhattan,7002001,001438,Bellevue Hospital Center,70 or Older,112,F,Other Race,Not Span/Hispanic,24,Emergency,Home or Self Care,2017,055,Fluid and electrolyte disorders,058,HEMODIALYSIS,425,Electrolyte disorders except hypovolemia related,10,"Endocrine, Nutritional and Metabolic Diseases and Disorders",3,Major,Major,Medical,Medicare,Medicaid,,,N,Y,122050.69,78691.94
New York City,Manhattan,7002001,001438,Bellevue Hospital Center,50 to 69,113,M,Other Race,Not Span/Hispanic,1,Emergency,Left Against Medical Advice,2017,055,Fluid and electrolyte disorders,222,BLOOD TRANSFUSION,425,Electrolyte disorders except hypovolemia related,10,"Endocrine, Nutritional and Metabolic Diseases and Disorders",2,Moderate,Minor,Medical,Medicaid,Medicaid,,,N,Y,8159.20,5260.63
New York City,Manhattan,7002001,001438,Bellevue Hospital Center,30 to 49,113,M,Other Race,Not Span/Hispanic,3,Emergency,Home or Self Care,2017,055,Fluid and electrolyte disorders,058,HEMODIALYSIS,425,Electrolyte disorders except hypovolemia related,10,"Endocrine, Nutritional and Metabolic Diseases and Disorders",2,Moderate,Minor,Medical,Department of Corrections,,,,N,Y,18865.41,12163.44
New York City,Manhattan,7002001,001438,Bellevue Hospital Center,50 to 69,112,F,Other Race,Spanish/Hispanic,13,Emergency,Home or Self Care,2017,055,Fluid and electrolyte disorders,058,HEMODIALYSIS,425,Electrolyte disorders except hypovolemia related,10,"Endocrine, Nutritional and Metabolic Diseases and Disorders",3,Major,Moderate,Medical,Medicare,,,,N,Y,72391.92,46674.55
New York City,Manhattan,7002001,001438,Bellevue Hospital Center,50 to 69,113,M,Other Race,Not Span/Hispanic,14,Emergency,Home or Self Care,2017,055,Fluid and electrolyte disorders,054,OT VASC CATH; NOT HEART,425,Electrolyte disorders except hypovolemia related,10,"Endocrine, Nutritional and Metabolic Diseases and Disorders",3,Major,Extreme,Medical,Medicaid,Medicaid,,,N,Y,77644.46,50061.11
New York City,Manhattan,7002001,001438,Bellevue Hospital Center,50 to 69,103,M,Other Race,Not Span/Hispanic,8,Emergency,Home w/ Home Health Services,2017,055,Fluid and electrolyte disorders,224,CANCER CHEMOTHERAPY,425,Electrolyte disorders except hypovolemia related,10,"Endocrine, Nutritional and Metabolic Diseases and Disorders",3,Major,Moderate,Medical,Medicaid,,,,N,Y,42557.68,27438.98
New York City,Manhattan,7002001,001438,Bellevue Hospital Center,50 to 69,113,F,Other Race,Spanish/Hispanic,4,Emergency,Home or Self Care,2017,055,Fluid and electrolyte disorders,058,HEMODIALYSIS,425,Electrolyte disorders except hypovolemia related,10,"Endocrine, Nutritional and Metabolic Diseases and Disorders",3,Major,Major,Medical,Self-Pay,,,,N,Y,23557.19,15188.45
New York City,Manhattan,7002001,001438,Bellevue Hospital Center,50 to 69,100,M,Black/African American,Not Span/Hispanic,3,Emergency,Psychiatric Hospital or Unit of Hosp,2017,055,Fluid and electrolyte disorders,218,PSYCHO/PSYCHI EVAL/THER,425,Electrolyte disorders except hypovolemia related,10,"Endocrine, Nutritional and Metabolic Diseases and Disorders",2,Moderate,Minor,Medical,Medicare,,,,N,Y,18751.98,12090.30
New York City,Manhattan,7002001,001438,Bellevue Hospital Center,30 to 49,100,M,Black/African American,Not Span/Hispanic,4,Emergency,Home or Self Care,2017,055,Fluid and electrolyte disorders,058,HEMODIALYSIS,425,Electrolyte disorders except hypovolemia related,10,"Endocrine, Nutritional and Metabolic Diseases and Disorders",3,Major,Major,Medical,Medicaid,,,,N,Y,24609.92,15867.20
New York City,Manhattan,7002001,001438,Bellevue Hospital Center,50 to 69,100,M,Black/African American,Not Span/Hispanic,4,Emergency,Home or Self Care,2017,055,Fluid and electrolyte disorders,058,HEMODIALYSIS,425,Electrolyte disorders except hypovolemia related,10,"Endocrine, Nutritional and Metabolic Diseases and Disorders",2,Moderate,Minor,Medical,Medicaid,Medicaid,,,N,Y,26697.20,17212.97
New York City,Manhattan,7002001,001438,Bellevue Hospital Center,30 to 49,112,M,Other Race,Not Span/Hispanic,1,Emergency,Home or Self Care,2017,055,Fluid and electrolyte disorders,231,OTHER THERAPEUTIC PRCS,425,Electrolyte disorders except hypovolemia related,10,"Endocrine, Nutritional and Metabolic Diseases and Disorders",3,Major,Major,Medical,Medicaid,,,,N,Y,8093.62,5218.35
New York City,Manhattan,7002001,001438,Bellevue Hospital Center,70 or Older,100,F,Other Race,Not Span/Hispanic,4,Emergency,Home w/ Home Health Services,2017,058,Other nutritional; endocrine; and metabolic disorders,000,NO PROC,425,Electrolyte disorders except hypovolemia related,10,"Endocrine, Nutritional and Metabolic Diseases and Disorders",2,Moderate,Major,Medical,Medicare,Medicare,Medicaid,,N,Y,25854.19,16669.44
New York City,Manhattan,7002001,001438,Bellevue Hospital Center,70 or Older,100,F,Other Race,Not Span/Hispanic,4,Emergency,Home w/ Home Health Services,2017,058,Other nutritional; endocrine; and metabolic disorders,000,NO PROC,425,Electrolyte disorders except hypovolemia related,10,"Endocrine, Nutritional and Metabolic Diseases and Disorders",2,Moderate,Major,Medical,Medicare,Medicare,Medicaid,,N,Y,25854.19,16669.44
New York City,Manhattan,7002001,001438,Bellevue Hospital Center,30 to 49,113,M,Other Race,Not Span/Hispanic,8,Emergency,Home or Self Care,2017,055,Fluid and electrolyte disorders,058,HEMODIALYSIS,425,Electrolyte disorders except hypovolemia related,10,"Endocrine, Nutritional and Metabolic Diseases and Disorders",2,Moderate,Minor,Medical,Private Health Insurance,Medicaid,,,N,Y,41791.14,26944.75
New York City,Manhattan,7002001,001438,Bellevue Hospital Center,70 or Older,112,F,Other Race,Not Span/Hispanic,2,Emergency,Home w/ Home Health Services,2017,055,Fluid and electrolyte disorders,231,OTHER THERAPEUTIC PRCS,425,Electrolyte disorders except hypovolemia related,10,"Endocrine, Nutritional and Metabolic Diseases and Disorders",2,Moderate,Moderate,Medical,Medicaid,Medicaid,,,N,Y,15602.07,10059.40
New York City,Manhattan,7002001,001438,Bellevue Hospital Center,50 to 69,100,M,Other Race,Not Span/Hispanic,2,Emergency,Home or Self Care,2017,055,Fluid and electrolyte disorders,058,HEMODIALYSIS,425,Electrolyte disorders except hypovolemia related,10,"Endocrine, Nutritional and Metabolic Diseases and Disorders",3,Major,Moderate,Medical,Medicaid,,,,N,Y,14968.08,9650.64
New York City,Manhattan,7002001,001438,Bellevue Hospital Center,30 to 49,104,F,Other Race,Spanish/Hispanic,1,Emergency,Home or Self Care,2017,055,Fluid and electrolyte disorders,222,BLOOD TRANSFUSION,425,Electrolyte disorders except hypovolemia related,10,"Endocrine, Nutritional and Metabolic Diseases and Disorders",2,Moderate,Minor,Medical,Medicaid,,,,N,Y,9035.26,5825.47
New York City,Manhattan,7002001,001438,Bellevue Hospital Center,50 to 69,100,F,White,Not Span/Hispanic,7,Emergency,Home or Self Care,2017,055,Fluid and electrolyte disorders,222,BLOOD TRANSFUSION,425,Electrolyte disorders except hypovolemia related,10,"Endocrine, Nutritional and Metabolic Diseases and Disorders",1,Minor,Minor,Medical,Medicaid,Medicaid,,,N,Y,45263.44,29183.51
New York City,Manhattan,7002001,001438,Bellevue Hospital Center,70 or Older,112,M,Other Race,Not Span/Hispanic,3,Emergency,Home or Self Care,2017,055,Fluid and electrolyte disorders,231,OTHER THERAPEUTIC PRCS,425,Electrolyte disorders except hypovolemia related,10,"Endocrine, Nutritional and Metabolic Diseases and Disorders",2,Moderate,Moderate,Medical,Medicare,Medicare,,,N,Y,24073.75,15521.50
New York City,Manhattan,7002001,001438,Bellevue Hospital Center,70 or Older,100,F,Other Race,Spanish/Hispanic,4,Emergency,Home or Self Care,2017,055,Fluid and electrolyte disorders,180,OTHER CT SCAN,425,Electrolyte disorders except hypovolemia related,10,"Endocrine, Nutritional and Metabolic Diseases and Disorders",2,Moderate,Moderate,Medical,Medicare,Medicare,Medicaid,,N,Y,24983.70,16108.19
New York City,Manhattan,7002001,001438,Bellevue Hospital Center,30 to 49,112,F,Other Race,Spanish/Hispanic,1,Emergency,Home or Self Care,2017,055,Fluid and electrolyte disorders,222,BLOOD TRANSFUSION,425,Electrolyte disorders except hypovolemia related,10,"Endocrine, Nutritional and Metabolic Diseases and Disorders",3,Major,Moderate,Medical,Medicaid,Medicaid,,,N,Y,8526.67,5497.55
New York City,Manhattan,7002001,001438,Bellevue Hospital Center,50 to 69,100,M,Other Race,Not Span/Hispanic,1,Emergency,Home or Self Care,2017,055,Fluid and electrolyte disorders,219,ALCO/DRUG REHAB/DETOX,425,Electrolyte disorders except hypovolemia related,10,"Endocrine, Nutritional and Metabolic Diseases and Disorders",2,Moderate,Moderate,Medical,Medicaid,,,,N,Y,8372.98,5398.46
New York City,Manhattan,7002001,001438,Bellevue Hospital Center,50 to 69,100,M,Black/African American,Not Span/Hispanic,4,Emergency,Home or Self Care,2017,058,Other nutritional; endocrine; and metabolic disorders,231,OTHER THERAPEUTIC PRCS,425,Electrolyte disorders except hypovolemia related,10,"Endocrine, Nutritional and Metabolic Diseases and Disorders",3,Major,Major,Medical,Medicaid,,,,N,Y,23357.25,15059.54
New York City,Manhattan,7002001,001438,Bellevue Hospital Center,50 to 69,100,M,Black/African American,Not Span/Hispanic,4,Emergency,Home or Self Care,2017,058,Other nutritional; endocrine; and metabolic disorders,231,OTHER THERAPEUTIC PRCS,425,Electrolyte disorders except hypovolemia related,10,"Endocrine, Nutritional and Metabolic Diseases and Disorders",3,Major,Major,Medical,Medicaid,,,,N,Y,23357.25,15059.54
New York City,Manhattan,7002001,001438,Bellevue Hospital Center,50 to 69,100,F,Black/African American,Not Span/Hispanic,2,Emergency,Home or Self Care,2017,055,Fluid and electrolyte disorders,058,HEMODIALYSIS,425,Electrolyte disorders except hypovolemia related,10,"Endocrine, Nutritional and Metabolic Diseases and Disorders",3,Major,Major,Medical,Medicaid,Medicaid,,,N,Y,18676.51,12041.64
New York City,Manhattan,7002001,001438,Bellevue Hospital Center,70 or Older,100,F,Other Race,Spanish/Hispanic,5,Emergency,Home or Self Care,2017,055,Fluid and electrolyte disorders,231,OTHER THERAPEUTIC PRCS,425,Electrolyte disorders except hypovolemia related,10,"Endocrine, Nutritional and Metabolic Diseases and Disorders",3,Major,Extreme,Medical,Medicaid,,,,N,Y,28126.25,18134.34