Hospital Service Area,Hospital County,Operating Certificate Number,Permanent Facility Id,Facility Name,Age Group,Zip Code - 3 digits,Gender,Race,Ethnicity,Length of Stay,Type of Admission,Patient Disposition,Discharge Year,CCS Diagnosis Code,CCS Diagnosis Description,CCS Procedure Code,CCS Procedure Description,APR DRG Code,APR DRG Description,APR MDC Code,APR MDC Description,APR Severity of Illness Code,APR Severity of Illness Description,APR Risk of Mortality,APR Medical Surgical Description,Payment Typology 1,Payment Typology 2,Payment Typology 3,Birth Weight,Abortion Edit Indicator,Emergency Department Indicator,Total Charges,Total Costs
New York City,Queens,7003007,001633,Queens Hospital Center,30 to 49,114,M,Other Race,Spanish/Hispanic,1,Emergency,Home or Self Care,2018,END011,FLUID AND ELECTROLYTE DISORDERS,,,425,OTHER NON-HYPOVOLEMIC ELECTROLYTE DISORDERS,10,"ENDOCRINE, NUTRITIONAL AND METABOLIC DISEASES AND DISORDERS",3,Major,Moderate,Medical,Medicare,Medicaid,,,,true,8030.94,4288.27
New York City,Queens,7003003,001629,Jamaica Hospital Medical Center,50 to 69,114,F,Other Race,Not Span/Hispanic,2,Emergency,Home or Self Care,2018,END016,OTHER SPECIFIED AND UNSPECIFIED NUTRITIONAL AND METABOLIC DISORDERS,ESA001,HEMODIALYSIS,425,OTHER NON-HYPOVOLEMIC ELECTROLYTE DISORDERS,10,"ENDOCRINE, NUTRITIONAL AND METABOLIC DISEASES AND DISORDERS",3,Major,Moderate,Medical,Medicaid,,,,,true,12359,5912.4
New York City,Bronx,7000006,003058,Montefiore Med Center - Jack D Weiler Hosp of A Einstein College Div,50 to 69,104,M,Other Race,Not Span/Hispanic,1,Emergency,Home or Self Care,2018,END011,FLUID AND ELECTROLYTE DISORDERS,,,425,OTHER NON-HYPOVOLEMIC ELECTROLYTE DISORDERS,10,"ENDOCRINE, NUTRITIONAL AND METABOLIC DISEASES AND DISORDERS",2,Moderate,Minor,Medical,Medicaid,,,,,true,24328.45,4185.66
Western NY,Erie,1401014,003067,Millard Fillmore Suburban Hospital,18 to 29,142,F,White,Not Span/Hispanic,2,Emergency,Home or Self Care,2018,END011,FLUID AND ELECTROLYTE DISORDERS,,,425,OTHER NON-HYPOVOLEMIC ELECTROLYTE DISORDERS,10,"ENDOCRINE, NUTRITIONAL AND METABOLIC DISEASES AND DISORDERS",2,Moderate,Minor,Medical,Blue Cross/Blue Shield,Self-Pay,,,,true,9541.78,3819.1
New York City,Manhattan,7002001,001438,Bellevue Hospital Center,0 to 17,114,F,Other Race,Not Span/Hispanic,2,Emergency,Home or Self Care,2018,END011,FLUID AND ELECTROLYTE DISORDERS,IMG008,ULTRASONOGRAPHY,425,OTHER NON-HYPOVOLEMIC ELECTROLYTE DISORDERS,10,"ENDOCRINE, NUTRITIONAL AND METABOLIC DISEASES AND DISORDERS",2,Moderate,Minor,Medical,Medicaid,Medicaid,,,,true,13255.37,8809.52
New York City,Manhattan,7002054,001464,New York-Presbyterian Hospital - Columbia Presbyterian Center,50 to 69,OOS,M,White,Spanish/Hispanic,6,Urgent,Home or Self Care,2018,END011,FLUID AND ELECTROLYTE DISORDERS,ESA001,HEMODIALYSIS,425,OTHER NON-HYPOVOLEMIC ELECTROLYTE DISORDERS,10,"ENDOCRINE, NUTRITIONAL AND METABOLIC DISEASES AND DISORDERS",4,Extreme,Major,Medical,Medicare,Private Health Insurance,Self-Pay,,,false,70338.96,16966.27
New York City,Kings,7002053,001304,NYU Langone Hospital-Brooklyn,50 to 69,112,F,White,Not Span/Hispanic,3,Emergency,Home or Self Care,2018,END016,OTHER SPECIFIED AND UNSPECIFIED NUTRITIONAL AND METABOLIC DISORDERS,,,425,OTHER NON-HYPOVOLEMIC ELECTROLYTE DISORDERS,10,"ENDOCRINE, NUTRITIONAL AND METABOLIC DISEASES AND DISORDERS",3,Major,Moderate,Medical,Blue Cross/Blue Shield,,,,,true,63990.16,12701.38
Finger Lakes,Monroe,2701003,000411,Rochester General Hospital,70 or Older,144,M,White,Not Span/Hispanic,3,Emergency,Home or Self Care,2018,END011,FLUID AND ELECTROLYTE DISORDERS,,,425,OTHER NON-HYPOVOLEMIC ELECTROLYTE DISORDERS,10,"ENDOCRINE, NUTRITIONAL AND METABOLIC DISEASES AND DISORDERS",2,Moderate,Minor,Medical,Medicare,Medicare,,,,true,13300.32,5081.37
New York City,Bronx,7000024,001186,North Central Bronx Hospital,50 to 69,104,F,Black/African American,Not Span/Hispanic,2,Emergency,Skilled Nursing Home,2018,END011,FLUID AND ELECTROLYTE DISORDERS,ESA001,HEMODIALYSIS,425,OTHER NON-HYPOVOLEMIC ELECTROLYTE DISORDERS,10,"ENDOCRINE, NUTRITIONAL AND METABOLIC DISEASES AND DISORDERS",2,Moderate,Moderate,Medical,Medicaid,,,,,true,14400.16,8644.55
New York City,Queens,7003010,001637,New York - Presbyterian/Queens,50 to 69,113,M,White,Spanish/Hispanic,1,Emergency,Home or Self Care,2018,END011,FLUID AND ELECTROLYTE DISORDERS,IMG007,COMPUTERIZED TOMOGRAPHY (CT) WITHOUT CONTRAST,425,OTHER NON-HYPOVOLEMIC ELECTROLYTE DISORDERS,10,"ENDOCRINE, NUTRITIONAL AND METABOLIC DISEASES AND DISORDERS",2,Moderate,Moderate,Medical,Medicaid,Self-Pay,,,,true,11373.13,2691.17
New York City,Manhattan,7002001,001438,Bellevue Hospital Center,50 to 69,100,M,Other Race,Not Span/Hispanic,20,Emergency,Skilled Nursing Home,2018,END011,FLUID AND ELECTROLYTE DISORDERS,ESA001,HEMODIALYSIS,425,OTHER NON-HYPOVOLEMIC ELECTROLYTE DISORDERS,10,"ENDOCRINE, NUTRITIONAL AND METABOLIC DISEASES AND DISORDERS",3,Major,Major,Medical,Medicare,,,,,true,101882.51,67711.12
New York City,Bronx,7000006,003058,Montefiore Med Center - Jack D Weiler Hosp of A Einstein College Div,50 to 69,104,F,Other Race,Spanish/Hispanic,1,Emergency,Home or Self Care,2018,END011,FLUID AND ELECTROLYTE DISORDERS,ADM007,INTRAVENOUS INDUCTION OF LABOR,425,OTHER NON-HYPOVOLEMIC ELECTROLYTE DISORDERS,10,"ENDOCRINE, NUTRITIONAL AND METABOLIC DISEASES AND DISORDERS",2,Moderate,Moderate,Medical,Medicare,Medicaid,,,,true,15251.06,2166.99
New York City,Bronx,7000006,001168,Montefiore Medical Center-Wakefield Hospital,50 to 69,105,M,Black/African American,Not Span/Hispanic,1,Emergency,Home or Self Care,2018,END011,FLUID AND ELECTROLYTE DISORDERS,IMG008,ULTRASONOGRAPHY,425,OTHER NON-HYPOVOLEMIC ELECTROLYTE DISORDERS,10,"ENDOCRINE, NUTRITIONAL AND METABOLIC DISEASES AND DISORDERS",2,Moderate,Moderate,Medical,Private Health Insurance,,,,,true,34850.03,5161.15
Central NY,Onondaga,3301007,000635,University Hospital SUNY Health Science Center,30 to 49,130,F,White,Not Span/Hispanic,2,Emergency,Home or Self Care,2018,END011,FLUID AND ELECTROLYTE DISORDERS,SUD001,SUBSTANCE USE DETOXIFICATION,425,OTHER NON-HYPOVOLEMIC ELECTROLYTE DISORDERS,10,"ENDOCRINE, NUTRITIONAL AND METABOLIC DISEASES AND DISORDERS",2,Moderate,Minor,Medical,Private Health Insurance,,,,,true,17786.4,4316.09
New York City,Kings,7001035,001318,Wyckoff Heights Medical Center,70 or Older,112,F,Black/African American,Not Span/Hispanic,4,Emergency,Home or Self Care,2018,END011,FLUID AND ELECTROLYTE DISORDERS,,,425,OTHER NON-HYPOVOLEMIC ELECTROLYTE DISORDERS,10,"ENDOCRINE, NUTRITIONAL AND METABOLIC DISEASES AND DISORDERS",1,Minor,Moderate,Medical,Medicare,Miscellaneous/Other,Medicaid,,,true,18247.16,8276.31
New York City,Bronx,7000001,001178,BronxCare Hospital Center,30 to 49,104,F,Other Race,Unknown,2,Emergency,Left Against Medical Advice,2018,END011,FLUID AND ELECTROLYTE DISORDERS,ESA001,HEMODIALYSIS,425,OTHER NON-HYPOVOLEMIC ELECTROLYTE DISORDERS,10,"ENDOCRINE, NUTRITIONAL AND METABOLIC DISEASES AND DISORDERS",2,Moderate,Minor,Medical,Medicaid,Medicaid,,,,true,8624.84,9811.56
Long Island,Nassau,2951001,000541,North Shore University Hospital,70 or Older,117,F,White,Not Span/Hispanic,14,Emergency,Short-term Hospital,2018,END011,FLUID AND ELECTROLYTE DISORDERS,ADM021,"ADMINISTRATION OF THERAPEUTIC SUBSTANCES, NEC",425,OTHER NON-HYPOVOLEMIC ELECTROLYTE DISORDERS,10,"ENDOCRINE, NUTRITIONAL AND METABOLIC DISEASES AND DISORDERS",3,Major,Major,Medical,Medicare,Medicare,,,,true,144948.89,27579.28
New York City,Manhattan,7002054,001437,New York-Presbyterian/Lower Manhattan Hospital,70 or Older,112,F,Other Race,Not Span/Hispanic,2,Emergency,Home w/ Home Health Services,2018,END011,FLUID AND ELECTROLYTE DISORDERS,ESA001,HEMODIALYSIS,425,OTHER NON-HYPOVOLEMIC ELECTROLYTE DISORDERS,10,"ENDOCRINE, NUTRITIONAL AND METABOLIC DISEASES AND DISORDERS",3,Major,Major,Medical,Medicare,Medicaid,Self-Pay,,,true,52674.58,22056.48
Capital/Adirond,Albany,0101004,000005,St. Peter's Hospital,50 to 69,121,F,White,Not Span/Hispanic,9,Elective,Skilled Nursing Home,2018,END016,OTHER SPECIFIED AND UNSPECIFIED NUTRITIONAL AND METABOLIC DISORDERS,MST001,ARTHROCENTESIS,425,OTHER NON-HYPOVOLEMIC ELECTROLYTE DISORDERS,10,"ENDOCRINE, NUTRITIONAL AND METABOLIC DISEASES AND DISORDERS",3,Major,Minor,Medical,Private Health Insurance,Medicare,,,,false,42130.97,14610.86
Finger Lakes,Steuben,5001000,000866,Corning Hospital,50 to 69,148,M,White,Not Span/Hispanic,2,Emergency,Home or Self Care,2018,END011,FLUID AND ELECTROLYTE DISORDERS,,,425,OTHER NON-HYPOVOLEMIC ELECTROLYTE DISORDERS,10,"ENDOCRINE, NUTRITIONAL AND METABOLIC DISEASES AND DISORDERS",2,Moderate,Minor,Medical,Medicaid,,,,,true,16291.75,4782.4
New York City,Queens,7003004,001630,Long Island Jewish Medical Center,70 or Older,114,F,White,Not Span/Hispanic,5,Emergency,Home w/ Home Health Services,2018,END016,OTHER SPECIFIED AND UNSPECIFIED NUTRITIONAL AND METABOLIC DISORDERS,URN006,BLADDER CATHETERIZATION AND DRAINAGE,425,OTHER NON-HYPOVOLEMIC ELECTROLYTE DISORDERS,10,"ENDOCRINE, NUTRITIONAL AND METABOLIC DISEASES AND DISORDERS",3,Major,Major,Medical,Medicare,Medicaid,Self-Pay,,,true,72243.1,12152.06
Central NY,Onondaga,3301007,000635,University Hospital SUNY Health Science Center,70 or Older,130,F,White,Not Span/Hispanic,2,Emergency,Home or Self Care,2018,END016,OTHER SPECIFIED AND UNSPECIFIED NUTRITIONAL AND METABOLIC DISORDERS,,,425,OTHER NON-HYPOVOLEMIC ELECTROLYTE DISORDERS,10,"ENDOCRINE, NUTRITIONAL AND METABOLIC DISEASES AND DISORDERS",2,Moderate,Moderate,Medical,Medicare,,,,,true,26261.5,9877.94
New York City,Manhattan,7002009,001445,Harlem Hospital Center,30 to 49,104,M,Black/African American,Not Span/Hispanic,4,Emergency,Left Against Medical Advice,2018,END011,FLUID AND ELECTROLYTE DISORDERS,ESA001,HEMODIALYSIS,425,OTHER NON-HYPOVOLEMIC ELECTROLYTE DISORDERS,10,"ENDOCRINE, NUTRITIONAL AND METABOLIC DISEASES AND DISORDERS",3,Major,Major,Medical,Medicaid,Medicaid,,,,true,21290.21,15821.42
Capital/Adirond,Warren,5601000,001005,Glens Falls Hospital,70 or Older,117,F,White,Spanish/Hispanic,3,Emergency,Home or Self Care,2018,END011,FLUID AND ELECTROLYTE DISORDERS,ESA001,HEMODIALYSIS,425,OTHER NON-HYPOVOLEMIC ELECTROLYTE DISORDERS,10,"ENDOCRINE, NUTRITIONAL AND METABOLIC DISEASES AND DISORDERS",3,Major,Major,Medical,Medicare,Medicaid,,,,true,12642.57,5023.95
New York City,Kings,7001020,001305,Maimonides Medical Center,50 to 69,112,M,Other Race,Not Span/Hispanic,2,Emergency,Home w/ Home Health Services,2018,END011,FLUID AND ELECTROLYTE DISORDERS,ADM017,ADMINISTRATION OF NUTRITIONAL AND ELECTROLYTIC SUBSTANCES,425,OTHER NON-HYPOVOLEMIC ELECTROLYTE DISORDERS,10,"ENDOCRINE, NUTRITIONAL AND METABOLIC DISEASES AND DISORDERS",3,Major,Major,Medical,Medicare,Medicaid,Self-Pay,,,true,16510.02,5456.2
New York City,Manhattan,7002024,001456,Mount Sinai Hospital,50 to 69,101,M,Other Race,Spanish/Hispanic,3,Emergency,Home w/ Home Health Services,2018,END011,FLUID AND ELECTROLYTE DISORDERS,ESA001,HEMODIALYSIS,425,OTHER NON-HYPOVOLEMIC ELECTROLYTE DISORDERS,10,"ENDOCRINE, NUTRITIONAL AND METABOLIC DISEASES AND DISORDERS",3,Major,Minor,Medical,Medicare,Medicaid,Self-Pay,,,true,41444.83,12809.38
Western NY,Erie,1401010,000216,Roswell Park Cancer Institute,50 to 69,141,M,Black/African American,Not Span/Hispanic,3,Elective,Home or Self Care,2018,END016,OTHER SPECIFIED AND UNSPECIFIED NUTRITIONAL AND METABOLIC DISORDERS,,,425,OTHER NON-HYPOVOLEMIC ELECTROLYTE DISORDERS,10,"ENDOCRINE, NUTRITIONAL AND METABOLIC DISEASES AND DISORDERS",3,Major,Moderate,Medical,Blue Cross/Blue Shield,,,,,false,26750.15,10952.1
Capital/Adirond,Schenectady,4601001,000829,Ellis Hospital,70 or Older,123,M,White,Not Span/Hispanic,1,Emergency,Home or Self Care,2018,END011,FLUID AND ELECTROLYTE DISORDERS,,,425,OTHER NON-HYPOVOLEMIC ELECTROLYTE DISORDERS,10,"ENDOCRINE, NUTRITIONAL AND METABOLIC DISEASES AND DISORDERS",2,Moderate,Major,Medical,Medicare,Medicare,Medicaid,,,true,7872.7,1913.11
Capital/Adirond,Warren,5601000,001005,Glens Falls Hospital,50 to 69,128,F,White,Not Span/Hispanic,21,Emergency,Inpatient Rehabilitation Facility,2018,END011,FLUID AND ELECTROLYTE DISORDERS,CAR024,VENOUS AND ARTERIAL CATHETER PLACEMENT,425,OTHER NON-HYPOVOLEMIC ELECTROLYTE DISORDERS,10,"ENDOCRINE, NUTRITIONAL AND METABOLIC DISEASES AND DISORDERS",4,Extreme,Extreme,Medical,Federal/State/Local/VA,Medicaid,,,,true,151646.99,66895.57
New York City,Kings,7001020,001305,Maimonides Medical Center,50 to 69,112,F,Black/African American,Not Span/Hispanic,3,Emergency,Home or Self Care,2018,END011,FLUID AND ELECTROLYTE DISORDERS,OTR004,ISOLATION PROCEDURES,425,OTHER NON-HYPOVOLEMIC ELECTROLYTE DISORDERS,10,"ENDOCRINE, NUTRITIONAL AND METABOLIC DISEASES AND DISORDERS",2,Moderate,Moderate,Medical,Blue Cross/Blue Shield,Self-Pay,,,,false,20283,5377.56
New York City,Manhattan,7002024,001456,Mount Sinai Hospital,50 to 69,113,M,Other Race,Spanish/Hispanic,2,Emergency,Home or Self Care,2018,END011,FLUID AND ELECTROLYTE DISORDERS,,,425,OTHER NON-HYPOVOLEMIC ELECTROLYTE DISORDERS,10,"ENDOCRINE, NUTRITIONAL AND METABOLIC DISEASES AND DISORDERS",3,Major,Major,Medical,Medicare,Medicare,Medicaid,,,true,29048.89,8501.89
Long Island,Nassau,2951001,000541,North Shore University Hospital,50 to 69,115,F,Black/African American,Not Span/Hispanic,19,Emergency,Home w/ Home Health Services,2018,END016,OTHER SPECIFIED AND UNSPECIFIED NUTRITIONAL AND METABOLIC DISORDERS,,,425,OTHER NON-HYPOVOLEMIC ELECTROLYTE DISORDERS,10,"ENDOCRINE, NUTRITIONAL AND METABOLIC DISEASES AND DISORDERS",2,Moderate,Moderate,Medical,Medicare,Private Health Insurance,,,,true,199282.02,37715.49
Hudson Valley,Orange,3522000,000694,St Luke's Cornwall Hospital/Newburgh,50 to 69,125,M,Multi-racial,Unknown,7,Emergency,Home or Self Care,2018,END011,FLUID AND ELECTROLYTE DISORDERS,ESA001,HEMODIALYSIS,425,OTHER NON-HYPOVOLEMIC ELECTROLYTE DISORDERS,10,"ENDOCRINE, NUTRITIONAL AND METABOLIC DISEASES AND DISORDERS",3,Major,Minor,Medical,Medicare,Medicaid,,,,true,69752.11,17950.54
New York City,Kings,7001021,001306,New York - Presbyterian Brooklyn Methodist Hospital,70 or Older,112,F,Black/African American,Not Span/Hispanic,9,Emergency,Skilled Nursing Home,2018,END016,OTHER SPECIFIED AND UNSPECIFIED NUTRITIONAL AND METABOLIC DISORDERS,ESA004,NON-INVASIVE VENTILATION,425,OTHER NON-HYPOVOLEMIC ELECTROLYTE DISORDERS,10,"ENDOCRINE, NUTRITIONAL AND METABOLIC DISEASES AND DISORDERS",4,Extreme,Major,Medical,Medicare,Medicare,Self-Pay,,,true,57823.85,14522.85
New York City,Bronx,7000008,001172,Lincoln Medical & Mental Health Center,50 to 69,104,F,Other Race,Spanish/Hispanic,1,Emergency,Home or Self Care,2018,END011,FLUID AND ELECTROLYTE DISORDERS,ESA001,HEMODIALYSIS,425,OTHER NON-HYPOVOLEMIC ELECTROLYTE DISORDERS,10,"ENDOCRINE, NUTRITIONAL AND METABOLIC DISEASES AND DISORDERS",3,Major,Moderate,Medical,Medicaid,,,,,true,6981.69,4123.09
Western NY,Genesee,1801000,000339,United Memorial Medical Center North Street Campus,18 to 29,141,F,White,Not Span/Hispanic,1,Emergency,Home or Self Care,2018,END011,FLUID AND ELECTROLYTE DISORDERS,,,425,OTHER NON-HYPOVOLEMIC ELECTROLYTE DISORDERS,10,"ENDOCRINE, NUTRITIONAL AND METABOLIC DISEASES AND DISORDERS",2,Moderate,Minor,Medical,Private Health Insurance,,,,,true,6573.99,2811.13
New York City,Kings,7001021,001306,New York - Presbyterian Brooklyn Methodist Hospital,70 or Older,112,F,Black/African American,Not Span/Hispanic,2,Emergency,Home w/ Home Health Services,2018,END011,FLUID AND ELECTROLYTE DISORDERS,ESA001,HEMODIALYSIS,425,OTHER NON-HYPOVOLEMIC ELECTROLYTE DISORDERS,10,"ENDOCRINE, NUTRITIONAL AND METABOLIC DISEASES AND DISORDERS",3,Major,Major,Medical,Medicare,Medicaid,Self-Pay,,,true,15549.61,5362.59
Finger Lakes,Steuben,5001000,000866,Corning Hospital,50 to 69,148,M,White,Not Span/Hispanic,1,Emergency,Home or Self Care,2018,END016,OTHER SPECIFIED AND UNSPECIFIED NUTRITIONAL AND METABOLIC DISORDERS,,,425,OTHER NON-HYPOVOLEMIC ELECTROLYTE DISORDERS,10,"ENDOCRINE, NUTRITIONAL AND METABOLIC DISEASES AND DISORDERS",2,Moderate,Moderate,Medical,Blue Cross/Blue Shield,,,,,true,25231.75,5324
Hudson Valley,Westchester,5932000,001129,Phelps Hospital,50 to 69,105,M,White,Not Span/Hispanic,3,Emergency,Home or Self Care,2018,END016,OTHER SPECIFIED AND UNSPECIFIED NUTRITIONAL AND METABOLIC DISORDERS,ADM001,TRANSFUSION OF BLOOD AND BLOOD PRODUCTS,425,OTHER NON-HYPOVOLEMIC ELECTROLYTE DISORDERS,10,"ENDOCRINE, NUTRITIONAL AND METABOLIC DISEASES AND DISORDERS",3,Major,Major,Medical,Medicare,,,,,true,35783.48,11156.33
Long Island,Nassau,7003004,000518,Long Island Jewish Valley Stream,70 or Older,114,F,Black/African American,Not Span/Hispanic,4,Emergency,Home or Self Care,2018,END011,FLUID AND ELECTROLYTE DISORDERS,ESA001,HEMODIALYSIS,425,OTHER NON-HYPOVOLEMIC ELECTROLYTE DISORDERS,10,"ENDOCRINE, NUTRITIONAL AND METABOLIC DISEASES AND DISORDERS",2,Moderate,Moderate,Medical,Medicare,Medicare,,,,true,52451.32,10827.58
Western NY,Erie,1401008,000213,Mercy Hospital of Buffalo,30 to 49,140,M,Other Race,Not Span/Hispanic,3,Urgent,Home w/ Home Health Services,2018,END011,FLUID AND ELECTROLYTE DISORDERS,ESA001,HEMODIALYSIS,425,OTHER NON-HYPOVOLEMIC ELECTROLYTE DISORDERS,10,"ENDOCRINE, NUTRITIONAL AND METABOLIC DISEASES AND DISORDERS",3,Major,Moderate,Medical,Medicare,Medicare,Medicaid,,,false,11355.98,4598.24
Long Island,Suffolk,5123000,000885,Long Island Community Hospital,50 to 69,117,F,White,Not Span/Hispanic,3,Emergency,Home or Self Care,2018,END011,FLUID AND ELECTROLYTE DISORDERS,,,425,OTHER NON-HYPOVOLEMIC ELECTROLYTE DISORDERS,10,"ENDOCRINE, NUTRITIONAL AND METABOLIC DISEASES AND DISORDERS",1,Minor,Minor,Medical,Private Health Insurance,,,,,true,21802.54,4355.05
New York City,Manhattan,7002054,001464,New York-Presbyterian Hospital - Columbia Presbyterian Center,50 to 69,104,F,Black/African American,Not Span/Hispanic,7,Emergency,Left Against Medical Advice,2018,END011,FLUID AND ELECTROLYTE DISORDERS,ESA001,HEMODIALYSIS,425,OTHER NON-HYPOVOLEMIC ELECTROLYTE DISORDERS,10,"ENDOCRINE, NUTRITIONAL AND METABOLIC DISEASES AND DISORDERS",3,Major,Moderate,Medical,Medicaid,Medicaid,Self-Pay,,,true,77410.93,18223.21
Southern Tier,Broome,0303001,000042,United Health Services Hospitals Inc. - Binghamton General Hospital,50 to 69,139,M,White,Not Span/Hispanic,4,Emergency,Home or Self Care,2018,END016,OTHER SPECIFIED AND UNSPECIFIED NUTRITIONAL AND METABOLIC DISORDERS,,,425,OTHER NON-HYPOVOLEMIC ELECTROLYTE DISORDERS,10,"ENDOCRINE, NUTRITIONAL AND METABOLIC DISEASES AND DISORDERS",2,Moderate,Minor,Medical,Blue Cross/Blue Shield,,,,,true,10167.1,5723.79
New York City,Kings,7001045,001692,Woodhull Medical & Mental Health Center,50 to 69,112,M,Black/African American,Not Span/Hispanic,2,Emergency,Home or Self Care,2018,END011,FLUID AND ELECTROLYTE DISORDERS,ESA004,NON-INVASIVE VENTILATION,425,OTHER NON-HYPOVOLEMIC ELECTROLYTE DISORDERS,10,"ENDOCRINE, NUTRITIONAL AND METABOLIC DISEASES AND DISORDERS",3,Major,Extreme,Medical,Medicare,,,,,true,19725.87,15401.62
New York City,Manhattan,7002054,001437,New York-Presbyterian/Lower Manhattan Hospital,50 to 69,112,M,Black/African American,Not Span/Hispanic,3,Emergency,Home or Self Care,2018,END011,FLUID AND ELECTROLYTE DISORDERS,ADM017,ADMINISTRATION OF NUTRITIONAL AND ELECTROLYTIC SUBSTANCES,425,OTHER NON-HYPOVOLEMIC ELECTROLYTE DISORDERS,10,"ENDOCRINE, NUTRITIONAL AND METABOLIC DISEASES AND DISORDERS",3,Major,Major,Medical,Blue Cross/Blue Shield,"Managed Care, Unspecified",Self-Pay,,,true,51882.08,11153.31
New York City,Manhattan,7002054,001458,New York-Presbyterian Hospital - New York Weill Cornell Center,50 to 69,OOS,M,Black/African American,Not Span/Hispanic,2,Emergency,Home or Self Care,2018,END011,FLUID AND ELECTROLYTE DISORDERS,ESA001,HEMODIALYSIS,425,OTHER NON-HYPOVOLEMIC ELECTROLYTE DISORDERS,10,"ENDOCRINE, NUTRITIONAL AND METABOLIC DISEASES AND DISORDERS",3,Major,Minor,Medical,Private Health Insurance,Medicare,Self-Pay,,,true,28341.65,7086.85
Long Island,Nassau,2951001,000541,North Shore University Hospital,70 or Older,114,M,White,Not Span/Hispanic,8,Emergency,Skilled Nursing Home,2018,END011,FLUID AND ELECTROLYTE DISORDERS,ESA004,NON-INVASIVE VENTILATION,425,OTHER NON-HYPOVOLEMIC ELECTROLYTE DISORDERS,10,"ENDOCRINE, NUTRITIONAL AND METABOLIC DISEASES AND DISORDERS",2,Moderate,Moderate,Medical,Medicare,Medicare,Private Health Insurance,,,true,85353.82,13915.43
New York City,Bronx,7000001,001178,BronxCare Hospital Center,30 to 49,104,F,Other Race,Spanish/Hispanic,3,Emergency,Home or Self Care,2018,END016,OTHER SPECIFIED AND UNSPECIFIED NUTRITIONAL AND METABOLIC DISORDERS,,,425,OTHER NON-HYPOVOLEMIC ELECTROLYTE DISORDERS,10,"ENDOCRINE, NUTRITIONAL AND METABOLIC DISEASES AND DISORDERS",2,Moderate,Minor,Medical,Blue Cross/Blue Shield,,,,,true,10856.24,12507.31
New York City,Kings,7001045,001692,Woodhull Medical & Mental Health Center,50 to 69,112,M,Black/African American,Not Span/Hispanic,3,Emergency,Home w/ Home Health Services,2018,END011,FLUID AND ELECTROLYTE DISORDERS,ESA001,HEMODIALYSIS,425,OTHER NON-HYPOVOLEMIC ELECTROLYTE DISORDERS,10,"ENDOCRINE, NUTRITIONAL AND METABOLIC DISEASES AND DISORDERS",3,Major,Major,Medical,Medicare,Medicare,Medicaid,,,true,20295.54,15846.41
New York City,Queens,7003000,001626,Elmhurst Hospital Center,50 to 69,114,F,Other Race,Spanish/Hispanic,4,Emergency,Home or Self Care,2018,END011,FLUID AND ELECTROLYTE DISORDERS,ESA001,HEMODIALYSIS,425,OTHER NON-HYPOVOLEMIC ELECTROLYTE DISORDERS,10,"ENDOCRINE, NUTRITIONAL AND METABOLIC DISEASES AND DISORDERS",2,Moderate,Moderate,Medical,Medicaid,,,,,true,24269.37,14439.45
New York City,Queens,7003003,001629,Jamaica Hospital Medical Center,70 or Older,114,M,Black/African American,Not Span/Hispanic,3,Emergency,Home w/ Home Health Services,2018,END011,FLUID AND ELECTROLYTE DISORDERS,ESA001,HEMODIALYSIS,425,OTHER NON-HYPOVOLEMIC ELECTROLYTE DISORDERS,10,"ENDOCRINE, NUTRITIONAL AND METABOLIC DISEASES AND DISORDERS",3,Major,Major,Medical,Private Health Insurance,,,,,true,13819,7329.05
Western NY,Erie,1401005,000210,Erie County Medical Center,50 to 69,142,M,White,Not Span/Hispanic,11,Emergency,Home or Self Care,2018,END011,FLUID AND ELECTROLYTE DISORDERS,,,425,OTHER NON-HYPOVOLEMIC ELECTROLYTE DISORDERS,10,"ENDOCRINE, NUTRITIONAL AND METABOLIC DISEASES AND DISORDERS",3,Major,Moderate,Medical,Medicare,,,,,true,22692.92,14934.8
Long Island,Nassau,2951001,000541,North Shore University Hospital,30 to 49,115,F,Black/African American,Not Span/Hispanic,3,Emergency,Home or Self Care,2018,END011,FLUID AND ELECTROLYTE DISORDERS,ADM013,PERITONEAL DIALYSIS,425,OTHER NON-HYPOVOLEMIC ELECTROLYTE DISORDERS,10,"ENDOCRINE, NUTRITIONAL AND METABOLIC DISEASES AND DISORDERS",3,Major,Major,Medical,Medicare,Private Health Insurance,Medicaid,,,true,35426.54,6423.35
Hudson Valley,Orange,3522000,000694,St Luke's Cornwall Hospital/Newburgh,50 to 69,125,F,White,Not Span/Hispanic,7,Emergency,Inpatient Rehabilitation Facility,2018,END011,FLUID AND ELECTROLYTE DISORDERS,GIS017,GASTROSTOMY,425,OTHER NON-HYPOVOLEMIC ELECTROLYTE DISORDERS,10,"ENDOCRINE, NUTRITIONAL AND METABOLIC DISEASES AND DISORDERS",4,Extreme,Major,Medical,Medicare,Blue Cross/Blue Shield,,,,true,65540.47,17073.09
Western NY,Erie,1401013,000218,Sisters of Charity Hospital,50 to 69,142,F,Black/African American,Not Span/Hispanic,2,Emergency,Home or Self Care,2018,END011,FLUID AND ELECTROLYTE DISORDERS,MAM008,CARDIAC MONITORING,425,OTHER NON-HYPOVOLEMIC ELECTROLYTE DISORDERS,10,"ENDOCRINE, NUTRITIONAL AND METABOLIC DISEASES AND DISORDERS",2,Moderate,Minor,Medical,Medicare,Medicare,,,,true,7956.97,3486.01
Long Island,Nassau,2908000,000511,NYU Langone Hospital-Long Island,30 to 49,110,M,White,Not Span/Hispanic,2,Emergency,Home or Self Care,2018,END016,OTHER SPECIFIED AND UNSPECIFIED NUTRITIONAL AND METABOLIC DISORDERS,,,425,OTHER NON-HYPOVOLEMIC ELECTROLYTE DISORDERS,10,"ENDOCRINE, NUTRITIONAL AND METABOLIC DISEASES AND DISORDERS",1,Minor,Moderate,Medical,Blue Cross/Blue Shield,,,,,true,31567.04,5505.25