Hospital Service Area,Hospital County,Operating Certificate Number,Permanent Facility Id,Facility Name,Age Group,Zip Code - 3 digits,Gender,Race,Ethnicity,Length of Stay,Type of Admission,Patient Disposition,Discharge Year,CCS Diagnosis Code,CCS Diagnosis Description,CCS Procedure Code,CCS Procedure Description,APR DRG Code,APR DRG Description,APR MDC Code,APR MDC Description,APR Severity of Illness Code,APR Severity of Illness Description,APR Risk of Mortality,APR Medical Surgical Description,Payment Typology 1,Payment Typology 2,Payment Typology 3,Birth Weight,Abortion Edit Indicator,Emergency Department Indicator,Total Charges,Total Costs
New York City,Kings,7002053,001304,NYU Langone Hospital-Brooklyn,70 or Older,112,F,White,Not Span/Hispanic,3,Emergency,Home w/ Home Health Services,2019,END011,FLUID AND ELECTROLYTE DISORDERS,ESA001,HEMODIALYSIS,425,OTHER NON-HYPOVOLEMIC ELECTROLYTE DISORDERS,10,"ENDOCRINE, NUTRITIONAL AND METABOLIC DISEASES AND DISORDERS",3,Major,Major,Medical,Medicare,Medicare,,,,true,60723.34,14454.02
New York City,Kings,7002053,001304,NYU Langone Hospital-Brooklyn,50 to 69,112,M,White,Not Span/Hispanic,5,Emergency,Skilled Nursing Home,2019,END016,OTHER SPECIFIED AND UNSPECIFIED NUTRITIONAL AND METABOLIC DISORDERS,ADM021,"ADMINISTRATION OF THERAPEUTIC SUBSTANCES, NEC",425,OTHER NON-HYPOVOLEMIC ELECTROLYTE DISORDERS,10,"ENDOCRINE, NUTRITIONAL AND METABOLIC DISEASES AND DISORDERS",3,Major,Major,Medical,Blue Cross/Blue Shield,,,,,true,64565.16,20761.46
New York City,Kings,7002053,001304,NYU Langone Hospital-Brooklyn,50 to 69,112,F,Black/African American,Not Span/Hispanic,2,Emergency,Home or Self Care,2019,END011,FLUID AND ELECTROLYTE DISORDERS,ADM021,"ADMINISTRATION OF THERAPEUTIC SUBSTANCES, NEC",425,OTHER NON-HYPOVOLEMIC ELECTROLYTE DISORDERS,10,"ENDOCRINE, NUTRITIONAL AND METABOLIC DISEASES AND DISORDERS",3,Major,Moderate,Medical,Blue Cross/Blue Shield,,,,,true,26679.31,7928.93
New York City,Kings,7002053,001304,NYU Langone Hospital-Brooklyn,50 to 69,112,M,Other Race,Not Span/Hispanic,1,Emergency,Home or Self Care,2019,END011,FLUID AND ELECTROLYTE DISORDERS,,,425,OTHER NON-HYPOVOLEMIC ELECTROLYTE DISORDERS,10,"ENDOCRINE, NUTRITIONAL AND METABOLIC DISEASES AND DISORDERS",3,Major,Moderate,Medical,Private Health Insurance,,,,,true,20813.2,4647.27
New York City,Kings,7002053,001304,NYU Langone Hospital-Brooklyn,70 or Older,112,F,Black/African American,Not Span/Hispanic,2,Emergency,Home or Self Care,2019,END011,FLUID AND ELECTROLYTE DISORDERS,,,425,OTHER NON-HYPOVOLEMIC ELECTROLYTE DISORDERS,10,"ENDOCRINE, NUTRITIONAL AND METABOLIC DISEASES AND DISORDERS",3,Major,Major,Medical,Medicare,,,,,true,32464.59,8578.73
New York City,Kings,7002053,001304,NYU Langone Hospital-Brooklyn,70 or Older,112,F,Other Race,Unknown,3,Emergency,Home w/ Home Health Services,2019,END016,OTHER SPECIFIED AND UNSPECIFIED NUTRITIONAL AND METABOLIC DISORDERS,,,425,OTHER NON-HYPOVOLEMIC ELECTROLYTE DISORDERS,10,"ENDOCRINE, NUTRITIONAL AND METABOLIC DISEASES AND DISORDERS",2,Moderate,Major,Medical,Medicare,Medicaid,,,,true,63196.53,19015.85
New York City,Kings,7002053,001304,NYU Langone Hospital-Brooklyn,50 to 69,112,F,Black/African American,Spanish/Hispanic,4,Emergency,Home w/ Home Health Services,2019,END011,FLUID AND ELECTROLYTE DISORDERS,ESA001,HEMODIALYSIS,425,OTHER NON-HYPOVOLEMIC ELECTROLYTE DISORDERS,10,"ENDOCRINE, NUTRITIONAL AND METABOLIC DISEASES AND DISORDERS",3,Major,Moderate,Medical,Medicare,,,,,true,61778.4,17880.38
New York City,Kings,7002053,001304,NYU Langone Hospital-Brooklyn,30 to 49,114,M,Other Race,Not Span/Hispanic,4,Emergency,Home or Self Care,2019,END011,FLUID AND ELECTROLYTE DISORDERS,GIS006,PARACENTESIS,425,OTHER NON-HYPOVOLEMIC ELECTROLYTE DISORDERS,10,"ENDOCRINE, NUTRITIONAL AND METABOLIC DISEASES AND DISORDERS",3,Major,Major,Medical,Medicare,Medicaid,,,,true,52803.05,16989.16
New York City,Kings,7002053,001304,NYU Langone Hospital-Brooklyn,70 or Older,112,F,Other Race,Not Span/Hispanic,1,Emergency,Home w/ Home Health Services,2019,END011,FLUID AND ELECTROLYTE DISORDERS,ESA001,HEMODIALYSIS,425,OTHER NON-HYPOVOLEMIC ELECTROLYTE DISORDERS,10,"ENDOCRINE, NUTRITIONAL AND METABOLIC DISEASES AND DISORDERS",4,Extreme,Extreme,Medical,Medicare,Medicaid,,,,true,42057.47,13906.27
New York City,Kings,7002053,001304,NYU Langone Hospital-Brooklyn,50 to 69,112,M,Other Race,Unknown,1,Emergency,Home or Self Care,2019,END011,FLUID AND ELECTROLYTE DISORDERS,,,425,OTHER NON-HYPOVOLEMIC ELECTROLYTE DISORDERS,10,"ENDOCRINE, NUTRITIONAL AND METABOLIC DISEASES AND DISORDERS",1,Minor,Minor,Medical,Private Health Insurance,,,,,true,23776.03,5548.23
New York City,Kings,7002053,001304,NYU Langone Hospital-Brooklyn,70 or Older,112,F,White,Not Span/Hispanic,3,Emergency,Home w/ Home Health Services,2019,END011,FLUID AND ELECTROLYTE DISORDERS,,,425,OTHER NON-HYPOVOLEMIC ELECTROLYTE DISORDERS,10,"ENDOCRINE, NUTRITIONAL AND METABOLIC DISEASES AND DISORDERS",2,Moderate,Moderate,Medical,Medicare,Medicaid,,,,true,31465.69,11065.39
New York City,Kings,7002053,001304,NYU Langone Hospital-Brooklyn,50 to 69,112,M,Black/African American,Not Span/Hispanic,3,Emergency,Home or Self Care,2019,END011,FLUID AND ELECTROLYTE DISORDERS,,,425,OTHER NON-HYPOVOLEMIC ELECTROLYTE DISORDERS,10,"ENDOCRINE, NUTRITIONAL AND METABOLIC DISEASES AND DISORDERS",2,Moderate,Moderate,Medical,Medicaid,,,,,true,31383.7,11396.34
New York City,Kings,7002053,001304,NYU Langone Hospital-Brooklyn,30 to 49,112,M,Other Race,Unknown,12,Emergency,Home or Self Care,2019,END011,FLUID AND ELECTROLYTE DISORDERS,IMG004,FLUOROSCOPY OF NON-CIRCULATORY ORGANS,425,OTHER NON-HYPOVOLEMIC ELECTROLYTE DISORDERS,10,"ENDOCRINE, NUTRITIONAL AND METABOLIC DISEASES AND DISORDERS",3,Major,Minor,Medical,Medicaid,,,,,true,185027.71,56441.61
New York City,Kings,7002053,001304,NYU Langone Hospital-Brooklyn,50 to 69,112,F,Other Race,Not Span/Hispanic,1,Emergency,Home or Self Care,2019,END011,FLUID AND ELECTROLYTE DISORDERS,,,425,OTHER NON-HYPOVOLEMIC ELECTROLYTE DISORDERS,10,"ENDOCRINE, NUTRITIONAL AND METABOLIC DISEASES AND DISORDERS",2,Moderate,Minor,Medical,Medicaid,,,,,true,20889.81,5201.6
New York City,Kings,7002053,001304,NYU Langone Hospital-Brooklyn,50 to 69,112,M,White,Not Span/Hispanic,1,Emergency,Left Against Medical Advice,2019,END011,FLUID AND ELECTROLYTE DISORDERS,ESA001,HEMODIALYSIS,425,OTHER NON-HYPOVOLEMIC ELECTROLYTE DISORDERS,10,"ENDOCRINE, NUTRITIONAL AND METABOLIC DISEASES AND DISORDERS",3,Major,Moderate,Medical,Medicare,Blue Cross/Blue Shield,,,,true,18334.02,5314.27
New York City,Kings,7002053,001304,NYU Langone Hospital-Brooklyn,30 to 49,103,F,Black/African American,Not Span/Hispanic,3,Emergency,Home w/ Home Health Services,2019,END011,FLUID AND ELECTROLYTE DISORDERS,ESA001,HEMODIALYSIS,425,OTHER NON-HYPOVOLEMIC ELECTROLYTE DISORDERS,10,"ENDOCRINE, NUTRITIONAL AND METABOLIC DISEASES AND DISORDERS",3,Major,Moderate,Medical,Medicare,Medicaid,,,,true,52421.66,16927.84
New York City,Kings,7002053,001304,NYU Langone Hospital-Brooklyn,50 to 69,112,M,Other Race,Not Span/Hispanic,4,Emergency,Home or Self Care,2019,END011,FLUID AND ELECTROLYTE DISORDERS,,,425,OTHER NON-HYPOVOLEMIC ELECTROLYTE DISORDERS,10,"ENDOCRINE, NUTRITIONAL AND METABOLIC DISEASES AND DISORDERS",3,Major,Major,Medical,Private Health Insurance,,,,,true,63137.12,16128.68
New York City,Kings,7002053,001304,NYU Langone Hospital-Brooklyn,70 or Older,112,F,Other Race,Spanish/Hispanic,1,Emergency,Home w/ Home Health Services,2019,END011,FLUID AND ELECTROLYTE DISORDERS,ESA001,HEMODIALYSIS,425,OTHER NON-HYPOVOLEMIC ELECTROLYTE DISORDERS,10,"ENDOCRINE, NUTRITIONAL AND METABOLIC DISEASES AND DISORDERS",3,Major,Major,Medical,Private Health Insurance,Medicaid,,,,true,25476.76,6059.22
New York City,Kings,7002053,001304,NYU Langone Hospital-Brooklyn,50 to 69,103,M,Other Race,Not Span/Hispanic,20,Emergency,Left Against Medical Advice,2019,END011,FLUID AND ELECTROLYTE DISORDERS,ESA001,HEMODIALYSIS,425,OTHER NON-HYPOVOLEMIC ELECTROLYTE DISORDERS,10,"ENDOCRINE, NUTRITIONAL AND METABOLIC DISEASES AND DISORDERS",3,Major,Moderate,Medical,Medicare,,,,,true,322879.21,80165.21
New York City,Kings,7002053,001304,NYU Langone Hospital-Brooklyn,50 to 69,112,M,Other Race,Spanish/Hispanic,3,Emergency,Home or Self Care,2019,END011,FLUID AND ELECTROLYTE DISORDERS,ESA001,HEMODIALYSIS,425,OTHER NON-HYPOVOLEMIC ELECTROLYTE DISORDERS,10,"ENDOCRINE, NUTRITIONAL AND METABOLIC DISEASES AND DISORDERS",3,Major,Moderate,Medical,Medicaid,,,,,true,50247.46,14417.83
New York City,Kings,7002053,001304,NYU Langone Hospital-Brooklyn,50 to 69,112,M,Other Race,Unknown,7,Emergency,Home w/ Home Health Services,2019,END011,FLUID AND ELECTROLYTE DISORDERS,,,425,OTHER NON-HYPOVOLEMIC ELECTROLYTE DISORDERS,10,"ENDOCRINE, NUTRITIONAL AND METABOLIC DISEASES AND DISORDERS",2,Moderate,Minor,Medical,Medicaid,,,,,true,71211.62,23964.08
New York City,Kings,7002053,001304,NYU Langone Hospital-Brooklyn,50 to 69,112,M,White,Not Span/Hispanic,1,Emergency,Home or Self Care,2019,END011,FLUID AND ELECTROLYTE DISORDERS,ESA001,HEMODIALYSIS,425,OTHER NON-HYPOVOLEMIC ELECTROLYTE DISORDERS,10,"ENDOCRINE, NUTRITIONAL AND METABOLIC DISEASES AND DISORDERS",3,Major,Major,Medical,Medicare,Blue Cross/Blue Shield,,,,true,34415.12,10285.28
New York City,Kings,7002053,001304,NYU Langone Hospital-Brooklyn,50 to 69,112,F,Black/African American,Not Span/Hispanic,1,Emergency,Home w/ Home Health Services,2019,END011,FLUID AND ELECTROLYTE DISORDERS,ADM015,ADMINISTRATION OF ANTIBIOTICS,425,OTHER NON-HYPOVOLEMIC ELECTROLYTE DISORDERS,10,"ENDOCRINE, NUTRITIONAL AND METABOLIC DISEASES AND DISORDERS",2,Moderate,Minor,Medical,Private Health Insurance,,,,,true,19535.66,5099.97
New York City,Kings,7002053,001304,NYU Langone Hospital-Brooklyn,50 to 69,112,M,Other Race,Spanish/Hispanic,1,Emergency,Home or Self Care,2019,END011,FLUID AND ELECTROLYTE DISORDERS,ESA001,HEMODIALYSIS,425,OTHER NON-HYPOVOLEMIC ELECTROLYTE DISORDERS,10,"ENDOCRINE, NUTRITIONAL AND METABOLIC DISEASES AND DISORDERS",2,Moderate,Minor,Medical,Private Health Insurance,,,,,true,31640.2,7161.92
New York City,Kings,7002053,001304,NYU Langone Hospital-Brooklyn,50 to 69,112,F,Black/African American,Unknown,3,Emergency,Psychiatric Hospital or Unit of Hosp,2019,END011,FLUID AND ELECTROLYTE DISORDERS,,,425,OTHER NON-HYPOVOLEMIC ELECTROLYTE DISORDERS,10,"ENDOCRINE, NUTRITIONAL AND METABOLIC DISEASES AND DISORDERS",3,Major,Major,Medical,Medicaid,,,,,true,34718.23,11695.75
New York City,Kings,7002053,001304,NYU Langone Hospital-Brooklyn,70 or Older,112,F,White,Not Span/Hispanic,2,Emergency,Home w/ Home Health Services,2019,END011,FLUID AND ELECTROLYTE DISORDERS,ADM015,ADMINISTRATION OF ANTIBIOTICS,425,OTHER NON-HYPOVOLEMIC ELECTROLYTE DISORDERS,10,"ENDOCRINE, NUTRITIONAL AND METABOLIC DISEASES AND DISORDERS",3,Major,Major,Medical,Medicare,Medicaid,,,,true,32801.76,8814.94
New York City,Kings,7002053,001304,NYU Langone Hospital-Brooklyn,70 or Older,112,F,Other Race,Not Span/Hispanic,2,Emergency,Home w/ Home Health Services,2019,END011,FLUID AND ELECTROLYTE DISORDERS,IMG007,COMPUTERIZED TOMOGRAPHY (CT) WITHOUT CONTRAST,425,OTHER NON-HYPOVOLEMIC ELECTROLYTE DISORDERS,10,"ENDOCRINE, NUTRITIONAL AND METABOLIC DISEASES AND DISORDERS",2,Moderate,Major,Medical,Medicare,Medicaid,,,,true,51970.36,11748.29
New York City,Kings,7002053,001304,NYU Langone Hospital-Brooklyn,50 to 69,112,M,Other Race,Unknown,2,Emergency,Home or Self Care,2019,END011,FLUID AND ELECTROLYTE DISORDERS,ADM021,"ADMINISTRATION OF THERAPEUTIC SUBSTANCES, NEC",425,OTHER NON-HYPOVOLEMIC ELECTROLYTE DISORDERS,10,"ENDOCRINE, NUTRITIONAL AND METABOLIC DISEASES AND DISORDERS",2,Moderate,Minor,Medical,Medicare,,,,,true,36393.54,9372.72
New York City,Kings,7002053,001304,NYU Langone Hospital-Brooklyn,30 to 49,103,M,White,Not Span/Hispanic,7,Emergency,Home w/ Home Health Services,2019,END011,FLUID AND ELECTROLYTE DISORDERS,,,425,OTHER NON-HYPOVOLEMIC ELECTROLYTE DISORDERS,10,"ENDOCRINE, NUTRITIONAL AND METABOLIC DISEASES AND DISORDERS",3,Major,Major,Medical,Blue Cross/Blue Shield,,,,,true,93966.85,26819.66
New York City,Kings,7002053,001304,NYU Langone Hospital-Brooklyn,50 to 69,112,F,Other Race,Not Span/Hispanic,1,Emergency,Left Against Medical Advice,2019,END011,FLUID AND ELECTROLYTE DISORDERS,IMG006,COMPUTERIZED TOMOGRAPHY (CT) WITH CONTRAST,425,OTHER NON-HYPOVOLEMIC ELECTROLYTE DISORDERS,10,"ENDOCRINE, NUTRITIONAL AND METABOLIC DISEASES AND DISORDERS",3,Major,Major,Medical,Medicaid,,,,,true,28626.17,6522.95
New York City,Kings,7002053,001304,NYU Langone Hospital-Brooklyn,50 to 69,112,F,Other Race,Spanish/Hispanic,1,Emergency,Home or Self Care,2019,END011,FLUID AND ELECTROLYTE DISORDERS,ADM017,ADMINISTRATION OF NUTRITIONAL AND ELECTROLYTIC SUBSTANCES,425,OTHER NON-HYPOVOLEMIC ELECTROLYTE DISORDERS,10,"ENDOCRINE, NUTRITIONAL AND METABOLIC DISEASES AND DISORDERS",3,Major,Moderate,Medical,Medicaid,,,,,true,22484.14,5273.5
New York City,Kings,7002053,001304,NYU Langone Hospital-Brooklyn,30 to 49,112,F,Black/African American,Not Span/Hispanic,1,Emergency,Home or Self Care,2019,END011,FLUID AND ELECTROLYTE DISORDERS,,,425,OTHER NON-HYPOVOLEMIC ELECTROLYTE DISORDERS,10,"ENDOCRINE, NUTRITIONAL AND METABOLIC DISEASES AND DISORDERS",2,Moderate,Moderate,Medical,Private Health Insurance,,,,,true,19917.43,4896.59
New York City,Kings,7002053,001304,NYU Langone Hospital-Brooklyn,50 to 69,112,F,Other Race,Not Span/Hispanic,3,Emergency,Home or Self Care,2019,END011,FLUID AND ELECTROLYTE DISORDERS,CAR024,VENOUS AND ARTERIAL CATHETER PLACEMENT,425,OTHER NON-HYPOVOLEMIC ELECTROLYTE DISORDERS,10,"ENDOCRINE, NUTRITIONAL AND METABOLIC DISEASES AND DISORDERS",2,Moderate,Moderate,Medical,Medicaid,,,,,true,53235.29,17457.92
New York City,Kings,7002053,001304,NYU Langone Hospital-Brooklyn,50 to 69,112,M,White,Not Span/Hispanic,1,Emergency,Left Against Medical Advice,2019,END011,FLUID AND ELECTROLYTE DISORDERS,,,425,OTHER NON-HYPOVOLEMIC ELECTROLYTE DISORDERS,10,"ENDOCRINE, NUTRITIONAL AND METABOLIC DISEASES AND DISORDERS",3,Major,Moderate,Medical,Private Health Insurance,,,,,true,13989.42,4438.78
New York City,Kings,7002053,001304,NYU Langone Hospital-Brooklyn,30 to 49,112,M,Other Race,Not Span/Hispanic,1,Emergency,Home or Self Care,2019,END011,FLUID AND ELECTROLYTE DISORDERS,CNS002,LUMBAR PUNCTURE,425,OTHER NON-HYPOVOLEMIC ELECTROLYTE DISORDERS,10,"ENDOCRINE, NUTRITIONAL AND METABOLIC DISEASES AND DISORDERS",2,Moderate,Minor,Medical,Medicaid,,,,,true,52786.65,6823.14
New York City,Kings,7002053,001304,NYU Langone Hospital-Brooklyn,50 to 69,112,M,White,Not Span/Hispanic,4,Emergency,Home or Self Care,2019,END016,OTHER SPECIFIED AND UNSPECIFIED NUTRITIONAL AND METABOLIC DISORDERS,,,425,OTHER NON-HYPOVOLEMIC ELECTROLYTE DISORDERS,10,"ENDOCRINE, NUTRITIONAL AND METABOLIC DISEASES AND DISORDERS",3,Major,Moderate,Medical,Blue Cross/Blue Shield,,,,,true,50438.28,16218.43
New York City,Kings,7002053,001304,NYU Langone Hospital-Brooklyn,18 to 29,112,F,Black/African American,Not Span/Hispanic,3,Emergency,Home w/ Home Health Services,2019,END011,FLUID AND ELECTROLYTE DISORDERS,ESA001,HEMODIALYSIS,425,OTHER NON-HYPOVOLEMIC ELECTROLYTE DISORDERS,10,"ENDOCRINE, NUTRITIONAL AND METABOLIC DISEASES AND DISORDERS",3,Major,Moderate,Medical,Medicaid,,,,,true,48797.05,14206.39
New York City,Kings,7002053,001304,NYU Langone Hospital-Brooklyn,50 to 69,112,M,White,Not Span/Hispanic,5,Emergency,Home w/ Home Health Services,2019,END011,FLUID AND ELECTROLYTE DISORDERS,ESA001,HEMODIALYSIS,425,OTHER NON-HYPOVOLEMIC ELECTROLYTE DISORDERS,10,"ENDOCRINE, NUTRITIONAL AND METABOLIC DISEASES AND DISORDERS",4,Extreme,Extreme,Medical,Medicare,Medicaid,,,,true,122729.2,36625.67
New York City,Kings,7002053,001304,NYU Langone Hospital-Brooklyn,30 to 49,114,F,White,Not Span/Hispanic,2,Emergency,Home or Self Care,2019,END011,FLUID AND ELECTROLYTE DISORDERS,,,425,OTHER NON-HYPOVOLEMIC ELECTROLYTE DISORDERS,10,"ENDOCRINE, NUTRITIONAL AND METABOLIC DISEASES AND DISORDERS",2,Moderate,Minor,Medical,Medicaid,,,,,true,35466.26,8872.7
New York City,Kings,7002053,001304,NYU Langone Hospital-Brooklyn,50 to 69,112,F,Black/African American,Spanish/Hispanic,1,Emergency,Home or Self Care,2019,END011,FLUID AND ELECTROLYTE DISORDERS,ADM021,"ADMINISTRATION OF THERAPEUTIC SUBSTANCES, NEC",425,OTHER NON-HYPOVOLEMIC ELECTROLYTE DISORDERS,10,"ENDOCRINE, NUTRITIONAL AND METABOLIC DISEASES AND DISORDERS",3,Major,Moderate,Medical,Medicare,Medicaid,,,,true,17433.09,4804.37
New York City,Kings,7002053,001304,NYU Langone Hospital-Brooklyn,70 or Older,112,M,Multi-racial,Not Span/Hispanic,2,Emergency,Home or Self Care,2019,END011,FLUID AND ELECTROLYTE DISORDERS,ESA001,HEMODIALYSIS,425,OTHER NON-HYPOVOLEMIC ELECTROLYTE DISORDERS,10,"ENDOCRINE, NUTRITIONAL AND METABOLIC DISEASES AND DISORDERS",3,Major,Major,Medical,Medicaid,,,,,true,33980.27,9032.9
New York City,Kings,7002053,001304,NYU Langone Hospital-Brooklyn,30 to 49,112,F,Black/African American,Not Span/Hispanic,1,Emergency,Home or Self Care,2019,END011,FLUID AND ELECTROLYTE DISORDERS,,,425,OTHER NON-HYPOVOLEMIC ELECTROLYTE DISORDERS,10,"ENDOCRINE, NUTRITIONAL AND METABOLIC DISEASES AND DISORDERS",1,Minor,Minor,Medical,Medicaid,,,,,true,14657.4,4405.27
New York City,Kings,7002053,001304,NYU Langone Hospital-Brooklyn,50 to 69,112,F,Other Race,Unknown,2,Emergency,Home or Self Care,2019,END011,FLUID AND ELECTROLYTE DISORDERS,,,425,OTHER NON-HYPOVOLEMIC ELECTROLYTE DISORDERS,10,"ENDOCRINE, NUTRITIONAL AND METABOLIC DISEASES AND DISORDERS",3,Major,Moderate,Medical,Medicare,Medicaid,,,,true,47956.32,10580.83
New York City,Kings,7002053,001304,NYU Langone Hospital-Brooklyn,50 to 69,OOS,M,White,Not Span/Hispanic,1,Emergency,Home or Self Care,2019,END011,FLUID AND ELECTROLYTE DISORDERS,,,425,OTHER NON-HYPOVOLEMIC ELECTROLYTE DISORDERS,10,"ENDOCRINE, NUTRITIONAL AND METABOLIC DISEASES AND DISORDERS",1,Minor,Minor,Medical,Private Health Insurance,,,,,true,16841.35,4677.22
New York City,Kings,7002053,001304,NYU Langone Hospital-Brooklyn,70 or Older,112,F,Other Race,Spanish/Hispanic,5,Emergency,Home w/ Home Health Services,2019,END011,FLUID AND ELECTROLYTE DISORDERS,ESA001,HEMODIALYSIS,425,OTHER NON-HYPOVOLEMIC ELECTROLYTE DISORDERS,10,"ENDOCRINE, NUTRITIONAL AND METABOLIC DISEASES AND DISORDERS",3,Major,Moderate,Medical,Medicare,Medicaid,,,,true,70808.08,22107.38
New York City,Kings,7002053,001304,NYU Langone Hospital-Brooklyn,50 to 69,112,F,Other Race,Not Span/Hispanic,9,Emergency,Skilled Nursing Home,2019,END016,OTHER SPECIFIED AND UNSPECIFIED NUTRITIONAL AND METABOLIC DISORDERS,,,425,OTHER NON-HYPOVOLEMIC ELECTROLYTE DISORDERS,10,"ENDOCRINE, NUTRITIONAL AND METABOLIC DISEASES AND DISORDERS",3,Major,Major,Medical,Medicare,,,,,true,223495.08,36053.68
New York City,Kings,7002053,001304,NYU Langone Hospital-Brooklyn,30 to 49,112,F,White,Not Span/Hispanic,15,Emergency,Home or Self Care,2019,END011,FLUID AND ELECTROLYTE DISORDERS,CAR025,PLACEMENT OF TUNNELED OR IMPLANTABLE PORTION OF A VASCULAR ACCESS DEVICE,425,OTHER NON-HYPOVOLEMIC ELECTROLYTE DISORDERS,10,"ENDOCRINE, NUTRITIONAL AND METABOLIC DISEASES AND DISORDERS",3,Major,Minor,Medical,Medicaid,,,,,true,192246.98,59659.69
New York City,Kings,7002053,001304,NYU Langone Hospital-Brooklyn,50 to 69,112,M,Other Race,Spanish/Hispanic,1,Emergency,Home or Self Care,2019,END011,FLUID AND ELECTROLYTE DISORDERS,,,425,OTHER NON-HYPOVOLEMIC ELECTROLYTE DISORDERS,10,"ENDOCRINE, NUTRITIONAL AND METABOLIC DISEASES AND DISORDERS",1,Minor,Moderate,Medical,Medicaid,,,,,true,28704.22,10778.92
New York City,Kings,7002053,001304,NYU Langone Hospital-Brooklyn,50 to 69,112,M,Other Race,Not Span/Hispanic,15,Emergency,Skilled Nursing Home,2019,END011,FLUID AND ELECTROLYTE DISORDERS,ADM021,"ADMINISTRATION OF THERAPEUTIC SUBSTANCES, NEC",425,OTHER NON-HYPOVOLEMIC ELECTROLYTE DISORDERS,10,"ENDOCRINE, NUTRITIONAL AND METABOLIC DISEASES AND DISORDERS",4,Extreme,Moderate,Medical,Medicare,Medicaid,,,,true,173998.63,58327.6
New York City,Kings,7002053,001304,NYU Langone Hospital-Brooklyn,50 to 69,103,M,Other Race,Not Span/Hispanic,4,Emergency,Home or Self Care,2019,END016,OTHER SPECIFIED AND UNSPECIFIED NUTRITIONAL AND METABOLIC DISORDERS,,,425,OTHER NON-HYPOVOLEMIC ELECTROLYTE DISORDERS,10,"ENDOCRINE, NUTRITIONAL AND METABOLIC DISEASES AND DISORDERS",2,Moderate,Minor,Medical,Blue Cross/Blue Shield,,,,,true,54135,16403.6
New York City,Kings,7002053,001304,NYU Langone Hospital-Brooklyn,70 or Older,112,F,White,Not Span/Hispanic,2,Emergency,Home w/ Home Health Services,2019,END011,FLUID AND ELECTROLYTE DISORDERS,,,425,OTHER NON-HYPOVOLEMIC ELECTROLYTE DISORDERS,10,"ENDOCRINE, NUTRITIONAL AND METABOLIC DISEASES AND DISORDERS",2,Moderate,Minor,Medical,Private Health Insurance,,,,,true,42729.87,9165.07
New York City,Kings,7002053,001304,NYU Langone Hospital-Brooklyn,30 to 49,112,M,Black/African American,Not Span/Hispanic,2,Emergency,Home or Self Care,2019,END011,FLUID AND ELECTROLYTE DISORDERS,ESA001,HEMODIALYSIS,425,OTHER NON-HYPOVOLEMIC ELECTROLYTE DISORDERS,10,"ENDOCRINE, NUTRITIONAL AND METABOLIC DISEASES AND DISORDERS",2,Moderate,Moderate,Medical,Medicare,Private Health Insurance,,,,true,45094.69,9298.49
New York City,Kings,7002053,001304,NYU Langone Hospital-Brooklyn,70 or Older,112,M,White,Not Span/Hispanic,1,Emergency,Left Against Medical Advice,2019,END011,FLUID AND ELECTROLYTE DISORDERS,,,425,OTHER NON-HYPOVOLEMIC ELECTROLYTE DISORDERS,10,"ENDOCRINE, NUTRITIONAL AND METABOLIC DISEASES AND DISORDERS",2,Moderate,Moderate,Medical,Private Health Insurance,,,,,true,20523.54,4905.13
New York City,Kings,7002053,001304,NYU Langone Hospital-Brooklyn,50 to 69,112,F,White,Not Span/Hispanic,10,Emergency,Hospice - Medical Facility,2019,END011,FLUID AND ELECTROLYTE DISORDERS,ESA003,MECHANICAL VENTILATION,425,OTHER NON-HYPOVOLEMIC ELECTROLYTE DISORDERS,10,"ENDOCRINE, NUTRITIONAL AND METABOLIC DISEASES AND DISORDERS",4,Extreme,Extreme,Medical,Blue Cross/Blue Shield,Medicare,,,,true,382404.35,88097.31
New York City,Kings,7002053,001304,NYU Langone Hospital-Brooklyn,50 to 69,112,M,White,Not Span/Hispanic,1,Emergency,Left Against Medical Advice,2019,END011,FLUID AND ELECTROLYTE DISORDERS,ESA001,HEMODIALYSIS,425,OTHER NON-HYPOVOLEMIC ELECTROLYTE DISORDERS,10,"ENDOCRINE, NUTRITIONAL AND METABOLIC DISEASES AND DISORDERS",3,Major,Major,Medical,Private Health Insurance,,,,,true,21935.82,5968.61
New York City,Kings,7002053,001304,NYU Langone Hospital-Brooklyn,50 to 69,112,M,Other Race,Spanish/Hispanic,3,Emergency,Home or Self Care,2019,END011,FLUID AND ELECTROLYTE DISORDERS,ADM021,"ADMINISTRATION OF THERAPEUTIC SUBSTANCES, NEC",425,OTHER NON-HYPOVOLEMIC ELECTROLYTE DISORDERS,10,"ENDOCRINE, NUTRITIONAL AND METABOLIC DISEASES AND DISORDERS",3,Major,Moderate,Medical,Private Health Insurance,,,,,true,55871.53,12197.73
New York City,Kings,7002053,001304,NYU Langone Hospital-Brooklyn,70 or Older,112,F,Other Race,Spanish/Hispanic,5,Emergency,Home or Self Care,2019,END011,FLUID AND ELECTROLYTE DISORDERS,,,425,OTHER NON-HYPOVOLEMIC ELECTROLYTE DISORDERS,10,"ENDOCRINE, NUTRITIONAL AND METABOLIC DISEASES AND DISORDERS",3,Major,Major,Medical,Medicaid,,,,,true,80671.68,20149.79
New York City,Kings,7002053,001304,NYU Langone Hospital-Brooklyn,70 or Older,112,M,Other Race,Spanish/Hispanic,9,Emergency,Skilled Nursing Home,2019,END011,FLUID AND ELECTROLYTE DISORDERS,ESA001,HEMODIALYSIS,425,OTHER NON-HYPOVOLEMIC ELECTROLYTE DISORDERS,10,"ENDOCRINE, NUTRITIONAL AND METABOLIC DISEASES AND DISORDERS",3,Major,Major,Medical,Medicaid,,,,,true,160742.99,41789.13
New York City,Kings,7002053,001304,NYU Langone Hospital-Brooklyn,30 to 49,112,M,White,Not Span/Hispanic,2,Emergency,Home or Self Care,2019,END011,FLUID AND ELECTROLYTE DISORDERS,ESA001,HEMODIALYSIS,425,OTHER NON-HYPOVOLEMIC ELECTROLYTE DISORDERS,10,"ENDOCRINE, NUTRITIONAL AND METABOLIC DISEASES AND DISORDERS",2,Moderate,Moderate,Medical,Medicare,Private Health Insurance,Medicaid,,,true,46940.98,11164.1