Hospital Service Area,Hospital County,Operating Certificate Number,Permanent Facility Id,Facility Name,Age Group,Zip Code - 3 digits,Gender,Race,Ethnicity,Length of Stay,Type of Admission,Patient Disposition,Discharge Year,CCS Diagnosis Code,CCS Diagnosis Description,CCS Procedure Code,CCS Procedure Description,APR DRG Code,APR DRG Description,APR MDC Code,APR MDC Description,APR Severity of Illness Code,APR Severity of Illness Description,APR Risk of Mortality,APR Medical Surgical Description,Payment Typology 1,Payment Typology 2,Payment Typology 3,Birth Weight,Abortion Edit Indicator,Emergency Department Indicator,Total Charges,Total Costs
Long Island,Nassau,2908000,000511,NYU Langone Hospital-Long Island,70 or Older,113,M,Other Race,Not Span/Hispanic,2,Emergency,Home or Self Care,2020,END011,FLUID AND ELECTROLYTE DISORDERS,SKB006,SKIN LACERATION REPAIR (EXCLUDING PERINEUM),425,OTHER NON-HYPOVOLEMIC ELECTROLYTE DISORDERS,10,"ENDOCRINE, NUTRITIONAL AND METABOLIC DISEASES AND DISORDERS",2,Moderate,Minor,Medical,Medicare,,,,,Y,41263.45,9469.6
Long Island,Nassau,2908000,000511,NYU Langone Hospital-Long Island,30 to 49,115,F,Other Race,Spanish/Hispanic,1,Emergency,Home or Self Care,2020,END011,FLUID AND ELECTROLYTE DISORDERS,,,425,OTHER NON-HYPOVOLEMIC ELECTROLYTE DISORDERS,10,"ENDOCRINE, NUTRITIONAL AND METABOLIC DISEASES AND DISORDERS",3,Major,Moderate,Medical,Private Health Insurance,,,,,Y,37137.19,11320.21
Long Island,Nassau,2908000,000511,NYU Langone Hospital-Long Island,50 to 69,115,F,Black/African American,Not Span/Hispanic,5,Emergency,Home w/ Home Health Services,2020,END011,FLUID AND ELECTROLYTE DISORDERS,ESA001,HEMODIALYSIS,425,OTHER NON-HYPOVOLEMIC ELECTROLYTE DISORDERS,10,"ENDOCRINE, NUTRITIONAL AND METABOLIC DISEASES AND DISORDERS",3,Major,Moderate,Medical,Medicare,Medicaid,,,,Y,88902.52,27607.29
Long Island,Nassau,2908000,000511,NYU Langone Hospital-Long Island,70 or Older,115,F,Black/African American,Not Span/Hispanic,3,Emergency,Home w/ Home Health Services,2020,END011,FLUID AND ELECTROLYTE DISORDERS,,,425,OTHER NON-HYPOVOLEMIC ELECTROLYTE DISORDERS,10,"ENDOCRINE, NUTRITIONAL AND METABOLIC DISEASES AND DISORDERS",2,Moderate,Major,Medical,Medicare,,,,,Y,33534.82,10880.91
Long Island,Nassau,2908000,000511,NYU Langone Hospital-Long Island,70 or Older,115,F,Other Race,Spanish/Hispanic,3,Emergency,Home w/ Home Health Services,2020,END011,FLUID AND ELECTROLYTE DISORDERS,ESA001,HEMODIALYSIS,425,OTHER NON-HYPOVOLEMIC ELECTROLYTE DISORDERS,10,"ENDOCRINE, NUTRITIONAL AND METABOLIC DISEASES AND DISORDERS",3,Major,Moderate,Medical,Medicare,Medicaid,,,,Y,71445.63,25002.75
Long Island,Nassau,2908000,000511,NYU Langone Hospital-Long Island,70 or Older,110,F,Black/African American,Unknown,1,Emergency,Home or Self Care,2020,END011,FLUID AND ELECTROLYTE DISORDERS,,,425,OTHER NON-HYPOVOLEMIC ELECTROLYTE DISORDERS,10,"ENDOCRINE, NUTRITIONAL AND METABOLIC DISEASES AND DISORDERS",2,Moderate,Minor,Medical,Private Health Insurance,,,,,Y,31924.68,6320.86
Long Island,Nassau,2908000,000511,NYU Langone Hospital-Long Island,70 or Older,115,F,White,Not Span/Hispanic,4,Emergency,Skilled Nursing Home,2020,END011,FLUID AND ELECTROLYTE DISORDERS,,,425,OTHER NON-HYPOVOLEMIC ELECTROLYTE DISORDERS,10,"ENDOCRINE, NUTRITIONAL AND METABOLIC DISEASES AND DISORDERS",2,Moderate,Minor,Medical,Medicare,Medicare,,,,Y,54590.22,15131.05
Long Island,Nassau,2908000,000511,NYU Langone Hospital-Long Island,50 to 69,115,F,Black/African American,Not Span/Hispanic,8,Emergency,Home w/ Home Health Services,2020,END011,FLUID AND ELECTROLYTE DISORDERS,ESA001,HEMODIALYSIS,425,OTHER NON-HYPOVOLEMIC ELECTROLYTE DISORDERS,10,"ENDOCRINE, NUTRITIONAL AND METABOLIC DISEASES AND DISORDERS",3,Major,Extreme,Medical,Medicare,Medicaid,,,,Y,155929.97,54422.83
Long Island,Nassau,2908000,000511,NYU Langone Hospital-Long Island,50 to 69,115,F,Other Race,Spanish/Hispanic,3,Emergency,Home or Self Care,2020,END016,OTHER SPECIFIED AND UNSPECIFIED NUTRITIONAL AND METABOLIC DISORDERS,,,425,OTHER NON-HYPOVOLEMIC ELECTROLYTE DISORDERS,10,"ENDOCRINE, NUTRITIONAL AND METABOLIC DISEASES AND DISORDERS",1,Minor,Minor,Medical,Medicaid,,,,,Y,39499.34,10953.08
Long Island,Nassau,2908000,000511,NYU Langone Hospital-Long Island,70 or Older,118,M,White,Not Span/Hispanic,8,Emergency,Home or Self Care,2020,END011,FLUID AND ELECTROLYTE DISORDERS,ESA005,CARDIAC CHEST COMPRESSION,425,OTHER NON-HYPOVOLEMIC ELECTROLYTE DISORDERS,10,"ENDOCRINE, NUTRITIONAL AND METABOLIC DISEASES AND DISORDERS",4,Extreme,Extreme,Medical,Private Health Insurance,,,,,Y,220474.73,65817.33
Long Island,Nassau,2908000,000511,NYU Langone Hospital-Long Island,50 to 69,115,F,Other Race,Spanish/Hispanic,2,Emergency,Home or Self Care,2020,END016,OTHER SPECIFIED AND UNSPECIFIED NUTRITIONAL AND METABOLIC DISORDERS,,,425,OTHER NON-HYPOVOLEMIC ELECTROLYTE DISORDERS,10,"ENDOCRINE, NUTRITIONAL AND METABOLIC DISEASES AND DISORDERS",1,Minor,Minor,Medical,Private Health Insurance,,,,,Y,29487.16,8836.41
Long Island,Nassau,2908000,000511,NYU Langone Hospital-Long Island,70 or Older,110,M,White,Not Span/Hispanic,15,Emergency,Home w/ Home Health Services,2020,END011,FLUID AND ELECTROLYTE DISORDERS,ESA001,HEMODIALYSIS,425,OTHER NON-HYPOVOLEMIC ELECTROLYTE DISORDERS,10,"ENDOCRINE, NUTRITIONAL AND METABOLIC DISEASES AND DISORDERS",3,Major,Major,Medical,Medicare,Medicare,,,,Y,164862.02,85697.84
Long Island,Nassau,2908000,000511,NYU Langone Hospital-Long Island,50 to 69,117,M,White,Not Span/Hispanic,2,Emergency,Home or Self Care,2020,END016,OTHER SPECIFIED AND UNSPECIFIED NUTRITIONAL AND METABOLIC DISORDERS,,,425,OTHER NON-HYPOVOLEMIC ELECTROLYTE DISORDERS,10,"ENDOCRINE, NUTRITIONAL AND METABOLIC DISEASES AND DISORDERS",2,Moderate,Major,Medical,Blue Cross/Blue Shield,Medicare,,,,Y,70323.98,10174.93
Long Island,Nassau,2908000,000511,NYU Langone Hospital-Long Island,70 or Older,115,F,White,Not Span/Hispanic,2,Emergency,Home or Self Care,2020,END011,FLUID AND ELECTROLYTE DISORDERS,IMG008,ULTRASONOGRAPHY,425,OTHER NON-HYPOVOLEMIC ELECTROLYTE DISORDERS,10,"ENDOCRINE, NUTRITIONAL AND METABOLIC DISEASES AND DISORDERS",2,Moderate,Major,Medical,Medicare,Blue Cross/Blue Shield,,,,Y,63168.59,12586.41
Long Island,Nassau,2908000,000511,NYU Langone Hospital-Long Island,50 to 69,115,F,White,Spanish/Hispanic,1,Emergency,Home or Self Care,2020,END011,FLUID AND ELECTROLYTE DISORDERS,,,425,OTHER NON-HYPOVOLEMIC ELECTROLYTE DISORDERS,10,"ENDOCRINE, NUTRITIONAL AND METABOLIC DISEASES AND DISORDERS",3,Major,Moderate,Medical,Medicare,Medicaid,,,,Y,34806.82,13306.22
Long Island,Nassau,2908000,000511,NYU Langone Hospital-Long Island,70 or Older,110,F,White,Not Span/Hispanic,3,Emergency,Home w/ Home Health Services,2020,END016,OTHER SPECIFIED AND UNSPECIFIED NUTRITIONAL AND METABOLIC DISORDERS,,,425,OTHER NON-HYPOVOLEMIC ELECTROLYTE DISORDERS,10,"ENDOCRINE, NUTRITIONAL AND METABOLIC DISEASES AND DISORDERS",3,Major,Major,Medical,Medicaid,,,,,Y,41934.27,11437.41
Long Island,Nassau,2908000,000511,NYU Langone Hospital-Long Island,50 to 69,114,M,Black/African American,Not Span/Hispanic,7,Emergency,Home or Self Care,2020,END011,FLUID AND ELECTROLYTE DISORDERS,ESA001,HEMODIALYSIS,425,OTHER NON-HYPOVOLEMIC ELECTROLYTE DISORDERS,10,"ENDOCRINE, NUTRITIONAL AND METABOLIC DISEASES AND DISORDERS",3,Major,Moderate,Medical,Private Health Insurance,,,,,Y,151540.32,50970.16
Long Island,Nassau,2908000,000511,NYU Langone Hospital-Long Island,30 to 49,115,F,Other Race,Spanish/Hispanic,1,Emergency,Left Against Medical Advice,2020,END011,FLUID AND ELECTROLYTE DISORDERS,ESA001,HEMODIALYSIS,425,OTHER NON-HYPOVOLEMIC ELECTROLYTE DISORDERS,10,"ENDOCRINE, NUTRITIONAL AND METABOLIC DISEASES AND DISORDERS",2,Moderate,Moderate,Medical,Private Health Insurance,,,,,Y,19090.43,7209.49
Long Island,Nassau,2908000,000511,NYU Langone Hospital-Long Island,50 to 69,115,F,Black/African American,Not Span/Hispanic,7,Emergency,Skilled Nursing Home,2020,END011,FLUID AND ELECTROLYTE DISORDERS,ESA001,HEMODIALYSIS,425,OTHER NON-HYPOVOLEMIC ELECTROLYTE DISORDERS,10,"ENDOCRINE, NUTRITIONAL AND METABOLIC DISEASES AND DISORDERS",3,Major,Major,Medical,Medicare,,,,,Y,78040.08,32429.5
Long Island,Nassau,2908000,000511,NYU Langone Hospital-Long Island,50 to 69,119,F,White,Not Span/Hispanic,2,Emergency,Home or Self Care,2020,END016,OTHER SPECIFIED AND UNSPECIFIED NUTRITIONAL AND METABOLIC DISORDERS,,,425,OTHER NON-HYPOVOLEMIC ELECTROLYTE DISORDERS,10,"ENDOCRINE, NUTRITIONAL AND METABOLIC DISEASES AND DISORDERS",3,Major,Major,Medical,Blue Cross/Blue Shield,,,,,Y,192855.17,15665.53
Long Island,Nassau,2908000,000511,NYU Langone Hospital-Long Island,30 to 49,110,M,White,Unknown,4,Emergency,Home or Self Care,2020,END011,FLUID AND ELECTROLYTE DISORDERS,MAM004,CARDIAC STRESS TESTS,425,OTHER NON-HYPOVOLEMIC ELECTROLYTE DISORDERS,10,"ENDOCRINE, NUTRITIONAL AND METABOLIC DISEASES AND DISORDERS",3,Major,Major,Medical,Medicaid,,,,,Y,61639.61,16981.27
Long Island,Nassau,2908000,000511,NYU Langone Hospital-Long Island,50 to 69,115,M,Black/African American,Not Span/Hispanic,5,Emergency,Home or Self Care,2020,END011,FLUID AND ELECTROLYTE DISORDERS,ESA001,HEMODIALYSIS,425,OTHER NON-HYPOVOLEMIC ELECTROLYTE DISORDERS,10,"ENDOCRINE, NUTRITIONAL AND METABOLIC DISEASES AND DISORDERS",3,Major,Minor,Medical,Medicaid,,,,,Y,89369.1,30068.23
Long Island,Nassau,2908000,000511,NYU Langone Hospital-Long Island,70 or Older,110,M,White,Not Span/Hispanic,6,Emergency,Skilled Nursing Home,2020,END016,OTHER SPECIFIED AND UNSPECIFIED NUTRITIONAL AND METABOLIC DISORDERS,RAD001,BEAM RADIATION,425,OTHER NON-HYPOVOLEMIC ELECTROLYTE DISORDERS,10,"ENDOCRINE, NUTRITIONAL AND METABOLIC DISEASES AND DISORDERS",3,Major,Major,Medical,Medicare,,,,,Y,227856.81,34686.95
Long Island,Nassau,2908000,000511,NYU Langone Hospital-Long Island,50 to 69,115,M,Black/African American,Not Span/Hispanic,9,Emergency,Home w/ Home Health Services,2020,END011,FLUID AND ELECTROLYTE DISORDERS,GIS004,GI SYSTEM ENDOSCOPY WITHOUT BIOPSY (DIAGNOSTIC),425,OTHER NON-HYPOVOLEMIC ELECTROLYTE DISORDERS,10,"ENDOCRINE, NUTRITIONAL AND METABOLIC DISEASES AND DISORDERS",4,Extreme,Extreme,Medical,Medicare,Medicaid,,,,Y,138055.51,43483
Long Island,Nassau,2908000,000511,NYU Langone Hospital-Long Island,70 or Older,115,F,White,Not Span/Hispanic,5,Emergency,Skilled Nursing Home,2020,END011,FLUID AND ELECTROLYTE DISORDERS,,,425,OTHER NON-HYPOVOLEMIC ELECTROLYTE DISORDERS,10,"ENDOCRINE, NUTRITIONAL AND METABOLIC DISEASES AND DISORDERS",2,Moderate,Moderate,Medical,Medicare,Medicare,,,,Y,97497.1,24163.49
Long Island,Nassau,2908000,000511,NYU Langone Hospital-Long Island,70 or Older,115,M,White,Not Span/Hispanic,5,Emergency,Skilled Nursing Home,2020,END011,FLUID AND ELECTROLYTE DISORDERS,ESA001,HEMODIALYSIS,425,OTHER NON-HYPOVOLEMIC ELECTROLYTE DISORDERS,10,"ENDOCRINE, NUTRITIONAL AND METABOLIC DISEASES AND DISORDERS",3,Major,Minor,Medical,Medicare,Blue Cross/Blue Shield,,,,Y,75606.5,27225.94
Long Island,Nassau,2908000,000511,NYU Langone Hospital-Long Island,30 to 49,115,M,Black/African American,Not Span/Hispanic,2,Emergency,Home or Self Care,2020,END011,FLUID AND ELECTROLYTE DISORDERS,OTR004,ISOLATION PROCEDURES,425,OTHER NON-HYPOVOLEMIC ELECTROLYTE DISORDERS,10,"ENDOCRINE, NUTRITIONAL AND METABOLIC DISEASES AND DISORDERS",1,Minor,Minor,Medical,Blue Cross/Blue Shield,,,,,Y,42543.84,9192.49
Long Island,Nassau,2908000,000511,NYU Langone Hospital-Long Island,50 to 69,110,M,White,Not Span/Hispanic,3,Emergency,Home or Self Care,2020,END016,OTHER SPECIFIED AND UNSPECIFIED NUTRITIONAL AND METABOLIC DISORDERS,,,425,OTHER NON-HYPOVOLEMIC ELECTROLYTE DISORDERS,10,"ENDOCRINE, NUTRITIONAL AND METABOLIC DISEASES AND DISORDERS",3,Major,Moderate,Medical,Medicare,,,,,Y,69059.28,15074.36
Long Island,Nassau,2908000,000511,NYU Langone Hospital-Long Island,70 or Older,115,M,White,Not Span/Hispanic,21,Emergency,Skilled Nursing Home,2020,END011,FLUID AND ELECTROLYTE DISORDERS,ESA001,HEMODIALYSIS,425,OTHER NON-HYPOVOLEMIC ELECTROLYTE DISORDERS,10,"ENDOCRINE, NUTRITIONAL AND METABOLIC DISEASES AND DISORDERS",4,Extreme,Extreme,Medical,Medicare,Medicare,,,,Y,255666.39,108223.56
Long Island,Nassau,2908000,000511,NYU Langone Hospital-Long Island,50 to 69,115,F,Black/African American,Not Span/Hispanic,2,Emergency,Home or Self Care,2020,END011,FLUID AND ELECTROLYTE DISORDERS,ESA001,HEMODIALYSIS,425,OTHER NON-HYPOVOLEMIC ELECTROLYTE DISORDERS,10,"ENDOCRINE, NUTRITIONAL AND METABOLIC DISEASES AND DISORDERS",3,Major,Major,Medical,Medicare,Medicaid,,,,Y,61961.29,19350.91
Long Island,Nassau,2908000,000511,NYU Langone Hospital-Long Island,50 to 69,115,M,Black/African American,Not Span/Hispanic,7,Emergency,Skilled Nursing Home,2020,END011,FLUID AND ELECTROLYTE DISORDERS,ESA001,HEMODIALYSIS,425,OTHER NON-HYPOVOLEMIC ELECTROLYTE DISORDERS,10,"ENDOCRINE, NUTRITIONAL AND METABOLIC DISEASES AND DISORDERS",4,Extreme,Major,Medical,Medicaid,,,,,Y,130827.67,38010.69
Long Island,Nassau,2908000,000511,NYU Langone Hospital-Long Island,70 or Older,117,F,White,Not Span/Hispanic,5,Emergency,Hospice - Home,2020,END016,OTHER SPECIFIED AND UNSPECIFIED NUTRITIONAL AND METABOLIC DISORDERS,,,425,OTHER NON-HYPOVOLEMIC ELECTROLYTE DISORDERS,10,"ENDOCRINE, NUTRITIONAL AND METABOLIC DISEASES AND DISORDERS",4,Extreme,Extreme,Medical,Medicare,Blue Cross/Blue Shield,,,,Y,116565.57,22319.22
Long Island,Nassau,2908000,000511,NYU Langone Hospital-Long Island,70 or Older,115,F,Other Race,Not Span/Hispanic,4,Emergency,Home w/ Home Health Services,2020,END011,FLUID AND ELECTROLYTE DISORDERS,ESA005,CARDIAC CHEST COMPRESSION,425,OTHER NON-HYPOVOLEMIC ELECTROLYTE DISORDERS,10,"ENDOCRINE, NUTRITIONAL AND METABOLIC DISEASES AND DISORDERS",3,Major,Extreme,Medical,Medicare,Medicaid,,,,Y,86937.82,29183.56
Long Island,Nassau,2908000,000511,NYU Langone Hospital-Long Island,50 to 69,115,M,Black/African American,Not Span/Hispanic,1,Emergency,Home w/ Home Health Services,2020,END011,FLUID AND ELECTROLYTE DISORDERS,ESA001,HEMODIALYSIS,425,OTHER NON-HYPOVOLEMIC ELECTROLYTE DISORDERS,10,"ENDOCRINE, NUTRITIONAL AND METABOLIC DISEASES AND DISORDERS",3,Major,Minor,Medical,Medicaid,,,,,Y,22220.7,7568.86
Long Island,Nassau,2908000,000511,NYU Langone Hospital-Long Island,70 or Older,113,F,White,Not Span/Hispanic,1,Emergency,Home w/ Home Health Services,2020,END011,FLUID AND ELECTROLYTE DISORDERS,,,425,OTHER NON-HYPOVOLEMIC ELECTROLYTE DISORDERS,10,"ENDOCRINE, NUTRITIONAL AND METABOLIC DISEASES AND DISORDERS",3,Major,Moderate,Medical,Medicare,,,,,Y,24580.17,4915.59
Long Island,Nassau,2908000,000511,NYU Langone Hospital-Long Island,50 to 69,115,M,Other Race,Spanish/Hispanic,1,Emergency,Home or Self Care,2020,END011,FLUID AND ELECTROLYTE DISORDERS,ESA001,HEMODIALYSIS,425,OTHER NON-HYPOVOLEMIC ELECTROLYTE DISORDERS,10,"ENDOCRINE, NUTRITIONAL AND METABOLIC DISEASES AND DISORDERS",3,Major,Major,Medical,Medicaid,,,,,Y,20443.39,4524.59
Long Island,Nassau,2908000,000511,NYU Langone Hospital-Long Island,70 or Older,115,F,White,Not Span/Hispanic,5,Emergency,Skilled Nursing Home,2020,END011,FLUID AND ELECTROLYTE DISORDERS,,,425,OTHER NON-HYPOVOLEMIC ELECTROLYTE DISORDERS,10,"ENDOCRINE, NUTRITIONAL AND METABOLIC DISEASES AND DISORDERS",2,Moderate,Moderate,Medical,Medicare,Private Health Insurance,,,,Y,81756.05,20599.8
Long Island,Nassau,2908000,000511,NYU Langone Hospital-Long Island,50 to 69,115,F,Black/African American,Unknown,7,Emergency,Skilled Nursing Home,2020,END011,FLUID AND ELECTROLYTE DISORDERS,ESA001,HEMODIALYSIS,425,OTHER NON-HYPOVOLEMIC ELECTROLYTE DISORDERS,10,"ENDOCRINE, NUTRITIONAL AND METABOLIC DISEASES AND DISORDERS",4,Extreme,Extreme,Medical,Medicaid,,,,,Y,128641.34,36269.98
Long Island,Nassau,2908000,000511,NYU Langone Hospital-Long Island,70 or Older,106,M,White,Not Span/Hispanic,12,Emergency,Home w/ Home Health Services,2020,END016,OTHER SPECIFIED AND UNSPECIFIED NUTRITIONAL AND METABOLIC DISORDERS,CAR024,VENOUS AND ARTERIAL CATHETER PLACEMENT,425,OTHER NON-HYPOVOLEMIC ELECTROLYTE DISORDERS,10,"ENDOCRINE, NUTRITIONAL AND METABOLIC DISEASES AND DISORDERS",4,Extreme,Extreme,Medical,Medicare,Private Health Insurance,,,,Y,421533.82,72713.86
Long Island,Nassau,2908000,000511,NYU Langone Hospital-Long Island,30 to 49,114,M,Other Race,Not Span/Hispanic,2,Emergency,Home or Self Care,2020,END011,FLUID AND ELECTROLYTE DISORDERS,ESA001,HEMODIALYSIS,425,OTHER NON-HYPOVOLEMIC ELECTROLYTE DISORDERS,10,"ENDOCRINE, NUTRITIONAL AND METABOLIC DISEASES AND DISORDERS",2,Moderate,Minor,Medical,Medicaid,,,,,Y,50376.67,17565.27
Long Island,Nassau,2908000,000511,NYU Langone Hospital-Long Island,70 or Older,115,F,Black/African American,Not Span/Hispanic,16,Emergency,Home w/ Home Health Services,2020,END011,FLUID AND ELECTROLYTE DISORDERS,ESA005,CARDIAC CHEST COMPRESSION,425,OTHER NON-HYPOVOLEMIC ELECTROLYTE DISORDERS,10,"ENDOCRINE, NUTRITIONAL AND METABOLIC DISEASES AND DISORDERS",3,Major,Extreme,Medical,Private Health Insurance,,,,,Y,281458.49,69815.43
Long Island,Nassau,2908000,000511,NYU Langone Hospital-Long Island,50 to 69,115,F,Black/African American,Not Span/Hispanic,2,Emergency,Home or Self Care,2020,END011,FLUID AND ELECTROLYTE DISORDERS,,,425,OTHER NON-HYPOVOLEMIC ELECTROLYTE DISORDERS,10,"ENDOCRINE, NUTRITIONAL AND METABOLIC DISEASES AND DISORDERS",2,Moderate,Minor,Medical,Blue Cross/Blue Shield,,,,,Y,32509.44,10482.42
Long Island,Nassau,2908000,000511,NYU Langone Hospital-Long Island,50 to 69,114,M,Other Race,Not Span/Hispanic,1,Emergency,Home or Self Care,2020,END011,FLUID AND ELECTROLYTE DISORDERS,ESA001,HEMODIALYSIS,425,OTHER NON-HYPOVOLEMIC ELECTROLYTE DISORDERS,10,"ENDOCRINE, NUTRITIONAL AND METABOLIC DISEASES AND DISORDERS",2,Moderate,Moderate,Medical,Medicaid,,,,,Y,20427.3,8477.06
Long Island,Nassau,2908000,000511,NYU Langone Hospital-Long Island,18 to 29,115,M,Black/African American,Not Span/Hispanic,1,Emergency,Left Against Medical Advice,2020,END011,FLUID AND ELECTROLYTE DISORDERS,,,425,OTHER NON-HYPOVOLEMIC ELECTROLYTE DISORDERS,10,"ENDOCRINE, NUTRITIONAL AND METABOLIC DISEASES AND DISORDERS",2,Moderate,Minor,Medical,Medicaid,,,,,Y,34140.83,7561.51
Long Island,Nassau,2908000,000511,NYU Langone Hospital-Long Island,50 to 69,115,M,White,Not Span/Hispanic,1,Emergency,Home or Self Care,2020,END011,FLUID AND ELECTROLYTE DISORDERS,ESA001,HEMODIALYSIS,425,OTHER NON-HYPOVOLEMIC ELECTROLYTE DISORDERS,10,"ENDOCRINE, NUTRITIONAL AND METABOLIC DISEASES AND DISORDERS",3,Major,Major,Medical,Medicare,Medicaid,,,,Y,30212.49,11944.67
Long Island,Nassau,2908000,000511,NYU Langone Hospital-Long Island,70 or Older,117,F,Other Race,Spanish/Hispanic,12,Emergency,Home w/ Home Health Services,2020,END011,FLUID AND ELECTROLYTE DISORDERS,OTR004,ISOLATION PROCEDURES,425,OTHER NON-HYPOVOLEMIC ELECTROLYTE DISORDERS,10,"ENDOCRINE, NUTRITIONAL AND METABOLIC DISEASES AND DISORDERS",3,Major,Moderate,Medical,Medicaid,,,,,Y,187924.45,59525.76
Long Island,Nassau,2908000,000511,NYU Langone Hospital-Long Island,70 or Older,115,M,Black/African American,Not Span/Hispanic,1,Emergency,Home w/ Home Health Services,2020,END011,FLUID AND ELECTROLYTE DISORDERS,,,425,OTHER NON-HYPOVOLEMIC ELECTROLYTE DISORDERS,10,"ENDOCRINE, NUTRITIONAL AND METABOLIC DISEASES AND DISORDERS",2,Moderate,Major,Medical,Medicare,Medicare,,,,Y,28848.81,7042.83
Long Island,Nassau,2908000,000511,NYU Langone Hospital-Long Island,50 to 69,115,F,White,Not Span/Hispanic,3,Emergency,Home or Self Care,2020,END011,FLUID AND ELECTROLYTE DISORDERS,,,425,OTHER NON-HYPOVOLEMIC ELECTROLYTE DISORDERS,10,"ENDOCRINE, NUTRITIONAL AND METABOLIC DISEASES AND DISORDERS",2,Moderate,Moderate,Medical,Private Health Insurance,,,,,Y,44519.35,15228.68
Long Island,Nassau,2908000,000511,NYU Langone Hospital-Long Island,50 to 69,115,F,Black/African American,Not Span/Hispanic,9,Emergency,Skilled Nursing Home,2020,END011,FLUID AND ELECTROLYTE DISORDERS,ESA001,HEMODIALYSIS,425,OTHER NON-HYPOVOLEMIC ELECTROLYTE DISORDERS,10,"ENDOCRINE, NUTRITIONAL AND METABOLIC DISEASES AND DISORDERS",3,Major,Major,Medical,Medicare,Medicaid,,,,Y,137593.63,59733.57
Long Island,Nassau,2908000,000511,NYU Langone Hospital-Long Island,70 or Older,117,F,White,Not Span/Hispanic,17,Emergency,Skilled Nursing Home,2020,END011,FLUID AND ELECTROLYTE DISORDERS,,,425,OTHER NON-HYPOVOLEMIC ELECTROLYTE DISORDERS,10,"ENDOCRINE, NUTRITIONAL AND METABOLIC DISEASES AND DISORDERS",3,Major,Major,Medical,Medicare,Medicare,,,,Y,213720.91,85323.77
Long Island,Nassau,2908000,000511,NYU Langone Hospital-Long Island,50 to 69,117,M,White,Not Span/Hispanic,6,Emergency,Home or Self Care,2020,END011,FLUID AND ELECTROLYTE DISORDERS,IMG004,FLUOROSCOPY OF NON-CIRCULATORY ORGANS,425,OTHER NON-HYPOVOLEMIC ELECTROLYTE DISORDERS,10,"ENDOCRINE, NUTRITIONAL AND METABOLIC DISEASES AND DISORDERS",3,Major,Moderate,Medical,Blue Cross/Blue Shield,,,,,Y,125825.73,35738.16
Long Island,Nassau,2908000,000511,NYU Langone Hospital-Long Island,50 to 69,115,M,Black/African American,Not Span/Hispanic,1,Emergency,Left Against Medical Advice,2020,END011,FLUID AND ELECTROLYTE DISORDERS,ESA001,HEMODIALYSIS,425,OTHER NON-HYPOVOLEMIC ELECTROLYTE DISORDERS,10,"ENDOCRINE, NUTRITIONAL AND METABOLIC DISEASES AND DISORDERS",3,Major,Moderate,Medical,Medicare,Blue Cross/Blue Shield,,,,Y,26311.81,9005.58
Long Island,Nassau,2908000,000511,NYU Langone Hospital-Long Island,30 to 49,OOS,F,Black/African American,Not Span/Hispanic,2,Emergency,Home or Self Care,2020,END011,FLUID AND ELECTROLYTE DISORDERS,ESA001,HEMODIALYSIS,425,OTHER NON-HYPOVOLEMIC ELECTROLYTE DISORDERS,10,"ENDOCRINE, NUTRITIONAL AND METABOLIC DISEASES AND DISORDERS",3,Major,Moderate,Medical,Medicare,Blue Cross/Blue Shield,,,,Y,56632.81,20366.86
Long Island,Nassau,2908000,000511,NYU Langone Hospital-Long Island,50 to 69,115,F,White,Not Span/Hispanic,4,Emergency,Home w/ Home Health Services,2020,END011,FLUID AND ELECTROLYTE DISORDERS,,,425,OTHER NON-HYPOVOLEMIC ELECTROLYTE DISORDERS,10,"ENDOCRINE, NUTRITIONAL AND METABOLIC DISEASES AND DISORDERS",1,Minor,Moderate,Medical,Medicare,Medicaid,,,,Y,51502.53,19615.88
Long Island,Nassau,2908000,000511,NYU Langone Hospital-Long Island,50 to 69,115,M,Other Race,Spanish/Hispanic,1,Emergency,Home w/ Home Health Services,2020,END011,FLUID AND ELECTROLYTE DISORDERS,,,425,OTHER NON-HYPOVOLEMIC ELECTROLYTE DISORDERS,10,"ENDOCRINE, NUTRITIONAL AND METABOLIC DISEASES AND DISORDERS",4,Extreme,Extreme,Medical,Private Health Insurance,,,,,Y,31255.2,6164
Long Island,Nassau,2908000,000511,NYU Langone Hospital-Long Island,30 to 49,115,F,Other Race,Not Span/Hispanic,11,Emergency,Expired,2020,END011,FLUID AND ELECTROLYTE DISORDERS,MAM011,ELECTROENCEPHALOGRAM (EEG),425,OTHER NON-HYPOVOLEMIC ELECTROLYTE DISORDERS,10,"ENDOCRINE, NUTRITIONAL AND METABOLIC DISEASES AND DISORDERS",4,Extreme,Extreme,Medical,Medicare,Private Health Insurance,,,,Y,726302.83,149817.75
Long Island,Nassau,2908000,000511,NYU Langone Hospital-Long Island,50 to 69,115,F,Black/African American,Not Span/Hispanic,4,Emergency,Home or Self Care,2020,END011,FLUID AND ELECTROLYTE DISORDERS,,,425,OTHER NON-HYPOVOLEMIC ELECTROLYTE DISORDERS,10,"ENDOCRINE, NUTRITIONAL AND METABOLIC DISEASES AND DISORDERS",2,Moderate,Minor,Medical,Medicare,Blue Cross/Blue Shield,,,,Y,57027.38,19970.11
Long Island,Nassau,2908000,000511,NYU Langone Hospital-Long Island,70 or Older,115,M,Black/African American,Not Span/Hispanic,4,Emergency,Home w/ Home Health Services,2020,END011,FLUID AND ELECTROLYTE DISORDERS,,,425,OTHER NON-HYPOVOLEMIC ELECTROLYTE DISORDERS,10,"ENDOCRINE, NUTRITIONAL AND METABOLIC DISEASES AND DISORDERS",3,Major,Major,Medical,Medicare,Medicare,,,,Y,76987.4,21338.19
Long Island,Nassau,2908000,000511,NYU Langone Hospital-Long Island,70 or Older,115,F,White,Not Span/Hispanic,6,Emergency,Hospice - Medical Facility,2020,END016,OTHER SPECIFIED AND UNSPECIFIED NUTRITIONAL AND METABOLIC DISORDERS,,,425,OTHER NON-HYPOVOLEMIC ELECTROLYTE DISORDERS,10,"ENDOCRINE, NUTRITIONAL AND METABOLIC DISEASES AND DISORDERS",3,Major,Major,Medical,Medicare,Medicare,,,,Y,149145.79,31958.58