Hospital Service Area,Hospital County,Operating Certificate Number,Permanent Facility Id,Facility Name,Age Group,Zip Code - 3 digits,Gender,Race,Ethnicity,Length of Stay,Type of Admission,Patient Disposition,Discharge Year,CCS Diagnosis Code,CCS Diagnosis Description,CCS Procedure Code,CCS Procedure Description,APR DRG Code,APR DRG Description,APR MDC Code,APR MDC Description,APR Severity of Illness Code,APR Severity of Illness Description,APR Risk of Mortality,APR Medical Surgical Description,Payment Typology 1,Payment Typology 2,Payment Typology 3,Birth Weight,Abortion Edit Indicator,Emergency Department Indicator,Total Charges,Total Costs
New York City,Bronx,7000006,003058,Montefiore Med Center - Jack D Weiler Hosp of A Einstein College Div,50 to 69,104,M,Black/African American,Not Span/Hispanic,8,Emergency,Home or Self Care,2019,END011,FLUID AND ELECTROLYTE DISORDERS,ESA001,HEMODIALYSIS,426,NON-HYPOVOLEMIC SODIUM DISORDERS,10,"ENDOCRINE, NUTRITIONAL AND METABOLIC DISEASES AND DISORDERS",3,Major,Major,Medical,Medicare,Medicaid,,,,true,112283.91,20462.93
New York City,Manhattan,7002001,001438,Bellevue Hospital Center,50 to 69,104,F,Other Race,Not Span/Hispanic,3,Emergency,Home or Self Care,2019,END011,FLUID AND ELECTROLYTE DISORDERS,IMG008,ULTRASONOGRAPHY,426,NON-HYPOVOLEMIC SODIUM DISORDERS,10,"ENDOCRINE, NUTRITIONAL AND METABOLIC DISEASES AND DISORDERS",2,Moderate,Moderate,Medical,Medicaid,,,,,true,20102.17,13359.9
Hudson Valley,Orange,3522000,000694,St Luke's Cornwall Hospital/Newburgh,70 or Older,125,F,White,Not Span/Hispanic,3,Emergency,Skilled Nursing Home,2019,END011,FLUID AND ELECTROLYTE DISORDERS,,,426,NON-HYPOVOLEMIC SODIUM DISORDERS,10,"ENDOCRINE, NUTRITIONAL AND METABOLIC DISEASES AND DISORDERS",3,Major,Major,Medical,Medicare,Medicaid,,,,true,25537.7,5198.44
New York City,Queens,7003010,001637,New York - Presbyterian/Queens,70 or Older,113,M,White,Not Span/Hispanic,7,Emergency,Skilled Nursing Home,2019,END013,PITUITARY DISORDERS,ADM017,ADMINISTRATION OF NUTRITIONAL AND ELECTROLYTIC SUBSTANCES,426,NON-HYPOVOLEMIC SODIUM DISORDERS,10,"ENDOCRINE, NUTRITIONAL AND METABOLIC DISEASES AND DISORDERS",3,Major,Major,Medical,Medicare,Private Health Insurance,Self-Pay,,,true,59862.8,14442.98
New York City,Queens,7003010,001637,New York - Presbyterian/Queens,70 or Older,113,F,Other Race,Not Span/Hispanic,5,Emergency,Left Against Medical Advice,2019,END011,FLUID AND ELECTROLYTE DISORDERS,ADM021,"ADMINISTRATION OF THERAPEUTIC SUBSTANCES, NEC",426,NON-HYPOVOLEMIC SODIUM DISORDERS,10,"ENDOCRINE, NUTRITIONAL AND METABOLIC DISEASES AND DISORDERS",3,Major,Major,Medical,Medicare,Medicare,Self-Pay,,,true,45172.72,10720.21
New York City,Manhattan,7002001,001438,Bellevue Hospital Center,70 or Older,113,F,Other Race,Spanish/Hispanic,1,Emergency,Home or Self Care,2019,END011,FLUID AND ELECTROLYTE DISORDERS,ADM017,ADMINISTRATION OF NUTRITIONAL AND ELECTROLYTIC SUBSTANCES,426,NON-HYPOVOLEMIC SODIUM DISORDERS,10,"ENDOCRINE, NUTRITIONAL AND METABOLIC DISEASES AND DISORDERS",2,Moderate,Minor,Medical,Medicaid,Medicaid,,,,true,7692.01,5112.11
Long Island,Suffolk,5151001,000245,Stony Brook University Hospital,70 or Older,117,M,Multi-racial,Multi-ethnic,6,Emergency,Home or Self Care,2019,END013,PITUITARY DISORDERS,RES010,TRACHEOSTOMY,426,NON-HYPOVOLEMIC SODIUM DISORDERS,10,"ENDOCRINE, NUTRITIONAL AND METABOLIC DISEASES AND DISORDERS",3,Major,Major,Medical,Medicare,Medicare,Self-Pay,,,true,74545.03,20489.62
Long Island,Suffolk,5151001,000245,Stony Brook University Hospital,30 to 49,117,F,White,Not Span/Hispanic,15,Emergency,Psychiatric Hospital or Unit of Hosp,2019,END011,FLUID AND ELECTROLYTE DISORDERS,CAR024,VENOUS AND ARTERIAL CATHETER PLACEMENT,426,NON-HYPOVOLEMIC SODIUM DISORDERS,10,"ENDOCRINE, NUTRITIONAL AND METABOLIC DISEASES AND DISORDERS",3,Major,Major,Medical,Private Health Insurance,,,,,true,214669.02,62109.78
Long Island,Suffolk,5151001,000245,Stony Brook University Hospital,70 or Older,117,F,White,Not Span/Hispanic,13,Emergency,Home w/ Home Health Services,2019,END011,FLUID AND ELECTROLYTE DISORDERS,ADM017,ADMINISTRATION OF NUTRITIONAL AND ELECTROLYTIC SUBSTANCES,426,NON-HYPOVOLEMIC SODIUM DISORDERS,10,"ENDOCRINE, NUTRITIONAL AND METABOLIC DISEASES AND DISORDERS",3,Major,Moderate,Medical,Medicare,Medicare,,,,true,106151.4,34145.06
New York City,Kings,7002053,001304,NYU Langone Hospital-Brooklyn,70 or Older,112,F,White,Not Span/Hispanic,3,Emergency,Home or Self Care,2019,END011,FLUID AND ELECTROLYTE DISORDERS,ADM021,"ADMINISTRATION OF THERAPEUTIC SUBSTANCES, NEC",426,NON-HYPOVOLEMIC SODIUM DISORDERS,10,"ENDOCRINE, NUTRITIONAL AND METABOLIC DISEASES AND DISORDERS",2,Moderate,Minor,Medical,Private Health Insurance,,,,,true,38662.45,11678.72
Hudson Valley,Putnam,3950000,000752,Putnam Hospital,70 or Older,105,M,White,Not Span/Hispanic,5,Emergency,Expired,2019,END013,PITUITARY DISORDERS,,,426,NON-HYPOVOLEMIC SODIUM DISORDERS,10,"ENDOCRINE, NUTRITIONAL AND METABOLIC DISEASES AND DISORDERS",4,Extreme,Extreme,Medical,Medicare,Blue Cross/Blue Shield,,,,true,37445.82,29501.75
New York City,Manhattan,7002054,001458,New York-Presbyterian Hospital - New York Weill Cornell Center,18 to 29,112,M,Multi-racial,Not Span/Hispanic,7,Emergency,Home or Self Care,2019,END013,PITUITARY DISORDERS,MAM011,ELECTROENCEPHALOGRAM (EEG),426,NON-HYPOVOLEMIC SODIUM DISORDERS,10,"ENDOCRINE, NUTRITIONAL AND METABOLIC DISEASES AND DISORDERS",2,Moderate,Minor,Medical,Medicaid,Self-Pay,,,,true,123057.64,53146.46
New York City,Manhattan,7002001,001438,Bellevue Hospital Center,50 to 69,113,M,Other Race,Spanish/Hispanic,6,Emergency,Home or Self Care,2019,END013,PITUITARY DISORDERS,SUD002,PHARMACOTHERAPY FOR SUBSTANCE USE,426,NON-HYPOVOLEMIC SODIUM DISORDERS,10,"ENDOCRINE, NUTRITIONAL AND METABOLIC DISEASES AND DISORDERS",3,Major,Moderate,Medical,Medicaid,,,,,false,34495.42,22925.66
Western NY,Erie,1401005,000210,Erie County Medical Center,50 to 69,142,F,Black/African American,Not Span/Hispanic,4,Emergency,Home or Self Care,2019,END011,FLUID AND ELECTROLYTE DISORDERS,SUD001,SUBSTANCE USE DETOXIFICATION,426,NON-HYPOVOLEMIC SODIUM DISORDERS,10,"ENDOCRINE, NUTRITIONAL AND METABOLIC DISEASES AND DISORDERS",2,Moderate,Moderate,Medical,Medicaid,Medicaid,,,,true,12801.9,6603.6
Western NY,Erie,1401005,000210,Erie County Medical Center,50 to 69,141,F,White,Not Span/Hispanic,8,Emergency,Skilled Nursing Home,2019,END013,PITUITARY DISORDERS,,,426,NON-HYPOVOLEMIC SODIUM DISORDERS,10,"ENDOCRINE, NUTRITIONAL AND METABOLIC DISEASES AND DISORDERS",2,Moderate,Moderate,Medical,Medicaid,Medicaid,,,,true,37999.69,16715.96
New York City,Manhattan,7002054,001458,New York-Presbyterian Hospital - New York Weill Cornell Center,70 or Older,112,F,White,Not Span/Hispanic,14,Emergency,Skilled Nursing Home,2019,END011,FLUID AND ELECTROLYTE DISORDERS,GIS017,GASTROSTOMY,426,NON-HYPOVOLEMIC SODIUM DISORDERS,10,"ENDOCRINE, NUTRITIONAL AND METABOLIC DISEASES AND DISORDERS",3,Major,Major,Medical,Medicare,Medicaid,Self-Pay,,,true,193299.97,46848.75
New York City,Richmond,7004003,001740,Staten Island University Hosp-North,70 or Older,103,F,Other Race,Not Span/Hispanic,15,Emergency,Skilled Nursing Home,2019,END013,PITUITARY DISORDERS,,,426,NON-HYPOVOLEMIC SODIUM DISORDERS,10,"ENDOCRINE, NUTRITIONAL AND METABOLIC DISEASES AND DISORDERS",4,Extreme,Extreme,Medical,Medicare,Medicaid,,,,true,137261.88,36264.59
New York City,Richmond,7004003,001737,Staten Island University Hospital Prince's Bay,50 to 69,103,F,White,Not Span/Hispanic,10,Emergency,Skilled Nursing Home,2019,END011,FLUID AND ELECTROLYTE DISORDERS,,,426,NON-HYPOVOLEMIC SODIUM DISORDERS,10,"ENDOCRINE, NUTRITIONAL AND METABOLIC DISEASES AND DISORDERS",3,Major,Major,Medical,Medicare,,,,,true,83090.39,22069.13
New York City,Bronx,7000002,001165,Jacobi Medical Center,70 or Older,104,F,Other Race,Spanish/Hispanic,1,Emergency,Home or Self Care,2019,END011,FLUID AND ELECTROLYTE DISORDERS,,,426,NON-HYPOVOLEMIC SODIUM DISORDERS,10,"ENDOCRINE, NUTRITIONAL AND METABOLIC DISEASES AND DISORDERS",2,Moderate,Minor,Medical,Medicare,Medicare,,,,true,9357.18,5536.18
Finger Lakes,Monroe,2701003,000411,Rochester General Hospital,70 or Older,145,F,White,Not Span/Hispanic,4,Emergency,Home w/ Home Health Services,2019,END011,FLUID AND ELECTROLYTE DISORDERS,,,426,NON-HYPOVOLEMIC SODIUM DISORDERS,10,"ENDOCRINE, NUTRITIONAL AND METABOLIC DISEASES AND DISORDERS",3,Major,Major,Medical,Medicare,,,,,true,14572.78,6218.61
New York City,Queens,7003010,001637,New York - Presbyterian/Queens,50 to 69,113,F,Other Race,Not Span/Hispanic,5,Emergency,Another Type Not Listed,2019,END013,PITUITARY DISORDERS,ADM015,ADMINISTRATION OF ANTIBIOTICS,426,NON-HYPOVOLEMIC SODIUM DISORDERS,10,"ENDOCRINE, NUTRITIONAL AND METABOLIC DISEASES AND DISORDERS",3,Major,Major,Medical,"Managed Care, Unspecified",Medicaid,Self-Pay,,,true,43913.21,12372.13
New York City,Queens,7003010,001637,New York - Presbyterian/Queens,70 or Older,113,F,Other Race,Not Span/Hispanic,5,Emergency,Home or Self Care,2019,END011,FLUID AND ELECTROLYTE DISORDERS,IMG007,COMPUTERIZED TOMOGRAPHY (CT) WITHOUT CONTRAST,426,NON-HYPOVOLEMIC SODIUM DISORDERS,10,"ENDOCRINE, NUTRITIONAL AND METABOLIC DISEASES AND DISORDERS",1,Minor,Minor,Medical,"Managed Care, Unspecified",Medicaid,Self-Pay,,,true,37744.21,10021.1
Western NY,Erie,1401013,000292,Sisters of Charity Hospital - St. Joseph Campus,50 to 69,142,F,White,Not Span/Hispanic,3,Emergency,Home or Self Care,2019,END013,PITUITARY DISORDERS,,,426,NON-HYPOVOLEMIC SODIUM DISORDERS,10,"ENDOCRINE, NUTRITIONAL AND METABOLIC DISEASES AND DISORDERS",2,Moderate,Minor,Medical,Medicare,Medicare,Medicaid,,,true,24793.08,8299.14
New York City,Kings,7001020,001305,Maimonides Medical Center,70 or Older,112,M,White,Not Span/Hispanic,1,Emergency,Home w/ Home Health Services,2019,END011,FLUID AND ELECTROLYTE DISORDERS,,,426,NON-HYPOVOLEMIC SODIUM DISORDERS,10,"ENDOCRINE, NUTRITIONAL AND METABOLIC DISEASES AND DISORDERS",1,Minor,Minor,Medical,Medicare,Medicaid,Self-Pay,,,true,8495,2558.78
New York City,Kings,7001021,001306,New York - Presbyterian Brooklyn Methodist Hospital,70 or Older,112,F,Black/African American,Not Span/Hispanic,10,Emergency,Skilled Nursing Home,2019,END011,FLUID AND ELECTROLYTE DISORDERS,MST020,SUBCUTANEOUS TISSUE AND FASCIA EXCISION,426,NON-HYPOVOLEMIC SODIUM DISORDERS,10,"ENDOCRINE, NUTRITIONAL AND METABOLIC DISEASES AND DISORDERS",4,Extreme,Extreme,Medical,Medicare,Medicare,Self-Pay,,,true,78868.49,20827.56
Western NY,Erie,1404000,000267,Kenmore Mercy Hospital,70 or Older,140,F,White,Not Span/Hispanic,8,Emergency,Home w/ Home Health Services,2019,END011,FLUID AND ELECTROLYTE DISORDERS,,,426,NON-HYPOVOLEMIC SODIUM DISORDERS,10,"ENDOCRINE, NUTRITIONAL AND METABOLIC DISEASES AND DISORDERS",4,Extreme,Major,Medical,Medicare,Medicare,Medicaid,,,true,37199.32,13057.66
Central NY,Oneida,3202003,000599,Faxton-St Lukes Healthcare St Lukes Division,70 or Older,133,F,White,Not Span/Hispanic,4,Emergency,Home or Self Care,2019,END011,FLUID AND ELECTROLYTE DISORDERS,SKB006,SKIN LACERATION REPAIR (EXCLUDING PERINEUM),426,NON-HYPOVOLEMIC SODIUM DISORDERS,10,"ENDOCRINE, NUTRITIONAL AND METABOLIC DISEASES AND DISORDERS",3,Major,Major,Medical,Medicare,Private Health Insurance,,,,true,20304.34,4868.04
Western NY,Erie,1404000,000267,Kenmore Mercy Hospital,50 to 69,142,M,White,Not Span/Hispanic,1,Emergency,Facility w/ Custodial/Supportive Care,2019,END011,FLUID AND ELECTROLYTE DISORDERS,,,426,NON-HYPOVOLEMIC SODIUM DISORDERS,10,"ENDOCRINE, NUTRITIONAL AND METABOLIC DISEASES AND DISORDERS",2,Moderate,Minor,Medical,Medicare,Medicare,Medicaid,,,true,5865.49,2118.82
Southern Tier,Broome,0303001,000058,United Health Services Hospitals Inc. - Wilson Medical Center,50 to 69,139,F,White,Not Span/Hispanic,4,Emergency,Home or Self Care,2019,END011,FLUID AND ELECTROLYTE DISORDERS,IMG006,COMPUTERIZED TOMOGRAPHY (CT) WITH CONTRAST,426,NON-HYPOVOLEMIC SODIUM DISORDERS,10,"ENDOCRINE, NUTRITIONAL AND METABOLIC DISEASES AND DISORDERS",2,Moderate,Minor,Medical,Medicare,Medicare,Medicaid,,,true,26157.6,9253.51
Hudson Valley,Dutchess,1302001,000181,Vassar Brothers Medical Center,70 or Older,125,F,White,Not Span/Hispanic,3,Emergency,Home or Self Care,2019,END011,FLUID AND ELECTROLYTE DISORDERS,,,426,NON-HYPOVOLEMIC SODIUM DISORDERS,10,"ENDOCRINE, NUTRITIONAL AND METABOLIC DISEASES AND DISORDERS",2,Moderate,Moderate,Medical,Blue Cross/Blue Shield,Medicare,,,,true,13864.71,3974.76
Hudson Valley,Dutchess,1302001,000181,Vassar Brothers Medical Center,70 or Older,125,F,White,Not Span/Hispanic,3,Emergency,Skilled Nursing Home,2019,END011,FLUID AND ELECTROLYTE DISORDERS,,,426,NON-HYPOVOLEMIC SODIUM DISORDERS,10,"ENDOCRINE, NUTRITIONAL AND METABOLIC DISEASES AND DISORDERS",3,Major,Major,Medical,Medicare,Blue Cross/Blue Shield,Medicaid,,,true,18723.09,8288.04
Long Island,Suffolk,5154001,000925,Good Samaritan Hospital Medical Center,70 or Older,117,F,White,Not Span/Hispanic,3,Emergency,Home w/ Home Health Services,2019,END011,FLUID AND ELECTROLYTE DISORDERS,,,426,NON-HYPOVOLEMIC SODIUM DISORDERS,10,"ENDOCRINE, NUTRITIONAL AND METABOLIC DISEASES AND DISORDERS",2,Moderate,Moderate,Medical,Medicare,Blue Cross/Blue Shield,,,,true,23100,4535.69
New York City,Bronx,7000008,001172,Lincoln Medical & Mental Health Center,30 to 49,104,M,Other Race,Spanish/Hispanic,1,Emergency,Left Against Medical Advice,2019,END011,FLUID AND ELECTROLYTE DISORDERS,,,426,NON-HYPOVOLEMIC SODIUM DISORDERS,10,"ENDOCRINE, NUTRITIONAL AND METABOLIC DISEASES AND DISORDERS",2,Moderate,Moderate,Medical,Medicaid,,,,,true,7898.31,4664.4
New York City,Kings,7001020,001305,Maimonides Medical Center,70 or Older,112,M,White,Not Span/Hispanic,4,Emergency,Home w/ Home Health Services,2019,END011,FLUID AND ELECTROLYTE DISORDERS,URN006,BLADDER CATHETERIZATION AND DRAINAGE,426,NON-HYPOVOLEMIC SODIUM DISORDERS,10,"ENDOCRINE, NUTRITIONAL AND METABOLIC DISEASES AND DISORDERS",3,Major,Major,Medical,Private Health Insurance,Self-Pay,,,,true,34102.1,10905.49
New York City,Kings,7001020,001305,Maimonides Medical Center,50 to 69,112,F,Other Race,Not Span/Hispanic,1,Emergency,Home or Self Care,2019,END011,FLUID AND ELECTROLYTE DISORDERS,,,426,NON-HYPOVOLEMIC SODIUM DISORDERS,10,"ENDOCRINE, NUTRITIONAL AND METABOLIC DISEASES AND DISORDERS",1,Minor,Minor,Medical,Medicare,Self-Pay,,,,true,10887.02,3925.03
Capital/Adirond,Schenectady,4601001,000829,Ellis Hospital,50 to 69,120,F,White,Not Span/Hispanic,2,Emergency,Home or Self Care,2019,END011,FLUID AND ELECTROLYTE DISORDERS,,,426,NON-HYPOVOLEMIC SODIUM DISORDERS,10,"ENDOCRINE, NUTRITIONAL AND METABOLIC DISEASES AND DISORDERS",3,Major,Major,Medical,Medicare,Medicare,Medicaid,,,true,15112.25,3428.46
Hudson Valley,Westchester,5907001,001097,SJRH - St Johns Division,70 or Older,107,F,Other Race,Not Span/Hispanic,4,Emergency,Home or Self Care,2019,END013,PITUITARY DISORDERS,,,426,NON-HYPOVOLEMIC SODIUM DISORDERS,10,"ENDOCRINE, NUTRITIONAL AND METABOLIC DISEASES AND DISORDERS",3,Major,Major,Medical,Medicare,,,,,true,40733.19,10934.99
Long Island,Suffolk,5154001,000925,Good Samaritan Hospital Medical Center,70 or Older,117,F,White,Not Span/Hispanic,8,Emergency,Home w/ Home Health Services,2019,END011,FLUID AND ELECTROLYTE DISORDERS,,,426,NON-HYPOVOLEMIC SODIUM DISORDERS,10,"ENDOCRINE, NUTRITIONAL AND METABOLIC DISEASES AND DISORDERS",3,Major,Moderate,Medical,Medicare,Medicare,,,,true,68180,12641.87
Western NY,Erie,1401014,003067,Millard Fillmore Suburban Hospital,50 to 69,142,M,Other Race,Not Span/Hispanic,1,Emergency,Home or Self Care,2019,END011,FLUID AND ELECTROLYTE DISORDERS,,,426,NON-HYPOVOLEMIC SODIUM DISORDERS,10,"ENDOCRINE, NUTRITIONAL AND METABOLIC DISEASES AND DISORDERS",2,Moderate,Minor,Medical,Blue Cross/Blue Shield,Self-Pay,,,,true,8475.88,2235.62
Southern Tier,Broome,0303001,000058,United Health Services Hospitals Inc. - Wilson Medical Center,70 or Older,138,F,White,Not Span/Hispanic,2,Emergency,Home or Self Care,2019,END011,FLUID AND ELECTROLYTE DISORDERS,,,426,NON-HYPOVOLEMIC SODIUM DISORDERS,10,"ENDOCRINE, NUTRITIONAL AND METABOLIC DISEASES AND DISORDERS",3,Major,Major,Medical,Medicare,Medicare,Private Health Insurance,,,true,5163.7,2859.16
New York City,Kings,7001020,001305,Maimonides Medical Center,70 or Older,112,M,White,Not Span/Hispanic,4,Emergency,Home or Self Care,2019,END013,PITUITARY DISORDERS,IMG008,ULTRASONOGRAPHY,426,NON-HYPOVOLEMIC SODIUM DISORDERS,10,"ENDOCRINE, NUTRITIONAL AND METABOLIC DISEASES AND DISORDERS",3,Major,Major,Medical,Medicare,Medicaid,Self-Pay,,,true,28061,7530.94
New York City,Kings,7001020,001305,Maimonides Medical Center,70 or Older,112,F,White,Not Span/Hispanic,1,Emergency,Home or Self Care,2019,END013,PITUITARY DISORDERS,IMG006,COMPUTERIZED TOMOGRAPHY (CT) WITH CONTRAST,426,NON-HYPOVOLEMIC SODIUM DISORDERS,10,"ENDOCRINE, NUTRITIONAL AND METABOLIC DISEASES AND DISORDERS",1,Minor,Moderate,Medical,Medicare,Private Health Insurance,Self-Pay,,,true,14479.01,4738.74
Capital/Adirond,Columbia,1001000,000146,Columbia Memorial Hospital,70 or Older,120,F,White,Not Span/Hispanic,4,Elective,Skilled Nursing Home,2019,END011,FLUID AND ELECTROLYTE DISORDERS,,,426,NON-HYPOVOLEMIC SODIUM DISORDERS,10,"ENDOCRINE, NUTRITIONAL AND METABOLIC DISEASES AND DISORDERS",2,Moderate,Moderate,Medical,Medicare,Private Health Insurance,,,,true,12912.13,4600.49
Capital/Adirond,Columbia,1001000,000146,Columbia Memorial Hospital,70 or Older,120,M,White,Not Span/Hispanic,4,Elective,Home or Self Care,2019,END011,FLUID AND ELECTROLYTE DISORDERS,,,426,NON-HYPOVOLEMIC SODIUM DISORDERS,10,"ENDOCRINE, NUTRITIONAL AND METABOLIC DISEASES AND DISORDERS",3,Major,Major,Medical,Medicare,Private Health Insurance,,,,true,16049.32,5252.46
New York City,Kings,7002053,001304,NYU Langone Hospital-Brooklyn,50 to 69,112,F,Other Race,Not Span/Hispanic,2,Emergency,Home w/ Home Health Services,2019,END011,FLUID AND ELECTROLYTE DISORDERS,,,426,NON-HYPOVOLEMIC SODIUM DISORDERS,10,"ENDOCRINE, NUTRITIONAL AND METABOLIC DISEASES AND DISORDERS",4,Extreme,Major,Medical,Medicare,Medicaid,,,,true,64704.97,20739.89
New York City,Kings,7002002,001324,Mount Sinai Brooklyn,70 or Older,112,F,White,Not Span/Hispanic,3,Emergency,Home w/ Home Health Services,2019,END013,PITUITARY DISORDERS,,,426,NON-HYPOVOLEMIC SODIUM DISORDERS,10,"ENDOCRINE, NUTRITIONAL AND METABOLIC DISEASES AND DISORDERS",1,Minor,Minor,Medical,Medicare,Medicaid,Self-Pay,,,true,62452.36,10198.92
New York City,Manhattan,7002001,001438,Bellevue Hospital Center,50 to 69,100,M,Other Race,Spanish/Hispanic,9,Emergency,Home or Self Care,2019,END011,FLUID AND ELECTROLYTE DISORDERS,GIS001,ESOPHAGOGASTRODUODENOSCOPY (EGD) WITH BIOPSY,426,NON-HYPOVOLEMIC SODIUM DISORDERS,10,"ENDOCRINE, NUTRITIONAL AND METABOLIC DISEASES AND DISORDERS",3,Major,Moderate,Medical,Medicaid,Medicaid,,,,false,54740.23,36380.36
New York City,Bronx,7000001,001178,BronxCare Hospital Center,0 to 17,104,M,Other Race,Spanish/Hispanic,3,Emergency,Home or Self Care,2019,END011,FLUID AND ELECTROLYTE DISORDERS,,,426,NON-HYPOVOLEMIC SODIUM DISORDERS,10,"ENDOCRINE, NUTRITIONAL AND METABOLIC DISEASES AND DISORDERS",2,Moderate,Moderate,Medical,Private Health Insurance,,,,,true,10092.4,8468.11
Western NY,Cattaraugus,0401001,000066,Olean General Hospital,70 or Older,OOS,F,White,Not Span/Hispanic,1,Emergency,Home or Self Care,2019,END011,FLUID AND ELECTROLYTE DISORDERS,,,426,NON-HYPOVOLEMIC SODIUM DISORDERS,10,"ENDOCRINE, NUTRITIONAL AND METABOLIC DISEASES AND DISORDERS",2,Moderate,Moderate,Medical,Medicare,Private Health Insurance,,,,true,3591.35,5376.06
Southern Tier,Broome,0301001,000043,Our Lady of Lourdes Memorial Hospital,50 to 69,137,M,White,Not Span/Hispanic,1,Emergency,Home or Self Care,2019,END011,FLUID AND ELECTROLYTE DISORDERS,,,426,NON-HYPOVOLEMIC SODIUM DISORDERS,10,"ENDOCRINE, NUTRITIONAL AND METABOLIC DISEASES AND DISORDERS",1,Minor,Minor,Medical,Private Health Insurance,Self-Pay,Self-Pay,,,true,9014.52,1161.04
New York City,Kings,7001033,001315,Kingsbrook Jewish Medical Center,50 to 69,112,F,Black/African American,Not Span/Hispanic,7,Emergency,Home or Self Care,2019,END011,FLUID AND ELECTROLYTE DISORDERS,,,426,NON-HYPOVOLEMIC SODIUM DISORDERS,10,"ENDOCRINE, NUTRITIONAL AND METABOLIC DISEASES AND DISORDERS",2,Moderate,Minor,Medical,Medicaid,Medicaid,Self-Pay,,,true,52423,15745.44
New York City,Kings,7001033,001315,Kingsbrook Jewish Medical Center,70 or Older,112,F,Black/African American,Not Span/Hispanic,31,Emergency,Home or Self Care,2019,END011,FLUID AND ELECTROLYTE DISORDERS,ADM017,ADMINISTRATION OF NUTRITIONAL AND ELECTROLYTIC SUBSTANCES,426,NON-HYPOVOLEMIC SODIUM DISORDERS,10,"ENDOCRINE, NUTRITIONAL AND METABOLIC DISEASES AND DISORDERS",4,Extreme,Extreme,Medical,Medicare,Medicare,Medicaid,,,true,289748,80745.06
New York City,Manhattan,7002054,001464,New York-Presbyterian Hospital - Columbia Presbyterian Center,50 to 69,112,F,White,Not Span/Hispanic,5,Emergency,Home or Self Care,2019,END011,FLUID AND ELECTROLYTE DISORDERS,,,426,NON-HYPOVOLEMIC SODIUM DISORDERS,10,"ENDOCRINE, NUTRITIONAL AND METABOLIC DISEASES AND DISORDERS",3,Major,Minor,Medical,Medicare,Private Health Insurance,Self-Pay,,,true,63702.87,13691.17
Capital/Adirond,Albany,0101004,000005,St. Peter's Hospital,70 or Older,120,F,White,Not Span/Hispanic,4,Emergency,Short-term Hospital,2019,END011,FLUID AND ELECTROLYTE DISORDERS,GIS001,ESOPHAGOGASTRODUODENOSCOPY (EGD) WITH BIOPSY,426,NON-HYPOVOLEMIC SODIUM DISORDERS,10,"ENDOCRINE, NUTRITIONAL AND METABOLIC DISEASES AND DISORDERS",3,Major,Moderate,Medical,Medicare,Blue Cross/Blue Shield,,,,false,42542.65,11308.24
New York City,Manhattan,7002054,001464,New York-Presbyterian Hospital - Columbia Presbyterian Center,0 to 17,104,F,Multi-racial,Not Span/Hispanic,1,Emergency,Home or Self Care,2019,END011,FLUID AND ELECTROLYTE DISORDERS,ADM021,"ADMINISTRATION OF THERAPEUTIC SUBSTANCES, NEC",426,NON-HYPOVOLEMIC SODIUM DISORDERS,10,"ENDOCRINE, NUTRITIONAL AND METABOLIC DISEASES AND DISORDERS",3,Major,Moderate,Medical,Medicaid,Medicaid,Self-Pay,,,true,17218.33,3693.58
New York City,Manhattan,7002053,001463,NYU Langone Hospitals,50 to 69,115,F,White,Not Span/Hispanic,3,Emergency,Home w/ Home Health Services,2019,END011,FLUID AND ELECTROLYTE DISORDERS,,,426,NON-HYPOVOLEMIC SODIUM DISORDERS,10,"ENDOCRINE, NUTRITIONAL AND METABOLIC DISEASES AND DISORDERS",3,Major,Moderate,Medical,Medicare,Blue Cross/Blue Shield,Medicaid,,,true,27944.16,10841.43
New York City,Manhattan,7002053,001463,NYU Langone Hospitals,70 or Older,111,F,White,Not Span/Hispanic,2,Emergency,Home or Self Care,2019,END013,PITUITARY DISORDERS,,,426,NON-HYPOVOLEMIC SODIUM DISORDERS,10,"ENDOCRINE, NUTRITIONAL AND METABOLIC DISEASES AND DISORDERS",2,Moderate,Major,Medical,Medicare,Blue Cross/Blue Shield,,,,true,25101.82,7680.28
Hudson Valley,Rockland,4329000,000779,Good Samaritan Hospital of Suffern,70 or Older,OOS,F,White,Not Span/Hispanic,4,Emergency,Skilled Nursing Home,2019,END011,FLUID AND ELECTROLYTE DISORDERS,,,426,NON-HYPOVOLEMIC SODIUM DISORDERS,10,"ENDOCRINE, NUTRITIONAL AND METABOLIC DISEASES AND DISORDERS",3,Major,Major,Medical,Medicare,Private Health Insurance,,,,true,85328.33,9924.34
Western NY,Erie,1401014,003067,Millard Fillmore Suburban Hospital,30 to 49,140,F,White,Not Span/Hispanic,4,Emergency,Home or Self Care,2019,END011,FLUID AND ELECTROLYTE DISORDERS,,,426,NON-HYPOVOLEMIC SODIUM DISORDERS,10,"ENDOCRINE, NUTRITIONAL AND METABOLIC DISEASES AND DISORDERS",3,Major,Moderate,Medical,Medicare,Medicaid,Self-Pay,,,true,13842.88,6010.42
Western NY,Erie,1401014,003067,Millard Fillmore Suburban Hospital,70 or Older,140,M,White,Not Span/Hispanic,1,Emergency,Home w/ Home Health Services,2019,END011,FLUID AND ELECTROLYTE DISORDERS,,,426,NON-HYPOVOLEMIC SODIUM DISORDERS,10,"ENDOCRINE, NUTRITIONAL AND METABOLIC DISEASES AND DISORDERS",2,Moderate,Major,Medical,Blue Cross/Blue Shield,Medicare,Self-Pay,,,true,9437.89,3029.99