Hospital Service Area,Hospital County,Operating Certificate Number,Permanent Facility Id,Facility Name,Age Group,Zip Code - 3 digits,Gender,Race,Ethnicity,Length of Stay,Type of Admission,Patient Disposition,Discharge Year,CCS Diagnosis Code,CCS Diagnosis Description,CCS Procedure Code,CCS Procedure Description,APR DRG Code,APR DRG Description,APR MDC Code,APR MDC Description,APR Severity of Illness Code,APR Severity of Illness Description,APR Risk of Mortality,APR Medical Surgical Description,Payment Typology 1,Payment Typology 2,Payment Typology 3,Birth Weight,Abortion Edit Indicator,Emergency Department Indicator,Total Charges,Total Costs
New York City,Manhattan,7002053,001463,NYU Langone Hospitals,70 or Older,112,F,Other Race,Not Span/Hispanic,6,Emergency,Home w/ Home Health Services,2019,END001,THYROID DISORDERS,GIS004,GI SYSTEM ENDOSCOPY WITHOUT BIOPSY (DIAGNOSTIC),427,THYROID DISORDERS,10,"ENDOCRINE, NUTRITIONAL AND METABOLIC DISEASES AND DISORDERS",3,Major,Major,Medical,Medicare,Medicaid,,,,true,95833.84,29149.56
New York City,Manhattan,7002053,001463,NYU Langone Hospitals,70 or Older,113,F,White,Not Span/Hispanic,1,Emergency,Home or Self Care,2019,END001,THYROID DISORDERS,IMG008,ULTRASONOGRAPHY,427,THYROID DISORDERS,10,"ENDOCRINE, NUTRITIONAL AND METABOLIC DISEASES AND DISORDERS",3,Major,Major,Medical,Medicare,Medicare,,,,true,19583.96,5223.1
New York City,Manhattan,7002053,001463,NYU Langone Hospitals,0 to 17,112,M,Black/African American,Not Span/Hispanic,1,Emergency,Home or Self Care,2019,END001,THYROID DISORDERS,,,427,THYROID DISORDERS,10,"ENDOCRINE, NUTRITIONAL AND METABOLIC DISEASES AND DISORDERS",2,Moderate,Minor,Medical,Medicaid,,,,,true,20458.71,4728.18
New York City,Manhattan,7002053,001463,NYU Langone Hospitals,70 or Older,100,F,White,Not Span/Hispanic,4,Emergency,Hospice - Medical Facility,2019,END001,THYROID DISORDERS,ADM021,"ADMINISTRATION OF THERAPEUTIC SUBSTANCES, NEC",427,THYROID DISORDERS,10,"ENDOCRINE, NUTRITIONAL AND METABOLIC DISEASES AND DISORDERS",4,Extreme,Extreme,Medical,Medicare,Private Health Insurance,,,,true,55875.03,19663.58
New York City,Manhattan,7002053,001463,NYU Langone Hospitals,18 to 29,103,F,White,Not Span/Hispanic,4,Emergency,Home or Self Care,2019,END001,THYROID DISORDERS,CNS002,LUMBAR PUNCTURE,427,THYROID DISORDERS,10,"ENDOCRINE, NUTRITIONAL AND METABOLIC DISEASES AND DISORDERS",2,Moderate,Moderate,Medical,Medicaid,,,,,true,72934.08,18448.17
New York City,Manhattan,7002053,001463,NYU Langone Hospitals,50 to 69,112,F,Black/African American,Not Span/Hispanic,2,Emergency,Home w/ Home Health Services,2019,NEO050,ENDOCRINE SYSTEM CANCERS - THYROID,,,427,THYROID DISORDERS,10,"ENDOCRINE, NUTRITIONAL AND METABOLIC DISEASES AND DISORDERS",3,Major,Major,Medical,Medicare,,,,,true,28377.2,8294.57
New York City,Manhattan,7002053,001463,NYU Langone Hospitals,50 to 69,OOS,M,White,Not Span/Hispanic,4,Emergency,Home or Self Care,2019,END001,THYROID DISORDERS,CNS002,LUMBAR PUNCTURE,427,THYROID DISORDERS,10,"ENDOCRINE, NUTRITIONAL AND METABOLIC DISEASES AND DISORDERS",3,Major,Moderate,Medical,Blue Cross/Blue Shield,,,,,true,112664.13,19354.97
New York City,Manhattan,7002053,001463,NYU Langone Hospitals,18 to 29,112,F,White,Not Span/Hispanic,1,Emergency,Home or Self Care,2019,END001,THYROID DISORDERS,,,427,THYROID DISORDERS,10,"ENDOCRINE, NUTRITIONAL AND METABOLIC DISEASES AND DISORDERS",2,Moderate,Minor,Medical,Blue Cross/Blue Shield,,,,,true,15813.52,4646.4
New York City,Manhattan,7002053,001463,NYU Langone Hospitals,0 to 17,100,F,Other Race,Unknown,2,Emergency,Home or Self Care,2019,END001,THYROID DISORDERS,,,427,THYROID DISORDERS,10,"ENDOCRINE, NUTRITIONAL AND METABOLIC DISEASES AND DISORDERS",2,Moderate,Minor,Medical,Private Health Insurance,,,,,true,37181.43,10467.18
New York City,Manhattan,7002053,001463,NYU Langone Hospitals,30 to 49,112,F,White,Not Span/Hispanic,1,Emergency,Home or Self Care,2019,END001,THYROID DISORDERS,,,427,THYROID DISORDERS,10,"ENDOCRINE, NUTRITIONAL AND METABOLIC DISEASES AND DISORDERS",2,Moderate,Minor,Medical,Medicaid,,,,,true,25734.01,6056.87
New York City,Manhattan,7002053,001463,NYU Langone Hospitals,30 to 49,112,F,Other Race,Unknown,3,Emergency,Home or Self Care,2019,END001,THYROID DISORDERS,,,427,THYROID DISORDERS,10,"ENDOCRINE, NUTRITIONAL AND METABOLIC DISEASES AND DISORDERS",3,Major,Minor,Medical,Medicaid,,,,,true,49574.12,16909.12
New York City,Manhattan,7002053,001463,NYU Langone Hospitals,18 to 29,112,M,Other Race,Not Span/Hispanic,1,Emergency,Home or Self Care,2019,END001,THYROID DISORDERS,IMG008,ULTRASONOGRAPHY,427,THYROID DISORDERS,10,"ENDOCRINE, NUTRITIONAL AND METABOLIC DISEASES AND DISORDERS",2,Moderate,Minor,Medical,Private Health Insurance,,,,,false,11227.02,3728.6
New York City,Manhattan,7002053,001463,NYU Langone Hospitals,50 to 69,112,M,White,Not Span/Hispanic,1,Emergency,Home or Self Care,2019,END001,THYROID DISORDERS,ADM021,"ADMINISTRATION OF THERAPEUTIC SUBSTANCES, NEC",427,THYROID DISORDERS,10,"ENDOCRINE, NUTRITIONAL AND METABOLIC DISEASES AND DISORDERS",3,Major,Minor,Medical,Private Health Insurance,,,,,true,20408.47,5356.33
New York City,Manhattan,7002053,001463,NYU Langone Hospitals,30 to 49,112,F,White,Not Span/Hispanic,5,Emergency,Home or Self Care,2019,END001,THYROID DISORDERS,MAM011,ELECTROENCEPHALOGRAM (EEG),427,THYROID DISORDERS,10,"ENDOCRINE, NUTRITIONAL AND METABOLIC DISEASES AND DISORDERS",3,Major,Moderate,Medical,Medicare,Blue Cross/Blue Shield,,,,true,133288.59,20428.31
New York City,Manhattan,7002053,001463,NYU Langone Hospitals,70 or Older,100,F,White,Not Span/Hispanic,3,Emergency,Skilled Nursing Home,2019,END001,THYROID DISORDERS,URN006,BLADDER CATHETERIZATION AND DRAINAGE,427,THYROID DISORDERS,10,"ENDOCRINE, NUTRITIONAL AND METABOLIC DISEASES AND DISORDERS",3,Major,Major,Medical,Medicare,Blue Cross/Blue Shield,,,,true,71766.52,20765.93
New York City,Manhattan,7002053,001463,NYU Langone Hospitals,18 to 29,100,M,White,Not Span/Hispanic,1,Emergency,Home or Self Care,2019,END001,THYROID DISORDERS,,,427,THYROID DISORDERS,10,"ENDOCRINE, NUTRITIONAL AND METABOLIC DISEASES AND DISORDERS",1,Minor,Minor,Medical,Private Health Insurance,,,,,true,31137.37,10042.13
New York City,Manhattan,7002053,001463,NYU Langone Hospitals,70 or Older,OOS,F,White,Not Span/Hispanic,5,Elective,Home or Self Care,2019,END001,THYROID DISORDERS,MAM011,ELECTROENCEPHALOGRAM (EEG),427,THYROID DISORDERS,10,"ENDOCRINE, NUTRITIONAL AND METABOLIC DISEASES AND DISORDERS",2,Moderate,Major,Medical,Medicare,Private Health Insurance,,,,false,98307.74,21294.76
New York City,Manhattan,7002053,001463,NYU Langone Hospitals,70 or Older,112,M,White,Not Span/Hispanic,4,Emergency,Home w/ Home Health Services,2019,INJ030,DRUG INDUCED OR TOXIC RELATED CONDITION,,,427,THYROID DISORDERS,10,"ENDOCRINE, NUTRITIONAL AND METABOLIC DISEASES AND DISORDERS",3,Major,Major,Medical,Medicare,Medicare,,,,true,60917.35,16902.74
New York City,Manhattan,7002053,001463,NYU Langone Hospitals,50 to 69,100,F,Other Race,Unknown,1,Emergency,Home or Self Care,2019,END001,THYROID DISORDERS,,,427,THYROID DISORDERS,10,"ENDOCRINE, NUTRITIONAL AND METABOLIC DISEASES AND DISORDERS",2,Moderate,Moderate,Medical,Private Health Insurance,,,,,true,39328.88,11245.11
New York City,Manhattan,7002053,001463,NYU Langone Hospitals,50 to 69,100,F,Other Race,Unknown,5,Emergency,Home or Self Care,2019,END001,THYROID DISORDERS,,,427,THYROID DISORDERS,10,"ENDOCRINE, NUTRITIONAL AND METABOLIC DISEASES AND DISORDERS",2,Moderate,Minor,Medical,Medicaid,,,,,true,58897.19,19153.17
New York City,Manhattan,7002053,001463,NYU Langone Hospitals,18 to 29,112,F,Multi-racial,Not Span/Hispanic,2,Emergency,Home or Self Care,2019,END001,THYROID DISORDERS,,,427,THYROID DISORDERS,10,"ENDOCRINE, NUTRITIONAL AND METABOLIC DISEASES AND DISORDERS",2,Moderate,Moderate,Medical,Medicaid,,,,,true,31481.4,8753.52
