Hospital Service Area,Hospital County,Operating Certificate Number,Permanent Facility Id,Facility Name,Age Group,Zip Code - 3 digits,Gender,Race,Ethnicity,Length of Stay,Type of Admission,Patient Disposition,Discharge Year,CCS Diagnosis Code,CCS Diagnosis Description,CCS Procedure Code,CCS Procedure Description,APR DRG Code,APR DRG Description,APR MDC Code,APR MDC Description,APR Severity of Illness Code,APR Severity of Illness Description,APR Risk of Mortality,APR Medical Surgical Description,Payment Typology 1,Payment Typology 2,Payment Typology 3,Birth Weight,Abortion Edit Indicator,Emergency Department Indicator,Total Charges,Total Costs
New York City,Manhattan,7002053,001446,NYU Langone Orthopedic Hospital,30 to 49,,F,White,Unknown,16,Elective,Home w/ Home Health Services,2017,080,Multiple sclerosis,213,"PHYS THER EXER, MANIPUL",043,Multiple sclerosis & other demyelinating diseases,01,Diseases and Disorders of the Nervous System,3,Major,Moderate,Medical,Blue Cross/Blue Shield,,,,N,N,141401.17,43284.10
New York City,Manhattan,7002053,001446,NYU Langone Orthopedic Hospital,50 to 69,112,M,Black/African American,Not Span/Hispanic,13,Elective,Skilled Nursing Home,2017,080,Multiple sclerosis,213,"PHYS THER EXER, MANIPUL",043,Multiple sclerosis & other demyelinating diseases,01,Diseases and Disorders of the Nervous System,2,Moderate,Minor,Medical,Medicare,,,,N,N,145700.56,38811.52
New York City,Manhattan,7002053,001446,NYU Langone Orthopedic Hospital,50 to 69,101,M,White,Not Span/Hispanic,13,Elective,Home or Self Care,2017,080,Multiple sclerosis,213,"PHYS THER EXER, MANIPUL",043,Multiple sclerosis & other demyelinating diseases,01,Diseases and Disorders of the Nervous System,1,Minor,Minor,Medical,Blue Cross/Blue Shield,,,,N,N,102250.70,33291.26
New York City,Manhattan,7002053,001446,NYU Langone Orthopedic Hospital,70 or Older,105,F,Other Race,Unknown,10,Elective,Home w/ Home Health Services,2017,080,Multiple sclerosis,213,"PHYS THER EXER, MANIPUL",043,Multiple sclerosis & other demyelinating diseases,01,Diseases and Disorders of the Nervous System,1,Minor,Moderate,Medical,Medicaid,,,,N,N,97913.22,28529.27
New York City,Manhattan,7002053,001446,NYU Langone Orthopedic Hospital,70 or Older,105,F,Other Race,Unknown,10,Elective,Home w/ Home Health Services,2017,095,Other nervous system disorders,213,"PHYS THER EXER, MANIPUL",043,Multiple sclerosis & other demyelinating diseases,01,Diseases and Disorders of the Nervous System,3,Major,Major,Medical,Medicaid,,,,N,N,96170.21,27546.74
New York City,Manhattan,7002053,001446,NYU Langone Orthopedic Hospital,50 to 69,OOS,F,White,Not Span/Hispanic,15,Elective,Home w/ Home Health Services,2017,080,Multiple sclerosis,213,"PHYS THER EXER, MANIPUL",043,Multiple sclerosis & other demyelinating diseases,01,Diseases and Disorders of the Nervous System,1,Minor,Minor,Medical,Blue Cross/Blue Shield,,,,N,N,132225.45,42049.47
New York City,Manhattan,7002053,001446,NYU Langone Orthopedic Hospital,30 to 49,,F,Other Race,Spanish/Hispanic,29,Elective,Home w/ Home Health Services,2017,095,Other nervous system disorders,213,"PHYS THER EXER, MANIPUL",043,Multiple sclerosis & other demyelinating diseases,01,Diseases and Disorders of the Nervous System,2,Moderate,Minor,Medical,Private Health Insurance,,,,N,N,270879.68,83612.69
New York City,Manhattan,7002053,001446,NYU Langone Orthopedic Hospital,30 to 49,112,M,Other Race,Not Span/Hispanic,28,Elective,Home w/ Home Health Services,2017,095,Other nervous system disorders,213,"PHYS THER EXER, MANIPUL",043,Multiple sclerosis & other demyelinating diseases,01,Diseases and Disorders of the Nervous System,3,Major,Minor,Medical,Private Health Insurance,,,,N,N,261413.19,80738.13
New York City,Manhattan,7002053,001446,NYU Langone Orthopedic Hospital,50 to 69,113,M,White,Not Span/Hispanic,15,Elective,Home w/ Home Health Services,2017,080,Multiple sclerosis,213,"PHYS THER EXER, MANIPUL",043,Multiple sclerosis & other demyelinating diseases,01,Diseases and Disorders of the Nervous System,1,Minor,Minor,Medical,Blue Cross/Blue Shield,,,,N,N,150561.82,42699.12
