Hospital Service Area,Hospital County,Operating Certificate Number,Permanent Facility Id,Facility Name,Age Group,Zip Code - 3 digits,Gender,Race,Ethnicity,Length of Stay,Type of Admission,Patient Disposition,Discharge Year,CCS Diagnosis Code,CCS Diagnosis Description,CCS Procedure Code,CCS Procedure Description,APR DRG Code,APR DRG Description,APR MDC Code,APR MDC Description,APR Severity of Illness Code,APR Severity of Illness Description,APR Risk of Mortality,APR Medical Surgical Description,Payment Typology 1,Payment Typology 2,Payment Typology 3,Birth Weight,Abortion Edit Indicator,Emergency Department Indicator,Total Charges,Total Costs
New York City,Kings,7002053,001304,NYU Langone Hospital-Brooklyn,30 to 49,112,M,White,Unknown,6,Emergency,Inpatient Rehabilitation Facility,2019,NVS005,MULTIPLE SCLEROSIS,,,043,MULTIPLE SCLEROSIS & OTHER DEMYELINATING DISEASES,01,DISEASES AND DISORDERS OF THE NERVOUS SYSTEM,2,Moderate,Minor,Medical,Medicaid,,,,,true,94583.31,22357.26
New York City,Kings,7002053,001304,NYU Langone Hospital-Brooklyn,50 to 69,112,F,Other Race,Spanish/Hispanic,5,Emergency,Home w/ Home Health Services,2019,NVS005,MULTIPLE SCLEROSIS,CNS002,LUMBAR PUNCTURE,043,MULTIPLE SCLEROSIS & OTHER DEMYELINATING DISEASES,01,DISEASES AND DISORDERS OF THE NERVOUS SYSTEM,2,Moderate,Minor,Medical,Medicaid,,,,,true,106831.19,21790.35
New York City,Kings,7002053,001304,NYU Langone Hospital-Brooklyn,30 to 49,112,M,White,Not Span/Hispanic,5,Emergency,Home or Self Care,2019,NVS020,OTHER SPECIFIED NERVOUS SYSTEM DISORDERS,CNS002,LUMBAR PUNCTURE,043,MULTIPLE SCLEROSIS & OTHER DEMYELINATING DISEASES,01,DISEASES AND DISORDERS OF THE NERVOUS SYSTEM,1,Minor,Minor,Medical,Blue Cross/Blue Shield,,,,,true,97538.06,22154.95
New York City,Kings,7002053,001304,NYU Langone Hospital-Brooklyn,30 to 49,112,M,White,Spanish/Hispanic,4,Emergency,Home or Self Care,2019,NVS005,MULTIPLE SCLEROSIS,CNS002,LUMBAR PUNCTURE,043,MULTIPLE SCLEROSIS & OTHER DEMYELINATING DISEASES,01,DISEASES AND DISORDERS OF THE NERVOUS SYSTEM,2,Moderate,Moderate,Medical,Medicaid,,,,,true,97994.63,17396.62
New York City,Kings,7002053,001304,NYU Langone Hospital-Brooklyn,50 to 69,112,M,White,Not Span/Hispanic,4,Emergency,Home or Self Care,2019,NVS005,MULTIPLE SCLEROSIS,,,043,MULTIPLE SCLEROSIS & OTHER DEMYELINATING DISEASES,01,DISEASES AND DISORDERS OF THE NERVOUS SYSTEM,2,Moderate,Minor,Medical,Medicare,Private Health Insurance,,,,true,40503.48,13941.03
New York City,Kings,7002053,001304,NYU Langone Hospital-Brooklyn,30 to 49,112,M,White,Not Span/Hispanic,4,Emergency,Inpatient Rehabilitation Facility,2019,NVS005,MULTIPLE SCLEROSIS,ADM016,ADMINISTRATION OF ANTI-INFLAMMATORY AGENTS,043,MULTIPLE SCLEROSIS & OTHER DEMYELINATING DISEASES,01,DISEASES AND DISORDERS OF THE NERVOUS SYSTEM,3,Major,Moderate,Medical,Medicare,Medicaid,,,,true,66016.76,15168.58
New York City,Kings,7002053,001304,NYU Langone Hospital-Brooklyn,30 to 49,112,F,White,Not Span/Hispanic,5,Emergency,Home or Self Care,2019,NVS005,MULTIPLE SCLEROSIS,,,043,MULTIPLE SCLEROSIS & OTHER DEMYELINATING DISEASES,01,DISEASES AND DISORDERS OF THE NERVOUS SYSTEM,1,Minor,Minor,Medical,Private Health Insurance,,,,,true,71697.87,19080.16
New York City,Kings,7002053,001304,NYU Langone Hospital-Brooklyn,18 to 29,112,F,Other Race,Not Span/Hispanic,4,Emergency,Home or Self Care,2019,NVS005,MULTIPLE SCLEROSIS,ADM016,ADMINISTRATION OF ANTI-INFLAMMATORY AGENTS,043,MULTIPLE SCLEROSIS & OTHER DEMYELINATING DISEASES,01,DISEASES AND DISORDERS OF THE NERVOUS SYSTEM,1,Minor,Minor,Medical,Private Health Insurance,,,,,true,85983.77,15758.95
New York City,Kings,7002053,001304,NYU Langone Hospital-Brooklyn,50 to 69,112,M,White,Not Span/Hispanic,11,Emergency,Inpatient Rehabilitation Facility,2019,NVS005,MULTIPLE SCLEROSIS,CAR024,VENOUS AND ARTERIAL CATHETER PLACEMENT,043,MULTIPLE SCLEROSIS & OTHER DEMYELINATING DISEASES,01,DISEASES AND DISORDERS OF THE NERVOUS SYSTEM,4,Extreme,Major,Medical,Medicare,Private Health Insurance,,,,true,188546.76,42557.59
New York City,Kings,7002053,001304,NYU Langone Hospital-Brooklyn,18 to 29,112,F,Other Race,Spanish/Hispanic,6,Elective,Home or Self Care,2019,NVS005,MULTIPLE SCLEROSIS,RHB002,"PHYSICAL, OCCUPATIONAL, AND RESPIRATORY THERAPY TREATMENT",043,MULTIPLE SCLEROSIS & OTHER DEMYELINATING DISEASES,01,DISEASES AND DISORDERS OF THE NERVOUS SYSTEM,2,Moderate,Minor,Medical,Medicaid,,,,,false,85646.48,18986.3
New York City,Kings,7002053,001304,NYU Langone Hospital-Brooklyn,30 to 49,112,M,White,Not Span/Hispanic,4,Elective,Home or Self Care,2019,NVS005,MULTIPLE SCLEROSIS,RHB002,"PHYSICAL, OCCUPATIONAL, AND RESPIRATORY THERAPY TREATMENT",043,MULTIPLE SCLEROSIS & OTHER DEMYELINATING DISEASES,01,DISEASES AND DISORDERS OF THE NERVOUS SYSTEM,2,Moderate,Moderate,Medical,Medicare,Medicaid,,,,false,44219.67,12986.12
New York City,Kings,7002053,001304,NYU Langone Hospital-Brooklyn,50 to 69,112,M,White,Not Span/Hispanic,6,Elective,Home or Self Care,2019,NVS005,MULTIPLE SCLEROSIS,RHB002,"PHYSICAL, OCCUPATIONAL, AND RESPIRATORY THERAPY TREATMENT",043,MULTIPLE SCLEROSIS & OTHER DEMYELINATING DISEASES,01,DISEASES AND DISORDERS OF THE NERVOUS SYSTEM,3,Major,Moderate,Medical,Medicare,Private Health Insurance,,,,false,68493.68,18906.54
New York City,Kings,7002053,001304,NYU Langone Hospital-Brooklyn,18 to 29,112,F,Other Race,Spanish/Hispanic,18,Emergency,Inpatient Rehabilitation Facility,2019,NVS005,MULTIPLE SCLEROSIS,SKB010,"SKIN AND BREAST PROCEDURES, NEC",043,MULTIPLE SCLEROSIS & OTHER DEMYELINATING DISEASES,01,DISEASES AND DISORDERS OF THE NERVOUS SYSTEM,2,Moderate,Minor,Medical,Medicaid,,,,,true,261296.28,64056.42
New York City,Kings,7002053,001304,NYU Langone Hospital-Brooklyn,30 to 49,112,F,White,Not Span/Hispanic,4,Emergency,Home or Self Care,2019,NVS005,MULTIPLE SCLEROSIS,CNS002,LUMBAR PUNCTURE,043,MULTIPLE SCLEROSIS & OTHER DEMYELINATING DISEASES,01,DISEASES AND DISORDERS OF THE NERVOUS SYSTEM,1,Minor,Minor,Medical,Blue Cross/Blue Shield,,,,,true,82098.83,16443.6
New York City,Kings,7002053,001304,NYU Langone Hospital-Brooklyn,18 to 29,112,F,Other Race,Spanish/Hispanic,4,Emergency,Home or Self Care,2019,NVS005,MULTIPLE SCLEROSIS,ADM010,VACCINATIONS,043,MULTIPLE SCLEROSIS & OTHER DEMYELINATING DISEASES,01,DISEASES AND DISORDERS OF THE NERVOUS SYSTEM,2,Moderate,Minor,Medical,Private Health Insurance,,,,,true,94927.1,16254.33
New York City,Kings,7002053,001304,NYU Langone Hospital-Brooklyn,50 to 69,112,F,Black/African American,Not Span/Hispanic,5,Emergency,Home or Self Care,2019,NVS005,MULTIPLE SCLEROSIS,CNS002,LUMBAR PUNCTURE,043,MULTIPLE SCLEROSIS & OTHER DEMYELINATING DISEASES,01,DISEASES AND DISORDERS OF THE NERVOUS SYSTEM,1,Minor,Minor,Medical,Blue Cross/Blue Shield,,,,,true,105292.15,22010.28
New York City,Kings,7002053,001304,NYU Langone Hospital-Brooklyn,30 to 49,112,M,Other Race,Spanish/Hispanic,1,Emergency,Home or Self Care,2019,NVS005,MULTIPLE SCLEROSIS,,,043,MULTIPLE SCLEROSIS & OTHER DEMYELINATING DISEASES,01,DISEASES AND DISORDERS OF THE NERVOUS SYSTEM,2,Moderate,Minor,Medical,Medicaid,,,,,true,16666.72,4338.03
New York City,Kings,7002053,001304,NYU Langone Hospital-Brooklyn,70 or Older,112,M,White,Not Span/Hispanic,15,Elective,Home w/ Home Health Services,2019,NVS005,MULTIPLE SCLEROSIS,RHB002,"PHYSICAL, OCCUPATIONAL, AND RESPIRATORY THERAPY TREATMENT",043,MULTIPLE SCLEROSIS & OTHER DEMYELINATING DISEASES,01,DISEASES AND DISORDERS OF THE NERVOUS SYSTEM,2,Moderate,Moderate,Medical,Medicare,Private Health Insurance,,,,false,143774.2,45318.88
New York City,Kings,7002053,001304,NYU Langone Hospital-Brooklyn,50 to 69,112,M,Other Race,Not Span/Hispanic,5,Emergency,Home or Self Care,2019,NVS005,MULTIPLE SCLEROSIS,CNS002,LUMBAR PUNCTURE,043,MULTIPLE SCLEROSIS & OTHER DEMYELINATING DISEASES,01,DISEASES AND DISORDERS OF THE NERVOUS SYSTEM,1,Minor,Minor,Medical,Medicaid,,,,,true,70324.3,20198.43
New York City,Kings,7002053,001304,NYU Langone Hospital-Brooklyn,30 to 49,112,M,White,Unknown,12,Elective,Home w/ Home Health Services,2019,NVS005,MULTIPLE SCLEROSIS,RHB002,"PHYSICAL, OCCUPATIONAL, AND RESPIRATORY THERAPY TREATMENT",043,MULTIPLE SCLEROSIS & OTHER DEMYELINATING DISEASES,01,DISEASES AND DISORDERS OF THE NERVOUS SYSTEM,2,Moderate,Minor,Medical,Medicaid,,,,,false,135295.01,36701.59
New York City,Kings,7002053,001304,NYU Langone Hospital-Brooklyn,18 to 29,112,F,Other Race,Spanish/Hispanic,4,Emergency,Home or Self Care,2019,NVS005,MULTIPLE SCLEROSIS,ADM016,ADMINISTRATION OF ANTI-INFLAMMATORY AGENTS,043,MULTIPLE SCLEROSIS & OTHER DEMYELINATING DISEASES,01,DISEASES AND DISORDERS OF THE NERVOUS SYSTEM,2,Moderate,Minor,Medical,Private Health Insurance,,,,,true,65157.1,14966.75
New York City,Kings,7002053,001304,NYU Langone Hospital-Brooklyn,50 to 69,112,M,White,Not Span/Hispanic,4,Emergency,Home or Self Care,2019,NVS005,MULTIPLE SCLEROSIS,CNS002,LUMBAR PUNCTURE,043,MULTIPLE SCLEROSIS & OTHER DEMYELINATING DISEASES,01,DISEASES AND DISORDERS OF THE NERVOUS SYSTEM,2,Moderate,Minor,Medical,Medicaid,,,,,true,49430.48,15447.77
New York City,Kings,7002053,001304,NYU Langone Hospital-Brooklyn,30 to 49,112,F,Black/African American,Not Span/Hispanic,10,Elective,Home or Self Care,2019,NVS005,MULTIPLE SCLEROSIS,RHB002,"PHYSICAL, OCCUPATIONAL, AND RESPIRATORY THERAPY TREATMENT",043,MULTIPLE SCLEROSIS & OTHER DEMYELINATING DISEASES,01,DISEASES AND DISORDERS OF THE NERVOUS SYSTEM,2,Moderate,Minor,Medical,Private Health Insurance,,,,,false,108013.67,30582.4
New York City,Kings,7002053,001304,NYU Langone Hospital-Brooklyn,30 to 49,112,F,White,Spanish/Hispanic,4,Emergency,Home or Self Care,2019,NVS005,MULTIPLE SCLEROSIS,,,043,MULTIPLE SCLEROSIS & OTHER DEMYELINATING DISEASES,01,DISEASES AND DISORDERS OF THE NERVOUS SYSTEM,1,Minor,Minor,Medical,Medicaid,,,,,true,64979.55,15051.59
New York City,Kings,7002053,001304,NYU Langone Hospital-Brooklyn,18 to 29,112,M,White,Spanish/Hispanic,3,Emergency,Home or Self Care,2019,NVS005,MULTIPLE SCLEROSIS,ADM016,ADMINISTRATION OF ANTI-INFLAMMATORY AGENTS,043,MULTIPLE SCLEROSIS & OTHER DEMYELINATING DISEASES,01,DISEASES AND DISORDERS OF THE NERVOUS SYSTEM,2,Moderate,Minor,Medical,Medicaid,,,,,true,66473.14,13868.46
New York City,Kings,7002053,001304,NYU Langone Hospital-Brooklyn,30 to 49,112,M,White,Not Span/Hispanic,5,Emergency,Inpatient Rehabilitation Facility,2019,NVS005,MULTIPLE SCLEROSIS,,,043,MULTIPLE SCLEROSIS & OTHER DEMYELINATING DISEASES,01,DISEASES AND DISORDERS OF THE NERVOUS SYSTEM,1,Minor,Minor,Medical,Medicaid,,,,,true,99696.47,20424.15
New York City,Kings,7002053,001304,NYU Langone Hospital-Brooklyn,30 to 49,112,F,Black/African American,Not Span/Hispanic,5,Emergency,Home w/ Home Health Services,2019,NVS020,OTHER SPECIFIED NERVOUS SYSTEM DISORDERS,,,043,MULTIPLE SCLEROSIS & OTHER DEMYELINATING DISEASES,01,DISEASES AND DISORDERS OF THE NERVOUS SYSTEM,2,Moderate,Minor,Medical,Medicare,,,,,true,97041.71,19642.25
New York City,Kings,7002053,001304,NYU Langone Hospital-Brooklyn,30 to 49,112,M,White,Not Span/Hispanic,13,Elective,Home w/ Home Health Services,2019,NVS005,MULTIPLE SCLEROSIS,RHB002,"PHYSICAL, OCCUPATIONAL, AND RESPIRATORY THERAPY TREATMENT",043,MULTIPLE SCLEROSIS & OTHER DEMYELINATING DISEASES,01,DISEASES AND DISORDERS OF THE NERVOUS SYSTEM,1,Minor,Minor,Medical,Medicaid,,,,,false,134591,39893.8
New York City,Kings,7002053,001304,NYU Langone Hospital-Brooklyn,18 to 29,112,M,White,Not Span/Hispanic,4,Emergency,Home or Self Care,2019,NVS005,MULTIPLE SCLEROSIS,CNS002,LUMBAR PUNCTURE,043,MULTIPLE SCLEROSIS & OTHER DEMYELINATING DISEASES,01,DISEASES AND DISORDERS OF THE NERVOUS SYSTEM,2,Moderate,Minor,Medical,Medicaid,,,,,true,109544.17,24438.19
New York City,Kings,7002053,001304,NYU Langone Hospital-Brooklyn,30 to 49,112,M,Other Race,Not Span/Hispanic,5,Emergency,Home or Self Care,2019,NVS005,MULTIPLE SCLEROSIS,ADM016,ADMINISTRATION OF ANTI-INFLAMMATORY AGENTS,043,MULTIPLE SCLEROSIS & OTHER DEMYELINATING DISEASES,01,DISEASES AND DISORDERS OF THE NERVOUS SYSTEM,2,Moderate,Minor,Medical,Medicaid,,,,,true,113570.6,20148.24
New York City,Kings,7002053,001304,NYU Langone Hospital-Brooklyn,50 to 69,112,F,Other Race,Not Span/Hispanic,4,Emergency,Home or Self Care,2019,NVS005,MULTIPLE SCLEROSIS,,,043,MULTIPLE SCLEROSIS & OTHER DEMYELINATING DISEASES,01,DISEASES AND DISORDERS OF THE NERVOUS SYSTEM,1,Minor,Minor,Medical,Private Health Insurance,Medicare,,,,true,78473.84,15139.37
New York City,Kings,7002053,001304,NYU Langone Hospital-Brooklyn,50 to 69,112,M,White,Not Span/Hispanic,16,Elective,Home w/ Home Health Services,2019,NVS005,MULTIPLE SCLEROSIS,RHB002,"PHYSICAL, OCCUPATIONAL, AND RESPIRATORY THERAPY TREATMENT",043,MULTIPLE SCLEROSIS & OTHER DEMYELINATING DISEASES,01,DISEASES AND DISORDERS OF THE NERVOUS SYSTEM,2,Moderate,Minor,Medical,Medicaid,,,,,false,148617.32,47850.09
New York City,Kings,7002053,001304,NYU Langone Hospital-Brooklyn,50 to 69,112,F,Other Race,Spanish/Hispanic,10,Emergency,Home w/ Home Health Services,2019,NVS005,MULTIPLE SCLEROSIS,,,043,MULTIPLE SCLEROSIS & OTHER DEMYELINATING DISEASES,01,DISEASES AND DISORDERS OF THE NERVOUS SYSTEM,2,Moderate,Moderate,Medical,Private Health Insurance,Medicaid,,,,true,143872.77,35831.97
New York City,Kings,7002053,001304,NYU Langone Hospital-Brooklyn,18 to 29,112,F,Other Race,Spanish/Hispanic,4,Emergency,Inpatient Rehabilitation Facility,2019,NVS005,MULTIPLE SCLEROSIS,,,043,MULTIPLE SCLEROSIS & OTHER DEMYELINATING DISEASES,01,DISEASES AND DISORDERS OF THE NERVOUS SYSTEM,2,Moderate,Minor,Medical,Medicaid,,,,,true,108386.37,16811.4
New York City,Kings,7002053,001304,NYU Langone Hospital-Brooklyn,18 to 29,112,F,Other Race,Spanish/Hispanic,7,Elective,Home w/ Home Health Services,2019,NVS005,MULTIPLE SCLEROSIS,RHB002,"PHYSICAL, OCCUPATIONAL, AND RESPIRATORY THERAPY TREATMENT",043,MULTIPLE SCLEROSIS & OTHER DEMYELINATING DISEASES,01,DISEASES AND DISORDERS OF THE NERVOUS SYSTEM,2,Moderate,Minor,Medical,Medicaid,,,,,false,120509.24,22944.5
New York City,Kings,7002053,001304,NYU Langone Hospital-Brooklyn,30 to 49,112,F,Black/African American,Not Span/Hispanic,3,Emergency,Home w/ Home Health Services,2019,NVS005,MULTIPLE SCLEROSIS,IMG005,MAGNETIC RESONANCE IMAGING (MRI),043,MULTIPLE SCLEROSIS & OTHER DEMYELINATING DISEASES,01,DISEASES AND DISORDERS OF THE NERVOUS SYSTEM,2,Moderate,Minor,Medical,Medicare,Medicaid,,,,true,50947.01,11462.63
New York City,Kings,7002053,001304,NYU Langone Hospital-Brooklyn,30 to 49,112,F,White,Spanish/Hispanic,4,Emergency,Home or Self Care,2019,NVS005,MULTIPLE SCLEROSIS,,,043,MULTIPLE SCLEROSIS & OTHER DEMYELINATING DISEASES,01,DISEASES AND DISORDERS OF THE NERVOUS SYSTEM,1,Minor,Minor,Medical,Medicaid,,,,,true,81891.12,15226.21
New York City,Kings,7002053,001304,NYU Langone Hospital-Brooklyn,50 to 69,112,M,White,Not Span/Hispanic,2,Emergency,Home or Self Care,2019,NVS005,MULTIPLE SCLEROSIS,,,043,MULTIPLE SCLEROSIS & OTHER DEMYELINATING DISEASES,01,DISEASES AND DISORDERS OF THE NERVOUS SYSTEM,1,Minor,Minor,Medical,Medicare,Private Health Insurance,,,,true,42106.88,9300.47
New York City,Kings,7002053,001304,NYU Langone Hospital-Brooklyn,30 to 49,112,M,White,Not Span/Hispanic,5,Emergency,Home or Self Care,2019,NVS005,MULTIPLE SCLEROSIS,,,043,MULTIPLE SCLEROSIS & OTHER DEMYELINATING DISEASES,01,DISEASES AND DISORDERS OF THE NERVOUS SYSTEM,2,Moderate,Moderate,Medical,Medicare,Medicaid,,,,true,89489.3,22379.47
New York City,Kings,7002053,001304,NYU Langone Hospital-Brooklyn,50 to 69,112,F,White,Not Span/Hispanic,5,Elective,Home w/ Home Health Services,2019,NVS005,MULTIPLE SCLEROSIS,RHB002,"PHYSICAL, OCCUPATIONAL, AND RESPIRATORY THERAPY TREATMENT",043,MULTIPLE SCLEROSIS & OTHER DEMYELINATING DISEASES,01,DISEASES AND DISORDERS OF THE NERVOUS SYSTEM,2,Moderate,Minor,Medical,Medicare,,,,,false,45471.35,15495.21
New York City,Kings,7002053,001304,NYU Langone Hospital-Brooklyn,50 to 69,112,F,White,Not Span/Hispanic,5,Emergency,Inpatient Rehabilitation Facility,2019,NVS005,MULTIPLE SCLEROSIS,,,043,MULTIPLE SCLEROSIS & OTHER DEMYELINATING DISEASES,01,DISEASES AND DISORDERS OF THE NERVOUS SYSTEM,2,Moderate,Minor,Medical,Medicare,,,,,true,89185.14,19673.57
New York City,Kings,7002053,001304,NYU Langone Hospital-Brooklyn,18 to 29,112,M,Other Race,Not Span/Hispanic,13,Emergency,Inpatient Rehabilitation Facility,2019,NVS005,MULTIPLE SCLEROSIS,CNS002,LUMBAR PUNCTURE,043,MULTIPLE SCLEROSIS & OTHER DEMYELINATING DISEASES,01,DISEASES AND DISORDERS OF THE NERVOUS SYSTEM,2,Moderate,Minor,Medical,Private Health Insurance,,,,,true,221653.07,49529.7
New York City,Kings,7002053,001304,NYU Langone Hospital-Brooklyn,18 to 29,112,M,Other Race,Not Span/Hispanic,9,Elective,Home or Self Care,2019,NVS005,MULTIPLE SCLEROSIS,RHB002,"PHYSICAL, OCCUPATIONAL, AND RESPIRATORY THERAPY TREATMENT",043,MULTIPLE SCLEROSIS & OTHER DEMYELINATING DISEASES,01,DISEASES AND DISORDERS OF THE NERVOUS SYSTEM,1,Minor,Minor,Medical,Private Health Insurance,,,,,false,87203.61,27326.54
New York City,Kings,7002053,001304,NYU Langone Hospital-Brooklyn,18 to 29,112,F,Other Race,Spanish/Hispanic,2,Emergency,Home or Self Care,2019,NVS005,MULTIPLE SCLEROSIS,,,043,MULTIPLE SCLEROSIS & OTHER DEMYELINATING DISEASES,01,DISEASES AND DISORDERS OF THE NERVOUS SYSTEM,2,Moderate,Minor,Medical,Medicaid,,,,,true,81273.9,11765.49
New York City,Kings,7002053,001304,NYU Langone Hospital-Brooklyn,50 to 69,112,M,White,Not Span/Hispanic,5,Emergency,Home w/ Home Health Services,2019,NVS005,MULTIPLE SCLEROSIS,ADM010,VACCINATIONS,043,MULTIPLE SCLEROSIS & OTHER DEMYELINATING DISEASES,01,DISEASES AND DISORDERS OF THE NERVOUS SYSTEM,4,Extreme,Extreme,Medical,Medicare,Private Health Insurance,,,,true,91628.82,22725.02
New York City,Kings,7002053,001304,NYU Langone Hospital-Brooklyn,18 to 29,112,F,Black/African American,Not Span/Hispanic,1,Emergency,Left Against Medical Advice,2019,NVS005,MULTIPLE SCLEROSIS,,,043,MULTIPLE SCLEROSIS & OTHER DEMYELINATING DISEASES,01,DISEASES AND DISORDERS OF THE NERVOUS SYSTEM,1,Minor,Minor,Medical,Medicaid,,,,,true,24312.92,6017.67
New York City,Kings,7002053,001304,NYU Langone Hospital-Brooklyn,30 to 49,112,F,Black/African American,Not Span/Hispanic,2,Emergency,Home or Self Care,2019,NVS005,MULTIPLE SCLEROSIS,CNS002,LUMBAR PUNCTURE,043,MULTIPLE SCLEROSIS & OTHER DEMYELINATING DISEASES,01,DISEASES AND DISORDERS OF THE NERVOUS SYSTEM,1,Minor,Minor,Medical,Blue Cross/Blue Shield,Medicaid,,,,true,78565.12,12892.61
New York City,Kings,7002053,001304,NYU Langone Hospital-Brooklyn,50 to 69,103,F,White,Unknown,8,Emergency,Inpatient Rehabilitation Facility,2019,NVS020,OTHER SPECIFIED NERVOUS SYSTEM DISORDERS,ADM003,ADMINISTRATION OF ALBUMIN AND GLOBULIN,043,MULTIPLE SCLEROSIS & OTHER DEMYELINATING DISEASES,01,DISEASES AND DISORDERS OF THE NERVOUS SYSTEM,3,Major,Major,Medical,Medicaid,,,,,true,236751.77,39356.79
New York City,Kings,7002053,001304,NYU Langone Hospital-Brooklyn,50 to 69,103,F,White,Unknown,5,Elective,Home w/ Home Health Services,2019,NVS015,POLYNEUROPATHIES,RHB002,"PHYSICAL, OCCUPATIONAL, AND RESPIRATORY THERAPY TREATMENT",043,MULTIPLE SCLEROSIS & OTHER DEMYELINATING DISEASES,01,DISEASES AND DISORDERS OF THE NERVOUS SYSTEM,2,Moderate,Minor,Medical,Medicaid,,,,,false,52819.34,15243.62
New York City,Kings,7002053,001304,NYU Langone Hospital-Brooklyn,30 to 49,112,F,Other Race,Not Span/Hispanic,5,Emergency,Home w/ Home Health Services,2019,NVS005,MULTIPLE SCLEROSIS,CNS002,LUMBAR PUNCTURE,043,MULTIPLE SCLEROSIS & OTHER DEMYELINATING DISEASES,01,DISEASES AND DISORDERS OF THE NERVOUS SYSTEM,2,Moderate,Minor,Medical,Medicaid,,,,,true,105637.16,21258.71
New York City,Kings,7002053,001304,NYU Langone Hospital-Brooklyn,50 to 69,112,F,Other Race,Spanish/Hispanic,4,Emergency,Home or Self Care,2019,NVS005,MULTIPLE SCLEROSIS,,,043,MULTIPLE SCLEROSIS & OTHER DEMYELINATING DISEASES,01,DISEASES AND DISORDERS OF THE NERVOUS SYSTEM,2,Moderate,Minor,Medical,Medicare,,,,,true,80327.05,16218.61
New York City,Kings,7002053,001304,NYU Langone Hospital-Brooklyn,50 to 69,112,M,Black/African American,Not Span/Hispanic,21,Elective,Home w/ Home Health Services,2019,NVS015,POLYNEUROPATHIES,RHB002,"PHYSICAL, OCCUPATIONAL, AND RESPIRATORY THERAPY TREATMENT",043,MULTIPLE SCLEROSIS & OTHER DEMYELINATING DISEASES,01,DISEASES AND DISORDERS OF THE NERVOUS SYSTEM,3,Major,Major,Medical,Medicaid,,,,,false,226859.57,67483.07
New York City,Kings,7002053,001304,NYU Langone Hospital-Brooklyn,18 to 29,112,F,Black/African American,Not Span/Hispanic,4,Emergency,Home or Self Care,2019,NVS005,MULTIPLE SCLEROSIS,CNS002,LUMBAR PUNCTURE,043,MULTIPLE SCLEROSIS & OTHER DEMYELINATING DISEASES,01,DISEASES AND DISORDERS OF THE NERVOUS SYSTEM,2,Moderate,Minor,Medical,Medicaid,,,,,true,109433.49,19002.29
New York City,Kings,7002053,001304,NYU Langone Hospital-Brooklyn,50 to 69,112,F,Other Race,Spanish/Hispanic,4,Emergency,Home or Self Care,2019,NVS005,MULTIPLE SCLEROSIS,,,043,MULTIPLE SCLEROSIS & OTHER DEMYELINATING DISEASES,01,DISEASES AND DISORDERS OF THE NERVOUS SYSTEM,2,Moderate,Minor,Medical,Medicare,,,,,true,44838.93,14682.32
New York City,Kings,7002053,001304,NYU Langone Hospital-Brooklyn,50 to 69,112,M,Black/African American,Not Span/Hispanic,6,Emergency,Inpatient Rehabilitation Facility,2019,NVS015,POLYNEUROPATHIES,CNS002,LUMBAR PUNCTURE,043,MULTIPLE SCLEROSIS & OTHER DEMYELINATING DISEASES,01,DISEASES AND DISORDERS OF THE NERVOUS SYSTEM,3,Major,Major,Medical,Medicaid,,,,,true,205541.6,28628.61
New York City,Kings,7002053,001304,NYU Langone Hospital-Brooklyn,30 to 49,112,F,Black/African American,Not Span/Hispanic,4,Emergency,Home or Self Care,2019,NVS005,MULTIPLE SCLEROSIS,,,043,MULTIPLE SCLEROSIS & OTHER DEMYELINATING DISEASES,01,DISEASES AND DISORDERS OF THE NERVOUS SYSTEM,1,Minor,Minor,Medical,Medicaid,,,,,true,86963.24,16301.16
New York City,Kings,7002053,001304,NYU Langone Hospital-Brooklyn,50 to 69,112,F,White,Not Span/Hispanic,4,Emergency,Home or Self Care,2019,NVS005,MULTIPLE SCLEROSIS,,,043,MULTIPLE SCLEROSIS & OTHER DEMYELINATING DISEASES,01,DISEASES AND DISORDERS OF THE NERVOUS SYSTEM,2,Moderate,Minor,Medical,Medicaid,,,,,true,52743.86,14709.72
New York City,Kings,7002053,001304,NYU Langone Hospital-Brooklyn,18 to 29,112,M,White,Not Span/Hispanic,4,Emergency,Home or Self Care,2019,NVS005,MULTIPLE SCLEROSIS,CNS002,LUMBAR PUNCTURE,043,MULTIPLE SCLEROSIS & OTHER DEMYELINATING DISEASES,01,DISEASES AND DISORDERS OF THE NERVOUS SYSTEM,1,Minor,Minor,Medical,Medicaid,,,,,true,80348.23,16345.82
New York City,Kings,7002053,001304,NYU Langone Hospital-Brooklyn,50 to 69,112,F,White,Not Span/Hispanic,4,Emergency,Home or Self Care,2019,NVS005,MULTIPLE SCLEROSIS,,,043,MULTIPLE SCLEROSIS & OTHER DEMYELINATING DISEASES,01,DISEASES AND DISORDERS OF THE NERVOUS SYSTEM,1,Minor,Minor,Medical,Medicaid,,,,,true,45807.24,14450.22
New York City,Kings,7002053,001304,NYU Langone Hospital-Brooklyn,50 to 69,112,F,Other Race,Spanish/Hispanic,2,Emergency,Home w/ Home Health Services,2019,NVS005,MULTIPLE SCLEROSIS,ADM016,ADMINISTRATION OF ANTI-INFLAMMATORY AGENTS,043,MULTIPLE SCLEROSIS & OTHER DEMYELINATING DISEASES,01,DISEASES AND DISORDERS OF THE NERVOUS SYSTEM,2,Moderate,Minor,Medical,Medicare,,,,,true,32515.64,8284.24
