Hospital Service Area,Hospital County,Operating Certificate Number,Permanent Facility Id,Facility Name,Age Group,Zip Code - 3 digits,Gender,Race,Ethnicity,Length of Stay,Type of Admission,Patient Disposition,Discharge Year,CCS Diagnosis Code,CCS Diagnosis Description,CCS Procedure Code,CCS Procedure Description,APR DRG Code,APR DRG Description,APR MDC Code,APR MDC Description,APR Severity of Illness Code,APR Severity of Illness Description,APR Risk of Mortality,APR Medical Surgical Description,Payment Typology 1,Payment Typology 2,Payment Typology 3,Birth Weight,Abortion Edit Indicator,Emergency Department Indicator,Total Charges,Total Costs
Long Island,Nassau,2908000,000511,NYU Langone Hospital-Long Island,18 to 29,110,F,White,Not Span/Hispanic,3,Emergency,Home or Self Care,2019,NVS005,MULTIPLE SCLEROSIS,CNS002,LUMBAR PUNCTURE,043,MULTIPLE SCLEROSIS & OTHER DEMYELINATING DISEASES,01,DISEASES AND DISORDERS OF THE NERVOUS SYSTEM,2,Moderate,Minor,Medical,Blue Cross/Blue Shield,,,,,true,127090.01,12493.28
Long Island,Nassau,2908000,000511,NYU Langone Hospital-Long Island,50 to 69,115,F,Other Race,Spanish/Hispanic,6,Emergency,Home or Self Care,2019,NVS005,MULTIPLE SCLEROSIS,CNS002,LUMBAR PUNCTURE,043,MULTIPLE SCLEROSIS & OTHER DEMYELINATING DISEASES,01,DISEASES AND DISORDERS OF THE NERVOUS SYSTEM,2,Moderate,Minor,Medical,Medicare,Medicaid,Medicare,,,true,141144.85,18009.3
Long Island,Nassau,2908000,000511,NYU Langone Hospital-Long Island,30 to 49,115,F,Other Race,Spanish/Hispanic,2,Emergency,Home w/ Home Health Services,2019,NVS005,MULTIPLE SCLEROSIS,,,043,MULTIPLE SCLEROSIS & OTHER DEMYELINATING DISEASES,01,DISEASES AND DISORDERS OF THE NERVOUS SYSTEM,1,Minor,Minor,Medical,Medicaid,,,,,true,54494.94,5843.9
Long Island,Nassau,2908000,000511,NYU Langone Hospital-Long Island,0 to 17,115,M,Other Race,Spanish/Hispanic,6,Emergency,Home or Self Care,2019,NVS005,MULTIPLE SCLEROSIS,ADM003,ADMINISTRATION OF ALBUMIN AND GLOBULIN,043,MULTIPLE SCLEROSIS & OTHER DEMYELINATING DISEASES,01,DISEASES AND DISORDERS OF THE NERVOUS SYSTEM,2,Moderate,Minor,Medical,Medicaid,Medicaid,,,,true,191427.89,26792.01
Long Island,Nassau,2908000,000511,NYU Langone Hospital-Long Island,30 to 49,110,F,White,Not Span/Hispanic,4,Emergency,Home or Self Care,2019,NVS005,MULTIPLE SCLEROSIS,CNS002,LUMBAR PUNCTURE,043,MULTIPLE SCLEROSIS & OTHER DEMYELINATING DISEASES,01,DISEASES AND DISORDERS OF THE NERVOUS SYSTEM,2,Moderate,Minor,Medical,Blue Cross/Blue Shield,,,,,true,105920.34,13004.96
Long Island,Nassau,2908000,000511,NYU Langone Hospital-Long Island,18 to 29,117,F,White,Spanish/Hispanic,5,Emergency,Home or Self Care,2019,NVS005,MULTIPLE SCLEROSIS,,,043,MULTIPLE SCLEROSIS & OTHER DEMYELINATING DISEASES,01,DISEASES AND DISORDERS OF THE NERVOUS SYSTEM,2,Moderate,Minor,Medical,Private Health Insurance,,,,,true,72108.33,10782.54
Long Island,Nassau,2908000,000511,NYU Langone Hospital-Long Island,0 to 17,115,F,White,Spanish/Hispanic,6,Emergency,Home w/ Home Health Services,2019,NVS005,MULTIPLE SCLEROSIS,CNS002,LUMBAR PUNCTURE,043,MULTIPLE SCLEROSIS & OTHER DEMYELINATING DISEASES,01,DISEASES AND DISORDERS OF THE NERVOUS SYSTEM,1,Minor,Minor,Medical,Medicaid,Medicaid,,,,true,111005.08,15496.98
Long Island,Nassau,2908000,000511,NYU Langone Hospital-Long Island,30 to 49,115,M,White,Not Span/Hispanic,1,Elective,Home or Self Care,2019,NVS005,MULTIPLE SCLEROSIS,,,043,MULTIPLE SCLEROSIS & OTHER DEMYELINATING DISEASES,01,DISEASES AND DISORDERS OF THE NERVOUS SYSTEM,1,Minor,Minor,Medical,Private Health Insurance,,,,,false,835488.78,104097.05
Long Island,Nassau,2908000,000511,NYU Langone Hospital-Long Island,30 to 49,118,F,White,Not Span/Hispanic,13,Emergency,Home or Self Care,2019,NVS020,OTHER SPECIFIED NERVOUS SYSTEM DISORDERS,CAR024,VENOUS AND ARTERIAL CATHETER PLACEMENT,043,MULTIPLE SCLEROSIS & OTHER DEMYELINATING DISEASES,01,DISEASES AND DISORDERS OF THE NERVOUS SYSTEM,3,Major,Minor,Medical,Private Health Insurance,,,,,true,293460.09,45856.86
Long Island,Nassau,2908000,000511,NYU Langone Hospital-Long Island,30 to 49,115,M,Other Race,Spanish/Hispanic,5,Emergency,Home or Self Care,2019,NVS005,MULTIPLE SCLEROSIS,CNS002,LUMBAR PUNCTURE,043,MULTIPLE SCLEROSIS & OTHER DEMYELINATING DISEASES,01,DISEASES AND DISORDERS OF THE NERVOUS SYSTEM,1,Minor,Minor,Medical,Private Health Insurance,,,,,true,87484.23,13728.83
Long Island,Nassau,2908000,000511,NYU Langone Hospital-Long Island,50 to 69,115,F,Black/African American,Not Span/Hispanic,7,Emergency,Home w/ Home Health Services,2019,NVS005,MULTIPLE SCLEROSIS,,,043,MULTIPLE SCLEROSIS & OTHER DEMYELINATING DISEASES,01,DISEASES AND DISORDERS OF THE NERVOUS SYSTEM,1,Minor,Minor,Medical,Self-Pay,,,,,true,120862.22,17867.43
Long Island,Nassau,2908000,000511,NYU Langone Hospital-Long Island,18 to 29,115,F,Other Race,Spanish/Hispanic,5,Emergency,Home or Self Care,2019,NVS020,OTHER SPECIFIED NERVOUS SYSTEM DISORDERS,CNS002,LUMBAR PUNCTURE,043,MULTIPLE SCLEROSIS & OTHER DEMYELINATING DISEASES,01,DISEASES AND DISORDERS OF THE NERVOUS SYSTEM,1,Minor,Minor,Medical,Private Health Insurance,,,,,true,127867.07,15327.16
Long Island,Nassau,2908000,000511,NYU Langone Hospital-Long Island,30 to 49,114,M,White,Not Span/Hispanic,3,Emergency,Home or Self Care,2019,NVS005,MULTIPLE SCLEROSIS,,,043,MULTIPLE SCLEROSIS & OTHER DEMYELINATING DISEASES,01,DISEASES AND DISORDERS OF THE NERVOUS SYSTEM,1,Minor,Minor,Medical,Private Health Insurance,,,,,true,53181.85,7920.58
Long Island,Nassau,2908000,000511,NYU Langone Hospital-Long Island,30 to 49,114,M,White,Not Span/Hispanic,2,Emergency,Home or Self Care,2019,NVS005,MULTIPLE SCLEROSIS,,,043,MULTIPLE SCLEROSIS & OTHER DEMYELINATING DISEASES,01,DISEASES AND DISORDERS OF THE NERVOUS SYSTEM,1,Minor,Minor,Medical,Private Health Insurance,,,,,true,27369.4,5036.6
Long Island,Nassau,2908000,000511,NYU Langone Hospital-Long Island,50 to 69,115,M,White,Not Span/Hispanic,2,Emergency,Home or Self Care,2019,NVS005,MULTIPLE SCLEROSIS,,,043,MULTIPLE SCLEROSIS & OTHER DEMYELINATING DISEASES,01,DISEASES AND DISORDERS OF THE NERVOUS SYSTEM,2,Moderate,Minor,Medical,Medicare,Medicare,Medicaid,,,true,22401.68,4602.31
Long Island,Nassau,2908000,000511,NYU Langone Hospital-Long Island,50 to 69,117,M,White,Not Span/Hispanic,4,Emergency,Skilled Nursing Home,2019,NVS005,MULTIPLE SCLEROSIS,IMG005,MAGNETIC RESONANCE IMAGING (MRI),043,MULTIPLE SCLEROSIS & OTHER DEMYELINATING DISEASES,01,DISEASES AND DISORDERS OF THE NERVOUS SYSTEM,1,Minor,Minor,Medical,Medicare,Medicare,Medicaid,,,true,89128.33,10554.39
Long Island,Nassau,2908000,000511,NYU Langone Hospital-Long Island,50 to 69,117,M,White,Not Span/Hispanic,1,Urgent,Home or Self Care,2019,NVS005,MULTIPLE SCLEROSIS,MST028,"SUBCUTANEOUS TISSUE AND FASCIA PROCEDURES, NEC",043,MULTIPLE SCLEROSIS & OTHER DEMYELINATING DISEASES,01,DISEASES AND DISORDERS OF THE NERVOUS SYSTEM,1,Minor,Minor,Medical,Medicare,Medicare,Private Health Insurance,,,false,183004.73,29611.38
Long Island,Nassau,2908000,000511,NYU Langone Hospital-Long Island,50 to 69,115,F,White,Not Span/Hispanic,7,Emergency,Home w/ Home Health Services,2019,NVS005,MULTIPLE SCLEROSIS,,,043,MULTIPLE SCLEROSIS & OTHER DEMYELINATING DISEASES,01,DISEASES AND DISORDERS OF THE NERVOUS SYSTEM,2,Moderate,Minor,Medical,Blue Cross/Blue Shield,,,,,true,107190.12,16463.27
Long Island,Nassau,2908000,000511,NYU Langone Hospital-Long Island,30 to 49,117,F,White,Not Span/Hispanic,3,Emergency,Home or Self Care,2019,NVS005,MULTIPLE SCLEROSIS,,,043,MULTIPLE SCLEROSIS & OTHER DEMYELINATING DISEASES,01,DISEASES AND DISORDERS OF THE NERVOUS SYSTEM,2,Moderate,Minor,Medical,Medicare,Medicare,,,,true,38722.6,7650.66
Long Island,Nassau,2908000,000511,NYU Langone Hospital-Long Island,0 to 17,115,F,White,Spanish/Hispanic,5,Emergency,Home or Self Care,2019,NVS005,MULTIPLE SCLEROSIS,,,043,MULTIPLE SCLEROSIS & OTHER DEMYELINATING DISEASES,01,DISEASES AND DISORDERS OF THE NERVOUS SYSTEM,1,Minor,Minor,Medical,Medicaid,Medicaid,,,,true,55516.15,10366.52
Long Island,Nassau,2908000,000511,NYU Langone Hospital-Long Island,50 to 69,117,F,White,Not Span/Hispanic,4,Emergency,Inpatient Rehabilitation Facility,2019,NVS005,MULTIPLE SCLEROSIS,,,043,MULTIPLE SCLEROSIS & OTHER DEMYELINATING DISEASES,01,DISEASES AND DISORDERS OF THE NERVOUS SYSTEM,2,Moderate,Minor,Medical,Medicare,Private Health Insurance,,,,true,92613.17,11606.98
Long Island,Nassau,2908000,000511,NYU Langone Hospital-Long Island,30 to 49,110,F,White,Not Span/Hispanic,1,Emergency,Home or Self Care,2019,NVS005,MULTIPLE SCLEROSIS,,,043,MULTIPLE SCLEROSIS & OTHER DEMYELINATING DISEASES,01,DISEASES AND DISORDERS OF THE NERVOUS SYSTEM,1,Minor,Minor,Medical,Medicare,Medicare,,,,true,50639.34,3918.57
Long Island,Nassau,2908000,000511,NYU Langone Hospital-Long Island,30 to 49,114,F,Black/African American,Not Span/Hispanic,4,Emergency,Home or Self Care,2019,NVS005,MULTIPLE SCLEROSIS,CNS002,LUMBAR PUNCTURE,043,MULTIPLE SCLEROSIS & OTHER DEMYELINATING DISEASES,01,DISEASES AND DISORDERS OF THE NERVOUS SYSTEM,2,Moderate,Moderate,Medical,Private Health Insurance,,,,,true,163954.18,16730.16
Long Island,Nassau,2908000,000511,NYU Langone Hospital-Long Island,50 to 69,115,F,Black/African American,Not Span/Hispanic,3,Emergency,Home or Self Care,2019,NVS020,OTHER SPECIFIED NERVOUS SYSTEM DISORDERS,,,043,MULTIPLE SCLEROSIS & OTHER DEMYELINATING DISEASES,01,DISEASES AND DISORDERS OF THE NERVOUS SYSTEM,1,Minor,Minor,Medical,Private Health Insurance,,,,,true,142051.91,19227.07
Long Island,Nassau,2908000,000511,NYU Langone Hospital-Long Island,50 to 69,115,F,White,Not Span/Hispanic,1,Elective,Home or Self Care,2019,NVS005,MULTIPLE SCLEROSIS,,,043,MULTIPLE SCLEROSIS & OTHER DEMYELINATING DISEASES,01,DISEASES AND DISORDERS OF THE NERVOUS SYSTEM,1,Minor,Minor,Medical,Medicare,Medicare,Blue Cross/Blue Shield,,,false,835393.5,104085.33
Long Island,Nassau,2908000,000511,NYU Langone Hospital-Long Island,30 to 49,118,F,White,Not Span/Hispanic,6,Emergency,Home or Self Care,2019,NVS005,MULTIPLE SCLEROSIS,CNS001,MINIMALLY INVASIVE CNS BIOPSY,043,MULTIPLE SCLEROSIS & OTHER DEMYELINATING DISEASES,01,DISEASES AND DISORDERS OF THE NERVOUS SYSTEM,2,Moderate,Minor,Medical,Private Health Insurance,,,,,true,136225.28,16915.74
Long Island,Nassau,2908000,000511,NYU Langone Hospital-Long Island,30 to 49,117,M,White,Not Span/Hispanic,1,Urgent,Home or Self Care,2019,NVS005,MULTIPLE SCLEROSIS,MST028,"SUBCUTANEOUS TISSUE AND FASCIA PROCEDURES, NEC",043,MULTIPLE SCLEROSIS & OTHER DEMYELINATING DISEASES,01,DISEASES AND DISORDERS OF THE NERVOUS SYSTEM,1,Minor,Minor,Medical,Blue Cross/Blue Shield,,,,,false,172714.05,28144.11
Long Island,Nassau,2908000,000511,NYU Langone Hospital-Long Island,18 to 29,115,M,Black/African American,Not Span/Hispanic,3,Emergency,Home or Self Care,2019,NVS005,MULTIPLE SCLEROSIS,,,043,MULTIPLE SCLEROSIS & OTHER DEMYELINATING DISEASES,01,DISEASES AND DISORDERS OF THE NERVOUS SYSTEM,1,Minor,Minor,Medical,Medicaid,Medicaid,,,,true,59303.98,7490.93
Long Island,Nassau,2908000,000511,NYU Langone Hospital-Long Island,18 to 29,115,F,Other Race,Not Span/Hispanic,3,Emergency,Home or Self Care,2019,NVS005,MULTIPLE SCLEROSIS,IMG005,MAGNETIC RESONANCE IMAGING (MRI),043,MULTIPLE SCLEROSIS & OTHER DEMYELINATING DISEASES,01,DISEASES AND DISORDERS OF THE NERVOUS SYSTEM,2,Moderate,Minor,Medical,Blue Cross/Blue Shield,,,,,true,77183.69,8130.91
Long Island,Nassau,2908000,000511,NYU Langone Hospital-Long Island,30 to 49,110,M,White,Not Span/Hispanic,1,Emergency,Left Against Medical Advice,2019,NVS020,OTHER SPECIFIED NERVOUS SYSTEM DISORDERS,,,043,MULTIPLE SCLEROSIS & OTHER DEMYELINATING DISEASES,01,DISEASES AND DISORDERS OF THE NERVOUS SYSTEM,2,Moderate,Minor,Medical,Medicare,Medicare,,,,true,47447.87,4213.44
Long Island,Nassau,2908000,000511,NYU Langone Hospital-Long Island,30 to 49,116,F,Black/African American,Not Span/Hispanic,15,Emergency,Home w/ Home Health Services,2019,NVS020,OTHER SPECIFIED NERVOUS SYSTEM DISORDERS,CAR024,VENOUS AND ARTERIAL CATHETER PLACEMENT,043,MULTIPLE SCLEROSIS & OTHER DEMYELINATING DISEASES,01,DISEASES AND DISORDERS OF THE NERVOUS SYSTEM,2,Moderate,Moderate,Medical,Private Health Insurance,,,,,true,331865.49,52236.81
Long Island,Nassau,2908000,000511,NYU Langone Hospital-Long Island,30 to 49,116,F,Black/African American,Not Span/Hispanic,5,Emergency,Home or Self Care,2019,NVS020,OTHER SPECIFIED NERVOUS SYSTEM DISORDERS,,,043,MULTIPLE SCLEROSIS & OTHER DEMYELINATING DISEASES,01,DISEASES AND DISORDERS OF THE NERVOUS SYSTEM,1,Minor,Minor,Medical,Private Health Insurance,,,,,true,196919.57,26395.2
Long Island,Nassau,2908000,000511,NYU Langone Hospital-Long Island,30 to 49,117,F,White,Not Span/Hispanic,12,Emergency,Home w/ Home Health Services,2019,NVS005,MULTIPLE SCLEROSIS,CAR024,VENOUS AND ARTERIAL CATHETER PLACEMENT,043,MULTIPLE SCLEROSIS & OTHER DEMYELINATING DISEASES,01,DISEASES AND DISORDERS OF THE NERVOUS SYSTEM,2,Moderate,Minor,Medical,Medicare,Medicare,Medicaid,,,true,150008.86,29431.22
Long Island,Nassau,2908000,000511,NYU Langone Hospital-Long Island,18 to 29,117,F,Other Race,Not Span/Hispanic,4,Emergency,Home or Self Care,2019,NVS020,OTHER SPECIFIED NERVOUS SYSTEM DISORDERS,CNS002,LUMBAR PUNCTURE,043,MULTIPLE SCLEROSIS & OTHER DEMYELINATING DISEASES,01,DISEASES AND DISORDERS OF THE NERVOUS SYSTEM,1,Minor,Minor,Medical,Blue Cross/Blue Shield,Blue Cross/Blue Shield,,,,true,99320.53,12029.42
Long Island,Nassau,2908000,000511,NYU Langone Hospital-Long Island,30 to 49,OOS,F,Black/African American,Not Span/Hispanic,6,Emergency,Home or Self Care,2019,NVS015,POLYNEUROPATHIES,CNS002,LUMBAR PUNCTURE,043,MULTIPLE SCLEROSIS & OTHER DEMYELINATING DISEASES,01,DISEASES AND DISORDERS OF THE NERVOUS SYSTEM,1,Minor,Minor,Medical,Medicaid,Medicaid,,,,true,250514.72,32868.88
Long Island,Nassau,2908000,000511,NYU Langone Hospital-Long Island,50 to 69,117,F,White,Not Span/Hispanic,5,Emergency,Home w/ Home Health Services,2019,NVS005,MULTIPLE SCLEROSIS,,,043,MULTIPLE SCLEROSIS & OTHER DEMYELINATING DISEASES,01,DISEASES AND DISORDERS OF THE NERVOUS SYSTEM,2,Moderate,Minor,Medical,Medicare,Medicare,,,,true,46667.81,10471.15
Long Island,Nassau,2908000,000511,NYU Langone Hospital-Long Island,70 or Older,115,M,White,Not Span/Hispanic,5,Emergency,Inpatient Rehabilitation Facility,2019,NVS005,MULTIPLE SCLEROSIS,,,043,MULTIPLE SCLEROSIS & OTHER DEMYELINATING DISEASES,01,DISEASES AND DISORDERS OF THE NERVOUS SYSTEM,2,Moderate,Minor,Medical,Medicare,Medicare,Blue Cross/Blue Shield,,,true,126827.61,14491.01
Long Island,Nassau,2908000,000511,NYU Langone Hospital-Long Island,50 to 69,117,F,White,Not Span/Hispanic,4,Emergency,Skilled Nursing Home,2019,NVS005,MULTIPLE SCLEROSIS,ADM012,CHEMOTHERAPY,043,MULTIPLE SCLEROSIS & OTHER DEMYELINATING DISEASES,01,DISEASES AND DISORDERS OF THE NERVOUS SYSTEM,1,Minor,Minor,Medical,Blue Cross/Blue Shield,,,,,true,82718.27,11371.6
Long Island,Nassau,2908000,000511,NYU Langone Hospital-Long Island,18 to 29,117,M,Black/African American,Not Span/Hispanic,4,Emergency,Home or Self Care,2019,NVS005,MULTIPLE SCLEROSIS,,,043,MULTIPLE SCLEROSIS & OTHER DEMYELINATING DISEASES,01,DISEASES AND DISORDERS OF THE NERVOUS SYSTEM,2,Moderate,Minor,Medical,Blue Cross/Blue Shield,,,,,true,56643.73,8937.71
Long Island,Nassau,2908000,000511,NYU Langone Hospital-Long Island,18 to 29,115,M,White,Spanish/Hispanic,5,Emergency,Home or Self Care,2019,NVS005,MULTIPLE SCLEROSIS,CNS002,LUMBAR PUNCTURE,043,MULTIPLE SCLEROSIS & OTHER DEMYELINATING DISEASES,01,DISEASES AND DISORDERS OF THE NERVOUS SYSTEM,1,Minor,Minor,Medical,Medicaid,,,,,true,131178.74,15658.9
Long Island,Nassau,2908000,000511,NYU Langone Hospital-Long Island,70 or Older,115,M,White,Not Span/Hispanic,6,Emergency,Skilled Nursing Home,2019,NVS005,MULTIPLE SCLEROSIS,MAM011,ELECTROENCEPHALOGRAM (EEG),043,MULTIPLE SCLEROSIS & OTHER DEMYELINATING DISEASES,01,DISEASES AND DISORDERS OF THE NERVOUS SYSTEM,2,Moderate,Minor,Medical,Medicare,Medicare,Private Health Insurance,,,true,98295.06,13702.23
Long Island,Nassau,2908000,000511,NYU Langone Hospital-Long Island,50 to 69,117,F,White,Spanish/Hispanic,1,Emergency,Home or Self Care,2019,NVS005,MULTIPLE SCLEROSIS,,,043,MULTIPLE SCLEROSIS & OTHER DEMYELINATING DISEASES,01,DISEASES AND DISORDERS OF THE NERVOUS SYSTEM,1,Minor,Minor,Medical,Blue Cross/Blue Shield,,,,,true,46916.81,3964.86
Long Island,Nassau,2908000,000511,NYU Langone Hospital-Long Island,30 to 49,117,M,White,Not Span/Hispanic,1,Emergency,Home or Self Care,2019,NVS005,MULTIPLE SCLEROSIS,,,043,MULTIPLE SCLEROSIS & OTHER DEMYELINATING DISEASES,01,DISEASES AND DISORDERS OF THE NERVOUS SYSTEM,2,Moderate,Minor,Medical,Private Health Insurance,,,,,true,14109.88,2585
Long Island,Nassau,2908000,000511,NYU Langone Hospital-Long Island,30 to 49,115,F,Black/African American,Not Span/Hispanic,5,Emergency,Home or Self Care,2019,NVS005,MULTIPLE SCLEROSIS,,,043,MULTIPLE SCLEROSIS & OTHER DEMYELINATING DISEASES,01,DISEASES AND DISORDERS OF THE NERVOUS SYSTEM,1,Minor,Minor,Medical,Private Health Insurance,,,,,true,83533.93,13114.72
Long Island,Nassau,2908000,000511,NYU Langone Hospital-Long Island,50 to 69,117,F,White,Not Span/Hispanic,6,Emergency,Home or Self Care,2019,NVS005,MULTIPLE SCLEROSIS,CNS002,LUMBAR PUNCTURE,043,MULTIPLE SCLEROSIS & OTHER DEMYELINATING DISEASES,01,DISEASES AND DISORDERS OF THE NERVOUS SYSTEM,2,Moderate,Minor,Medical,Medicare,,,,,true,127091.67,17089.77
Long Island,Nassau,2908000,000511,NYU Langone Hospital-Long Island,50 to 69,117,F,White,Not Span/Hispanic,2,Emergency,Home w/ Home Health Services,2019,NVS005,MULTIPLE SCLEROSIS,,,043,MULTIPLE SCLEROSIS & OTHER DEMYELINATING DISEASES,01,DISEASES AND DISORDERS OF THE NERVOUS SYSTEM,1,Minor,Minor,Medical,Blue Cross/Blue Shield,,,,,true,57422.65,6409.23
Long Island,Nassau,2908000,000511,NYU Langone Hospital-Long Island,70 or Older,115,F,Black/African American,Not Span/Hispanic,8,Emergency,Inpatient Rehabilitation Facility,2019,NVS005,MULTIPLE SCLEROSIS,,,043,MULTIPLE SCLEROSIS & OTHER DEMYELINATING DISEASES,01,DISEASES AND DISORDERS OF THE NERVOUS SYSTEM,1,Minor,Minor,Medical,Medicaid,,,,,true,82272.43,17337.48
Long Island,Nassau,2908000,000511,NYU Langone Hospital-Long Island,70 or Older,110,F,White,Not Span/Hispanic,4,Emergency,Skilled Nursing Home,2019,NVS020,OTHER SPECIFIED NERVOUS SYSTEM DISORDERS,,,043,MULTIPLE SCLEROSIS & OTHER DEMYELINATING DISEASES,01,DISEASES AND DISORDERS OF THE NERVOUS SYSTEM,2,Moderate,Moderate,Medical,Medicare,Medicare,,,,true,55180.94,10412.64
Long Island,Nassau,2908000,000511,NYU Langone Hospital-Long Island,50 to 69,117,F,White,Not Span/Hispanic,1,Emergency,Home or Self Care,2019,NVS005,MULTIPLE SCLEROSIS,,,043,MULTIPLE SCLEROSIS & OTHER DEMYELINATING DISEASES,01,DISEASES AND DISORDERS OF THE NERVOUS SYSTEM,1,Minor,Minor,Medical,Private Health Insurance,,,,,true,62359.1,4752.39
Long Island,Nassau,2908000,000511,NYU Langone Hospital-Long Island,18 to 29,115,M,Other Race,Spanish/Hispanic,4,Emergency,Home or Self Care,2019,NVS005,MULTIPLE SCLEROSIS,,,043,MULTIPLE SCLEROSIS & OTHER DEMYELINATING DISEASES,01,DISEASES AND DISORDERS OF THE NERVOUS SYSTEM,1,Minor,Minor,Medical,Medicaid,,,,,true,93718.92,11726.43
Long Island,Nassau,2908000,000511,NYU Langone Hospital-Long Island,18 to 29,115,F,White,Spanish/Hispanic,5,Emergency,Home or Self Care,2019,NVS005,MULTIPLE SCLEROSIS,ADM010,VACCINATIONS,043,MULTIPLE SCLEROSIS & OTHER DEMYELINATING DISEASES,01,DISEASES AND DISORDERS OF THE NERVOUS SYSTEM,1,Minor,Minor,Medical,Medicaid,,,,,true,73950.41,11970.81
