Hospital Service Area,Hospital County,Operating Certificate Number,Permanent Facility Id,Facility Name,Age Group,Zip Code - 3 digits,Gender,Race,Ethnicity,Length of Stay,Type of Admission,Patient Disposition,Discharge Year,CCS Diagnosis Code,CCS Diagnosis Description,CCS Procedure Code,CCS Procedure Description,APR DRG Code,APR DRG Description,APR MDC Code,APR MDC Description,APR Severity of Illness Code,APR Severity of Illness Description,APR Risk of Mortality,APR Medical Surgical Description,Payment Typology 1,Payment Typology 2,Payment Typology 3,Birth Weight,Abortion Edit Indicator,Emergency Department Indicator,Total Charges,Total Costs
New York City,Bronx,7000006,001169,Montefiore Medical Center - Henry & Lucy Moses Div,30 to 49,104,F,Black/African American,Not Span/Hispanic,11,Emergency,Inpatient Rehabilitation Facility,2020,NVS015,POLYNEUROPATHIES,EST001,PHERESIS THERAPY,043,MULTIPLE SCLEROSIS & OTHER DEMYELINATING DISEASES,01,DISEASES AND DISORDERS OF THE NERVOUS SYSTEM,2,Moderate,Minor,Medical,Private Health Insurance,Private Health Insurance,,,,N,153860.09,38885.62
New York City,Bronx,7000006,003058,Montefiore Med Center - Jack D Weiler Hosp of A Einstein College Div,30 to 49,104,F,White,Not Span/Hispanic,1,Emergency,Home or Self Care,2020,NVS020,OTHER SPECIFIED NERVOUS SYSTEM DISORDERS,,,043,MULTIPLE SCLEROSIS & OTHER DEMYELINATING DISEASES,01,DISEASES AND DISORDERS OF THE NERVOUS SYSTEM,1,Minor,Minor,Medical,Medicaid,,,,,Y,26791.34,3265.42
New York City,Bronx,7000006,001169,Montefiore Medical Center - Henry & Lucy Moses Div,30 to 49,104,M,Other Race,Spanish/Hispanic,2,Emergency,Left Against Medical Advice,2020,NVS005,MULTIPLE SCLEROSIS,,,043,MULTIPLE SCLEROSIS & OTHER DEMYELINATING DISEASES,01,DISEASES AND DISORDERS OF THE NERVOUS SYSTEM,2,Moderate,Minor,Medical,Medicaid,,,,,Y,27114.25,5194.16
New York City,Bronx,7000006,003058,Montefiore Med Center - Jack D Weiler Hosp of A Einstein College Div,50 to 69,104,F,Black/African American,Not Span/Hispanic,2,Emergency,Home or Self Care,2020,NVS015,POLYNEUROPATHIES,,,043,MULTIPLE SCLEROSIS & OTHER DEMYELINATING DISEASES,01,DISEASES AND DISORDERS OF THE NERVOUS SYSTEM,2,Moderate,Minor,Medical,Medicare,,,,,Y,66927.56,8651.67
New York City,Bronx,7000006,001168,Montefiore Medical Center-Wakefield Hospital,30 to 49,104,M,Other Race,Spanish/Hispanic,4,Emergency,Left Against Medical Advice,2020,NVS005,MULTIPLE SCLEROSIS,IMG005,MAGNETIC RESONANCE IMAGING (MRI),043,MULTIPLE SCLEROSIS & OTHER DEMYELINATING DISEASES,01,DISEASES AND DISORDERS OF THE NERVOUS SYSTEM,2,Moderate,Minor,Medical,Private Health Insurance,,,,,Y,63246.44,9912.64
New York City,Bronx,7000006,001169,Montefiore Medical Center - Henry & Lucy Moses Div,50 to 69,107,F,White,Not Span/Hispanic,14,Emergency,Inpatient Rehabilitation Facility,2020,NVS005,MULTIPLE SCLEROSIS,MAM011,ELECTROENCEPHALOGRAM (EEG),043,MULTIPLE SCLEROSIS & OTHER DEMYELINATING DISEASES,01,DISEASES AND DISORDERS OF THE NERVOUS SYSTEM,4,Extreme,Major,Medical,Medicare,Private Health Insurance,,,,N,210188.9,35195.5
New York City,Bronx,7000006,003058,Montefiore Med Center - Jack D Weiler Hosp of A Einstein College Div,30 to 49,104,M,Black/African American,Not Span/Hispanic,4,Emergency,Home or Self Care,2020,NVS005,MULTIPLE SCLEROSIS,,,043,MULTIPLE SCLEROSIS & OTHER DEMYELINATING DISEASES,01,DISEASES AND DISORDERS OF THE NERVOUS SYSTEM,1,Minor,Minor,Medical,Private Health Insurance,,,,,Y,66489.9,10077.76
New York City,Bronx,7000006,001169,Montefiore Medical Center - Henry & Lucy Moses Div,30 to 49,104,M,Other Race,Spanish/Hispanic,5,Emergency,Left Against Medical Advice,2020,NVS005,MULTIPLE SCLEROSIS,,,043,MULTIPLE SCLEROSIS & OTHER DEMYELINATING DISEASES,01,DISEASES AND DISORDERS OF THE NERVOUS SYSTEM,2,Moderate,Minor,Medical,Medicaid,,,,,Y,76718.09,11329.64
New York City,Manhattan,7002032,001466,Mount Sinai West,70 or Older,100,F,Black/African American,Not Span/Hispanic,5,Emergency,Skilled Nursing Home,2020,NVS005,MULTIPLE SCLEROSIS,ADM017,ADMINISTRATION OF NUTRITIONAL AND ELECTROLYTIC SUBSTANCES,043,MULTIPLE SCLEROSIS & OTHER DEMYELINATING DISEASES,01,DISEASES AND DISORDERS OF THE NERVOUS SYSTEM,2,Moderate,Minor,Medical,Medicare,Medicare,Self-Pay,,,Y,67760.92,14269.12
New York City,Bronx,7000006,001169,Montefiore Medical Center - Henry & Lucy Moses Div,30 to 49,104,M,Other Race,Spanish/Hispanic,3,Emergency,Home or Self Care,2020,NVS020,OTHER SPECIFIED NERVOUS SYSTEM DISORDERS,CNS002,LUMBAR PUNCTURE,043,MULTIPLE SCLEROSIS & OTHER DEMYELINATING DISEASES,01,DISEASES AND DISORDERS OF THE NERVOUS SYSTEM,2,Moderate,Minor,Medical,Medicaid,,,,,Y,56569.76,6744.88
New York City,Bronx,7000006,001169,Montefiore Medical Center - Henry & Lucy Moses Div,50 to 69,104,F,Other Race,Spanish/Hispanic,28,Emergency,Home w/ Home Health Services,2020,NVS005,MULTIPLE SCLEROSIS,GIS017,GASTROSTOMY,043,MULTIPLE SCLEROSIS & OTHER DEMYELINATING DISEASES,01,DISEASES AND DISORDERS OF THE NERVOUS SYSTEM,4,Extreme,Extreme,Medical,Medicare,Private Health Insurance,Medicaid,,,Y,323725.15,64654.66
New York City,Bronx,7000006,003058,Montefiore Med Center - Jack D Weiler Hosp of A Einstein College Div,50 to 69,104,M,White,Not Span/Hispanic,22,Emergency,Home w/ Home Health Services,2020,NVS005,MULTIPLE SCLEROSIS,IMG007,COMPUTERIZED TOMOGRAPHY (CT) WITHOUT CONTRAST,043,MULTIPLE SCLEROSIS & OTHER DEMYELINATING DISEASES,01,DISEASES AND DISORDERS OF THE NERVOUS SYSTEM,2,Moderate,Moderate,Medical,Medicaid,,,,,Y,179113.96,34492.8
Long Island,Nassau,2908000,000511,NYU Langone Hospital-Long Island,30 to 49,118,M,White,Not Span/Hispanic,2,Emergency,Home or Self Care,2020,NVS005,MULTIPLE SCLEROSIS,CNS002,LUMBAR PUNCTURE,043,MULTIPLE SCLEROSIS & OTHER DEMYELINATING DISEASES,01,DISEASES AND DISORDERS OF THE NERVOUS SYSTEM,1,Minor,Minor,Medical,Private Health Insurance,,,,,Y,77568.09,11324.47
Long Island,Nassau,2908000,000511,NYU Langone Hospital-Long Island,18 to 29,117,F,White,Not Span/Hispanic,4,Emergency,Home or Self Care,2020,NVS005,MULTIPLE SCLEROSIS,CNS002,LUMBAR PUNCTURE,043,MULTIPLE SCLEROSIS & OTHER DEMYELINATING DISEASES,01,DISEASES AND DISORDERS OF THE NERVOUS SYSTEM,2,Moderate,Minor,Medical,Blue Cross/Blue Shield,Blue Cross/Blue Shield,,,,Y,104389.49,18632.99
New York City,Manhattan,7002054,001464,New York-Presbyterian Hospital - Columbia Presbyterian Center,30 to 49,109,F,Other Race,Not Span/Hispanic,15,Emergency,Home w/ Home Health Services,2020,NVS020,OTHER SPECIFIED NERVOUS SYSTEM DISORDERS,CNS002,LUMBAR PUNCTURE,043,MULTIPLE SCLEROSIS & OTHER DEMYELINATING DISEASES,01,DISEASES AND DISORDERS OF THE NERVOUS SYSTEM,1,Minor,Minor,Medical,Medicaid,Medicaid,Self-Pay,,,Y,283653.48,69518.67
New York City,Manhattan,7002054,001464,New York-Presbyterian Hospital - Columbia Presbyterian Center,0 to 17,125,M,Black/African American,Not Span/Hispanic,6,Emergency,Home or Self Care,2020,NVS015,POLYNEUROPATHIES,,,043,MULTIPLE SCLEROSIS & OTHER DEMYELINATING DISEASES,01,DISEASES AND DISORDERS OF THE NERVOUS SYSTEM,2,Moderate,Minor,Medical,Blue Cross/Blue Shield,Self-Pay,,,,Y,75048.71,17065.35
New York City,Manhattan,7002054,001464,New York-Presbyterian Hospital - Columbia Presbyterian Center,0 to 17,125,M,Black/African American,Not Span/Hispanic,5,Emergency,Inpatient Rehabilitation Facility,2020,NVS015,POLYNEUROPATHIES,,,043,MULTIPLE SCLEROSIS & OTHER DEMYELINATING DISEASES,01,DISEASES AND DISORDERS OF THE NERVOUS SYSTEM,1,Minor,Minor,Medical,Blue Cross/Blue Shield,Self-Pay,,,,N,66977.25,18079.24
New York City,Manhattan,7002054,001464,New York-Presbyterian Hospital - Columbia Presbyterian Center,30 to 49,105,F,Black/African American,Not Span/Hispanic,79,Emergency,Skilled Nursing Home,2020,NVS015,POLYNEUROPATHIES,ADM003,ADMINISTRATION OF ALBUMIN AND GLOBULIN,043,MULTIPLE SCLEROSIS & OTHER DEMYELINATING DISEASES,01,DISEASES AND DISORDERS OF THE NERVOUS SYSTEM,4,Extreme,Extreme,Medical,Private Health Insurance,Medicaid,Self-Pay,,,Y,1178516.56,283927.02
New York City,Kings,7002053,001304,NYU Langone Hospital-Brooklyn,50 to 69,112,F,Black/African American,Not Span/Hispanic,5,Emergency,Home w/ Home Health Services,2020,NVS005,MULTIPLE SCLEROSIS,MAM012,ICP AND OTHER CNS MONITORING (EXCLUDING EEG),043,MULTIPLE SCLEROSIS & OTHER DEMYELINATING DISEASES,01,DISEASES AND DISORDERS OF THE NERVOUS SYSTEM,2,Moderate,Minor,Medical,Medicare,Private Health Insurance,Medicaid,,,Y,89899.75,18696.77
New York City,Kings,7002053,001304,NYU Langone Hospital-Brooklyn,30 to 49,112,F,White,Not Span/Hispanic,1,Emergency,Left Against Medical Advice,2020,NVS005,MULTIPLE SCLEROSIS,,,043,MULTIPLE SCLEROSIS & OTHER DEMYELINATING DISEASES,01,DISEASES AND DISORDERS OF THE NERVOUS SYSTEM,2,Moderate,Minor,Medical,Medicaid,,,,,Y,15076.78,4293.49
New York City,Manhattan,7002054,001458,New York-Presbyterian Hospital - New York Weill Cornell Center,30 to 49,OOS,M,White,Not Span/Hispanic,11,Emergency,Inpatient Rehabilitation Facility,2020,NVS020,OTHER SPECIFIED NERVOUS SYSTEM DISORDERS,CAR024,VENOUS AND ARTERIAL CATHETER PLACEMENT,043,MULTIPLE SCLEROSIS & OTHER DEMYELINATING DISEASES,01,DISEASES AND DISORDERS OF THE NERVOUS SYSTEM,3,Major,Minor,Medical,Blue Cross/Blue Shield,Self-Pay,,,,N,267936.61,122986.2
New York City,Manhattan,7002054,001458,New York-Presbyterian Hospital - New York Weill Cornell Center,18 to 29,OOS,F,Other Race,Not Span/Hispanic,3,Emergency,Home or Self Care,2020,NVS005,MULTIPLE SCLEROSIS,CNS002,LUMBAR PUNCTURE,043,MULTIPLE SCLEROSIS & OTHER DEMYELINATING DISEASES,01,DISEASES AND DISORDERS OF THE NERVOUS SYSTEM,1,Minor,Minor,Medical,Blue Cross/Blue Shield,Self-Pay,,,,Y,63977.03,22962.56
Long Island,Nassau,2950002,000528,Nassau University Medical Center,70 or Older,115,F,Black/African American,Unknown,16,Urgent,Skilled Nursing Home,2020,NVS005,MULTIPLE SCLEROSIS,RHB002,"PHYSICAL, OCCUPATIONAL, AND RESPIRATORY THERAPY TREATMENT",043,MULTIPLE SCLEROSIS & OTHER DEMYELINATING DISEASES,01,DISEASES AND DISORDERS OF THE NERVOUS SYSTEM,1,Minor,Minor,Medical,Medicare,Medicare,Self-Pay,,,N,84785.15,20675.99
Long Island,Nassau,2950002,000528,Nassau University Medical Center,50 to 69,115,F,Black/African American,Not Span/Hispanic,2,Emergency,Home or Self Care,2020,NVS005,MULTIPLE SCLEROSIS,IMG005,MAGNETIC RESONANCE IMAGING (MRI),043,MULTIPLE SCLEROSIS & OTHER DEMYELINATING DISEASES,01,DISEASES AND DISORDERS OF THE NERVOUS SYSTEM,1,Minor,Minor,Medical,Medicaid,Medicaid,Self-Pay,,,N,24158.2,6681.9
Long Island,Nassau,2950002,000528,Nassau University Medical Center,30 to 49,115,F,Black/African American,Not Span/Hispanic,5,Emergency,Inpatient Rehabilitation Facility,2020,NVS005,MULTIPLE SCLEROSIS,ADM016,ADMINISTRATION OF ANTI-INFLAMMATORY AGENTS,043,MULTIPLE SCLEROSIS & OTHER DEMYELINATING DISEASES,01,DISEASES AND DISORDERS OF THE NERVOUS SYSTEM,2,Moderate,Moderate,Medical,Blue Cross/Blue Shield,Self-Pay,,,,N,43430.18,12686.65
Long Island,Nassau,2950002,000528,Nassau University Medical Center,70 or Older,115,F,Black/African American,Unknown,8,Emergency,Inpatient Rehabilitation Facility,2020,NVS005,MULTIPLE SCLEROSIS,IMG007,COMPUTERIZED TOMOGRAPHY (CT) WITHOUT CONTRAST,043,MULTIPLE SCLEROSIS & OTHER DEMYELINATING DISEASES,01,DISEASES AND DISORDERS OF THE NERVOUS SYSTEM,1,Minor,Minor,Medical,Medicare,Medicare,Self-Pay,,,N,48953.04,16701.29
New York City,Bronx,7000006,003058,Montefiore Med Center - Jack D Weiler Hosp of A Einstein College Div,30 to 49,104,F,Black/African American,Not Span/Hispanic,5,Emergency,Home or Self Care,2020,NVS005,MULTIPLE SCLEROSIS,IMG005,MAGNETIC RESONANCE IMAGING (MRI),043,MULTIPLE SCLEROSIS & OTHER DEMYELINATING DISEASES,01,DISEASES AND DISORDERS OF THE NERVOUS SYSTEM,1,Minor,Minor,Medical,Blue Cross/Blue Shield,Medicaid,,,,Y,55602.06,7440.52
New York City,Manhattan,7002032,001469,Mount Sinai Morningside,18 to 29,100,M,Other Race,Not Span/Hispanic,5,Emergency,Home or Self Care,2020,NVS020,OTHER SPECIFIED NERVOUS SYSTEM DISORDERS,CNS002,LUMBAR PUNCTURE,043,MULTIPLE SCLEROSIS & OTHER DEMYELINATING DISEASES,01,DISEASES AND DISORDERS OF THE NERVOUS SYSTEM,2,Moderate,Minor,Medical,Private Health Insurance,Self-Pay,,,,Y,78773.41,16342.27
Hudson Valley,Westchester,5902002,001046,Winifred Masterson Burke Rehabilitation Hospital,30 to 49,104,F,Black/African American,Not Span/Hispanic,12,Elective,Home or Self Care,2020,NVS015,POLYNEUROPATHIES,,,043,MULTIPLE SCLEROSIS & OTHER DEMYELINATING DISEASES,01,DISEASES AND DISORDERS OF THE NERVOUS SYSTEM,1,Minor,Minor,Medical,Private Health Insurance,Private Health Insurance,,,,N,40801.05,17346.48
New York City,Manhattan,7002053,001463,NYU Langone Hospitals,18 to 29,OOS,F,Multi-racial,Not Span/Hispanic,2,Emergency,Home or Self Care,2020,NVS005,MULTIPLE SCLEROSIS,ADM016,ADMINISTRATION OF ANTI-INFLAMMATORY AGENTS,043,MULTIPLE SCLEROSIS & OTHER DEMYELINATING DISEASES,01,DISEASES AND DISORDERS OF THE NERVOUS SYSTEM,1,Minor,Minor,Medical,Blue Cross/Blue Shield,,,,,Y,78623.71,10350.43
New York City,Manhattan,7002053,001463,NYU Langone Hospitals,30 to 49,100,F,White,Not Span/Hispanic,2,Emergency,Home or Self Care,2020,NVS005,MULTIPLE SCLEROSIS,,,043,MULTIPLE SCLEROSIS & OTHER DEMYELINATING DISEASES,01,DISEASES AND DISORDERS OF THE NERVOUS SYSTEM,1,Minor,Minor,Medical,Medicaid,,,,,Y,53551.31,9045.92
Capital/Adirond,Otsego,3824000,000746,Mary Imogene Bassett Hospital,50 to 69,137,F,White,Not Span/Hispanic,6,Urgent,Home or Self Care,2020,NVS020,OTHER SPECIFIED NERVOUS SYSTEM DISORDERS,,,043,MULTIPLE SCLEROSIS & OTHER DEMYELINATING DISEASES,01,DISEASES AND DISORDERS OF THE NERVOUS SYSTEM,2,Moderate,Minor,Medical,Medicare,Private Health Insurance,Medicaid,,,N,26337.5,14749.61
New York City,Kings,7002053,001304,NYU Langone Hospital-Brooklyn,50 to 69,112,M,White,Not Span/Hispanic,6,Emergency,Inpatient Rehabilitation Facility,2020,NVS005,MULTIPLE SCLEROSIS,,,043,MULTIPLE SCLEROSIS & OTHER DEMYELINATING DISEASES,01,DISEASES AND DISORDERS OF THE NERVOUS SYSTEM,2,Moderate,Minor,Medical,Medicaid,,,,,Y,116218.62,22761.98
New York City,Kings,7002053,001304,NYU Langone Hospital-Brooklyn,30 to 49,112,F,Other Race,Spanish/Hispanic,2,Emergency,Home or Self Care,2020,NVS005,MULTIPLE SCLEROSIS,IMG005,MAGNETIC RESONANCE IMAGING (MRI),043,MULTIPLE SCLEROSIS & OTHER DEMYELINATING DISEASES,01,DISEASES AND DISORDERS OF THE NERVOUS SYSTEM,1,Minor,Minor,Medical,Medicaid,,,,,Y,49106.55,9107.48
Hudson Valley,Rockland,4322000,000775,Helen Hayes Hospital,30 to 49,OOS,M,White,Unknown,20,Elective,Inpatient Rehabilitation Facility,2020,NVS005,MULTIPLE SCLEROSIS,,,043,MULTIPLE SCLEROSIS & OTHER DEMYELINATING DISEASES,01,DISEASES AND DISORDERS OF THE NERVOUS SYSTEM,1,Minor,Minor,Medical,Medicare,,,,,N,54481,37236.42
New York City,Bronx,7000006,001168,Montefiore Medical Center-Wakefield Hospital,30 to 49,104,F,Other Race,Not Span/Hispanic,16,Elective,Home w/ Home Health Services,2020,NVS020,OTHER SPECIFIED NERVOUS SYSTEM DISORDERS,URN006,BLADDER CATHETERIZATION AND DRAINAGE,043,MULTIPLE SCLEROSIS & OTHER DEMYELINATING DISEASES,01,DISEASES AND DISORDERS OF THE NERVOUS SYSTEM,2,Moderate,Moderate,Medical,Medicare,Medicaid,,,,N,148720.36,52435.4
New York City,Manhattan,7002053,001463,NYU Langone Hospitals,18 to 29,100,F,White,Not Span/Hispanic,2,Emergency,Home or Self Care,2020,NVS005,MULTIPLE SCLEROSIS,ADM016,ADMINISTRATION OF ANTI-INFLAMMATORY AGENTS,043,MULTIPLE SCLEROSIS & OTHER DEMYELINATING DISEASES,01,DISEASES AND DISORDERS OF THE NERVOUS SYSTEM,1,Minor,Minor,Medical,Private Health Insurance,,,,,N,62557.37,9183.36
New York City,Manhattan,7002053,001463,NYU Langone Hospitals,30 to 49,100,F,Other Race,Spanish/Hispanic,3,Emergency,Home w/ Home Health Services,2020,NVS005,MULTIPLE SCLEROSIS,,,043,MULTIPLE SCLEROSIS & OTHER DEMYELINATING DISEASES,01,DISEASES AND DISORDERS OF THE NERVOUS SYSTEM,2,Moderate,Minor,Medical,Medicare,Medicaid,,,,Y,77081.97,16255.11
New York City,Bronx,7000006,003058,Montefiore Med Center - Jack D Weiler Hosp of A Einstein College Div,50 to 69,104,F,Black/African American,Not Span/Hispanic,1,Emergency,Home or Self Care,2020,NVS015,POLYNEUROPATHIES,ADM021,"ADMINISTRATION OF THERAPEUTIC SUBSTANCES, NEC",043,MULTIPLE SCLEROSIS & OTHER DEMYELINATING DISEASES,01,DISEASES AND DISORDERS OF THE NERVOUS SYSTEM,2,Moderate,Minor,Medical,Private Health Insurance,,,,,Y,17875.16,2867.48
New York City,Bronx,7000001,001178,BronxCare Hospital Center,50 to 69,104,F,Black/African American,Spanish/Hispanic,17,Emergency,Home or Self Care,2020,NVS005,MULTIPLE SCLEROSIS,CNS002,LUMBAR PUNCTURE,043,MULTIPLE SCLEROSIS & OTHER DEMYELINATING DISEASES,01,DISEASES AND DISORDERS OF THE NERVOUS SYSTEM,4,Extreme,Major,Medical,Medicaid,Medicaid,,,,Y,70091.33,91788.83
Finger Lakes,Monroe,2701001,000409,Highland Hospital,70 or Older,144,F,White,Not Span/Hispanic,8,Emergency,Skilled Nursing Home,2020,NVS005,MULTIPLE SCLEROSIS,,,043,MULTIPLE SCLEROSIS & OTHER DEMYELINATING DISEASES,01,DISEASES AND DISORDERS OF THE NERVOUS SYSTEM,2,Moderate,Minor,Medical,Medicare,Medicaid,,,,Y,18880.6,6649.8
Finger Lakes,Monroe,2701001,000409,Highland Hospital,50 to 69,146,M,White,Not Span/Hispanic,2,Emergency,Home or Self Care,2020,NVS005,MULTIPLE SCLEROSIS,,,043,MULTIPLE SCLEROSIS & OTHER DEMYELINATING DISEASES,01,DISEASES AND DISORDERS OF THE NERVOUS SYSTEM,1,Minor,Minor,Medical,Federal/State/Local/VA,,,,,Y,5014.28,1795.52
Finger Lakes,Monroe,2701005,000413,Strong Memorial Hospital,50 to 69,146,F,White,Not Span/Hispanic,5,Emergency,Home w/ Home Health Services,2020,NVS005,MULTIPLE SCLEROSIS,CNS002,LUMBAR PUNCTURE,043,MULTIPLE SCLEROSIS & OTHER DEMYELINATING DISEASES,01,DISEASES AND DISORDERS OF THE NERVOUS SYSTEM,1,Minor,Minor,Medical,Blue Cross/Blue Shield,,,,,Y,29224.29,10476.13
Finger Lakes,Monroe,2701005,000413,Strong Memorial Hospital,50 to 69,146,M,Black/African American,Not Span/Hispanic,1,Emergency,Home w/ Home Health Services,2020,NVS005,MULTIPLE SCLEROSIS,,,043,MULTIPLE SCLEROSIS & OTHER DEMYELINATING DISEASES,01,DISEASES AND DISORDERS OF THE NERVOUS SYSTEM,1,Minor,Minor,Medical,Medicaid,,,,,Y,11238.48,3389.39
Finger Lakes,Monroe,2754001,000471,The Unity Hospital of Rochester,30 to 49,146,F,Other Race,Unknown,6,Emergency,Home or Self Care,2020,NVS005,MULTIPLE SCLEROSIS,,,043,MULTIPLE SCLEROSIS & OTHER DEMYELINATING DISEASES,01,DISEASES AND DISORDERS OF THE NERVOUS SYSTEM,1,Minor,Minor,Medical,Self-Pay,,,,,Y,17477.83,10627.43
Capital/Adirond,Albany,0101000,000001,Albany Medical Center Hospital,50 to 69,120,M,White,Not Span/Hispanic,6,Elective,Home or Self Care,2020,NVS015,POLYNEUROPATHIES,CNS002,LUMBAR PUNCTURE,043,MULTIPLE SCLEROSIS & OTHER DEMYELINATING DISEASES,01,DISEASES AND DISORDERS OF THE NERVOUS SYSTEM,2,Moderate,Minor,Medical,Medicare,Private Health Insurance,,,,N,60177.75,22751.86
Central NY,Cayuga,0501000,000085,Auburn Community Hospital,30 to 49,130,F,White,Not Span/Hispanic,3,Emergency,Home or Self Care,2020,NVS005,MULTIPLE SCLEROSIS,CNS002,LUMBAR PUNCTURE,043,MULTIPLE SCLEROSIS & OTHER DEMYELINATING DISEASES,01,DISEASES AND DISORDERS OF THE NERVOUS SYSTEM,1,Minor,Minor,Medical,Blue Cross/Blue Shield,,,,,Y,16369.85,4245.7
New York City,Manhattan,7002002,001439,Mount Sinai Beth Israel,30 to 49,111,F,Other Race,Unknown,4,Emergency,Home or Self Care,2020,NVS005,MULTIPLE SCLEROSIS,ADM021,"ADMINISTRATION OF THERAPEUTIC SUBSTANCES, NEC",043,MULTIPLE SCLEROSIS & OTHER DEMYELINATING DISEASES,01,DISEASES AND DISORDERS OF THE NERVOUS SYSTEM,1,Minor,Minor,Medical,Blue Cross/Blue Shield,Self-Pay,,,,Y,70086.42,16007.4
New York City,Manhattan,7002024,001456,Mount Sinai Hospital,50 to 69,100,F,White,Not Span/Hispanic,1,Elective,Home or Self Care,2020,NVS005,MULTIPLE SCLEROSIS,,,043,MULTIPLE SCLEROSIS & OTHER DEMYELINATING DISEASES,01,DISEASES AND DISORDERS OF THE NERVOUS SYSTEM,1,Minor,Minor,Medical,Self-Pay,Self-Pay,,,,N,9404.61,2579.97
New York City,Manhattan,7002032,001469,Mount Sinai Morningside,50 to 69,100,M,Other Race,Not Span/Hispanic,4,Emergency,Home or Self Care,2020,NVS005,MULTIPLE SCLEROSIS,ADM016,ADMINISTRATION OF ANTI-INFLAMMATORY AGENTS,043,MULTIPLE SCLEROSIS & OTHER DEMYELINATING DISEASES,01,DISEASES AND DISORDERS OF THE NERVOUS SYSTEM,1,Minor,Minor,Medical,Private Health Insurance,Medicaid,Self-Pay,,,Y,56914.4,12030.96
New York City,Manhattan,7002032,001469,Mount Sinai Morningside,18 to 29,100,M,Other Race,Not Span/Hispanic,3,Emergency,Home or Self Care,2020,NVS020,OTHER SPECIFIED NERVOUS SYSTEM DISORDERS,MAM007,ELECTROCARDIOGRAM (ECG),043,MULTIPLE SCLEROSIS & OTHER DEMYELINATING DISEASES,01,DISEASES AND DISORDERS OF THE NERVOUS SYSTEM,1,Minor,Minor,Medical,Private Health Insurance,Self-Pay,,,,Y,38127.78,8300.08
New York City,Manhattan,7002032,001469,Mount Sinai Morningside,50 to 69,100,M,Black/African American,Not Span/Hispanic,5,Emergency,Home w/ Home Health Services,2020,NVS005,MULTIPLE SCLEROSIS,ADM021,"ADMINISTRATION OF THERAPEUTIC SUBSTANCES, NEC",043,MULTIPLE SCLEROSIS & OTHER DEMYELINATING DISEASES,01,DISEASES AND DISORDERS OF THE NERVOUS SYSTEM,2,Moderate,Minor,Medical,Medicaid,Medicaid,Self-Pay,,,Y,57448.18,13220.88
New York City,Manhattan,7002032,001469,Mount Sinai Morningside,50 to 69,,M,White,Not Span/Hispanic,5,Urgent,Skilled Nursing Home,2020,NVS005,MULTIPLE SCLEROSIS,ADM021,"ADMINISTRATION OF THERAPEUTIC SUBSTANCES, NEC",043,MULTIPLE SCLEROSIS & OTHER DEMYELINATING DISEASES,01,DISEASES AND DISORDERS OF THE NERVOUS SYSTEM,2,Moderate,Moderate,Medical,Blue Cross/Blue Shield,Self-Pay,,,,N,52748.97,11297.27
New York City,Kings,7001003,001288,Brooklyn Hospital Center - Downtown Campus,18 to 29,112,F,White,Unknown,4,Emergency,Home or Self Care,2020,NVS005,MULTIPLE SCLEROSIS,CNS002,LUMBAR PUNCTURE,043,MULTIPLE SCLEROSIS & OTHER DEMYELINATING DISEASES,01,DISEASES AND DISORDERS OF THE NERVOUS SYSTEM,1,Minor,Minor,Medical,Medicaid,Medicaid,Self-Pay,,,Y,51752.29,7851.42
New York City,Manhattan,7002032,001466,Mount Sinai West,30 to 49,100,M,White,Not Span/Hispanic,11,Emergency,Home or Self Care,2020,NVS005,MULTIPLE SCLEROSIS,IMG005,MAGNETIC RESONANCE IMAGING (MRI),043,MULTIPLE SCLEROSIS & OTHER DEMYELINATING DISEASES,01,DISEASES AND DISORDERS OF THE NERVOUS SYSTEM,2,Moderate,Minor,Medical,Medicaid,Medicaid,Self-Pay,,,Y,125037.51,27009.9
New York City,Manhattan,7002053,001463,NYU Langone Hospitals,50 to 69,100,M,White,Not Span/Hispanic,1,Emergency,Home or Self Care,2020,NVS005,MULTIPLE SCLEROSIS,,,043,MULTIPLE SCLEROSIS & OTHER DEMYELINATING DISEASES,01,DISEASES AND DISORDERS OF THE NERVOUS SYSTEM,2,Moderate,Minor,Medical,Medicare,,,,,Y,59015.76,9505.24
New York City,Bronx,7000006,001169,Montefiore Medical Center - Henry & Lucy Moses Div,50 to 69,104,F,Black/African American,Not Span/Hispanic,4,Emergency,Home w/ Home Health Services,2020,NVS005,MULTIPLE SCLEROSIS,,,043,MULTIPLE SCLEROSIS & OTHER DEMYELINATING DISEASES,01,DISEASES AND DISORDERS OF THE NERVOUS SYSTEM,1,Minor,Minor,Medical,Medicaid,,,,,Y,66850.7,8930.08
Long Island,Nassau,2908000,000511,NYU Langone Hospital-Long Island,18 to 29,115,F,White,Spanish/Hispanic,2,Emergency,Home or Self Care,2020,NVS005,MULTIPLE SCLEROSIS,CNS002,LUMBAR PUNCTURE,043,MULTIPLE SCLEROSIS & OTHER DEMYELINATING DISEASES,01,DISEASES AND DISORDERS OF THE NERVOUS SYSTEM,2,Moderate,Minor,Medical,Medicaid,,,,,Y,118249.85,14348.48
Long Island,Nassau,2908000,000511,NYU Langone Hospital-Long Island,18 to 29,117,M,Black/African American,Not Span/Hispanic,4,Emergency,Home or Self Care,2020,NVS005,MULTIPLE SCLEROSIS,,,043,MULTIPLE SCLEROSIS & OTHER DEMYELINATING DISEASES,01,DISEASES AND DISORDERS OF THE NERVOUS SYSTEM,2,Moderate,Minor,Medical,Blue Cross/Blue Shield,Medicaid,,,,Y,66997.44,14618.51
Long Island,Nassau,2908000,000511,NYU Langone Hospital-Long Island,30 to 49,117,F,White,Not Span/Hispanic,1,Elective,Home or Self Care,2020,NVS005,MULTIPLE SCLEROSIS,,,043,MULTIPLE SCLEROSIS & OTHER DEMYELINATING DISEASES,01,DISEASES AND DISORDERS OF THE NERVOUS SYSTEM,1,Minor,Minor,Medical,Medicare,Medicaid,,,,N,160541.98,14256.5