Hospital Service Area,Hospital County,Operating Certificate Number,Permanent Facility Id,Facility Name,Age Group,Zip Code - 3 digits,Gender,Race,Ethnicity,Length of Stay,Type of Admission,Patient Disposition,Discharge Year,CCS Diagnosis Code,CCS Diagnosis Description,CCS Procedure Code,CCS Procedure Description,APR DRG Code,APR DRG Description,APR MDC Code,APR MDC Description,APR Severity of Illness Code,APR Severity of Illness Description,APR Risk of Mortality,APR Medical Surgical Description,Payment Typology 1,Payment Typology 2,Payment Typology 3,Birth Weight,Abortion Edit Indicator,Emergency Department Indicator,Total Charges,Total Costs
New York City,Manhattan,7002053,001463,NYU Langone Hospitals,18 to 29,OOS,F,Multi-racial,Not Span/Hispanic,2,Emergency,Home or Self Care,2020,NVS005,MULTIPLE SCLEROSIS,ADM016,ADMINISTRATION OF ANTI-INFLAMMATORY AGENTS,043,MULTIPLE SCLEROSIS & OTHER DEMYELINATING DISEASES,01,DISEASES AND DISORDERS OF THE NERVOUS SYSTEM,1,Minor,Minor,Medical,Blue Cross/Blue Shield,,,,,Y,78623.71,10350.43
New York City,Manhattan,7002053,001463,NYU Langone Hospitals,30 to 49,100,F,White,Not Span/Hispanic,2,Emergency,Home or Self Care,2020,NVS005,MULTIPLE SCLEROSIS,,,043,MULTIPLE SCLEROSIS & OTHER DEMYELINATING DISEASES,01,DISEASES AND DISORDERS OF THE NERVOUS SYSTEM,1,Minor,Minor,Medical,Medicaid,,,,,Y,53551.31,9045.92
New York City,Manhattan,7002053,001463,NYU Langone Hospitals,18 to 29,100,F,White,Not Span/Hispanic,2,Emergency,Home or Self Care,2020,NVS005,MULTIPLE SCLEROSIS,ADM016,ADMINISTRATION OF ANTI-INFLAMMATORY AGENTS,043,MULTIPLE SCLEROSIS & OTHER DEMYELINATING DISEASES,01,DISEASES AND DISORDERS OF THE NERVOUS SYSTEM,1,Minor,Minor,Medical,Private Health Insurance,,,,,N,62557.37,9183.36
New York City,Manhattan,7002053,001463,NYU Langone Hospitals,30 to 49,100,F,Other Race,Spanish/Hispanic,3,Emergency,Home w/ Home Health Services,2020,NVS005,MULTIPLE SCLEROSIS,,,043,MULTIPLE SCLEROSIS & OTHER DEMYELINATING DISEASES,01,DISEASES AND DISORDERS OF THE NERVOUS SYSTEM,2,Moderate,Minor,Medical,Medicare,Medicaid,,,,Y,77081.97,16255.11
New York City,Manhattan,7002053,001463,NYU Langone Hospitals,50 to 69,100,M,White,Not Span/Hispanic,1,Emergency,Home or Self Care,2020,NVS005,MULTIPLE SCLEROSIS,,,043,MULTIPLE SCLEROSIS & OTHER DEMYELINATING DISEASES,01,DISEASES AND DISORDERS OF THE NERVOUS SYSTEM,2,Moderate,Minor,Medical,Medicare,,,,,Y,59015.76,9505.24
New York City,Manhattan,7002053,001463,NYU Langone Hospitals,18 to 29,OOS,F,Black/African American,Not Span/Hispanic,2,Emergency,Home or Self Care,2020,NVS005,MULTIPLE SCLEROSIS,,,043,MULTIPLE SCLEROSIS & OTHER DEMYELINATING DISEASES,01,DISEASES AND DISORDERS OF THE NERVOUS SYSTEM,1,Minor,Minor,Medical,Private Health Insurance,,,,,Y,67227.48,9930.41
New York City,Manhattan,7002053,001463,NYU Langone Hospitals,30 to 49,112,F,White,Not Span/Hispanic,2,Emergency,Home or Self Care,2020,NVS005,MULTIPLE SCLEROSIS,,,043,MULTIPLE SCLEROSIS & OTHER DEMYELINATING DISEASES,01,DISEASES AND DISORDERS OF THE NERVOUS SYSTEM,1,Minor,Minor,Medical,Private Health Insurance,,,,,Y,73401.65,10246.85
New York City,Manhattan,7002053,001463,NYU Langone Hospitals,18 to 29,112,F,White,Not Span/Hispanic,1,Emergency,Home or Self Care,2020,NVS005,MULTIPLE SCLEROSIS,,,043,MULTIPLE SCLEROSIS & OTHER DEMYELINATING DISEASES,01,DISEASES AND DISORDERS OF THE NERVOUS SYSTEM,1,Minor,Minor,Medical,Private Health Insurance,,,,,Y,59736.53,10321.33
New York City,Manhattan,7002053,001463,NYU Langone Hospitals,70 or Older,114,F,White,Unknown,7,Emergency,Home or Self Care,2020,NVS020,OTHER SPECIFIED NERVOUS SYSTEM DISORDERS,CAR024,VENOUS AND ARTERIAL CATHETER PLACEMENT,043,MULTIPLE SCLEROSIS & OTHER DEMYELINATING DISEASES,01,DISEASES AND DISORDERS OF THE NERVOUS SYSTEM,1,Minor,Minor,Medical,Medicare,Medicaid,,,,Y,140271.51,29878.27
New York City,Manhattan,7002053,001463,NYU Langone Hospitals,30 to 49,112,F,White,Unknown,3,Emergency,Home or Self Care,2020,NVS005,MULTIPLE SCLEROSIS,,,043,MULTIPLE SCLEROSIS & OTHER DEMYELINATING DISEASES,01,DISEASES AND DISORDERS OF THE NERVOUS SYSTEM,1,Minor,Minor,Medical,Medicaid,,,,,Y,53633.39,11577.43
New York City,Manhattan,7002053,001463,NYU Langone Hospitals,30 to 49,112,F,Other Race,Not Span/Hispanic,3,Emergency,Home or Self Care,2020,NVS005,MULTIPLE SCLEROSIS,,,043,MULTIPLE SCLEROSIS & OTHER DEMYELINATING DISEASES,01,DISEASES AND DISORDERS OF THE NERVOUS SYSTEM,2,Moderate,Minor,Medical,Private Health Insurance,,,,,Y,79855.79,12677.8
New York City,Manhattan,7002053,001463,NYU Langone Hospitals,50 to 69,100,M,Black/African American,Not Span/Hispanic,3,Emergency,Skilled Nursing Home,2020,NVS005,MULTIPLE SCLEROSIS,,,043,MULTIPLE SCLEROSIS & OTHER DEMYELINATING DISEASES,01,DISEASES AND DISORDERS OF THE NERVOUS SYSTEM,2,Moderate,Minor,Medical,Medicare,,,,,Y,32105.96,10873.41
New York City,Manhattan,7002053,001463,NYU Langone Hospitals,0 to 17,,F,Multi-racial,Not Span/Hispanic,10,Emergency,Home or Self Care,2020,NVS005,MULTIPLE SCLEROSIS,CAR024,VENOUS AND ARTERIAL CATHETER PLACEMENT,043,MULTIPLE SCLEROSIS & OTHER DEMYELINATING DISEASES,01,DISEASES AND DISORDERS OF THE NERVOUS SYSTEM,3,Major,Moderate,Medical,Blue Cross/Blue Shield,Blue Cross/Blue Shield,,,,Y,164854.15,30210.36
New York City,Manhattan,7002053,001463,NYU Langone Hospitals,0 to 17,OOS,F,Other Race,Unknown,12,Emergency,Home or Self Care,2020,NVS005,MULTIPLE SCLEROSIS,CNS002,LUMBAR PUNCTURE,043,MULTIPLE SCLEROSIS & OTHER DEMYELINATING DISEASES,01,DISEASES AND DISORDERS OF THE NERVOUS SYSTEM,2,Moderate,Minor,Medical,Blue Cross/Blue Shield,,,,,Y,463631.51,51850.84
New York City,Manhattan,7002053,001463,NYU Langone Hospitals,50 to 69,104,F,Black/African American,Not Span/Hispanic,5,Elective,Home w/ Home Health Services,2020,NVS020,OTHER SPECIFIED NERVOUS SYSTEM DISORDERS,CAR024,VENOUS AND ARTERIAL CATHETER PLACEMENT,043,MULTIPLE SCLEROSIS & OTHER DEMYELINATING DISEASES,01,DISEASES AND DISORDERS OF THE NERVOUS SYSTEM,2,Moderate,Minor,Medical,Medicare,,,,,N,139973.25,29370.91
New York City,Manhattan,7002053,001463,NYU Langone Hospitals,18 to 29,104,F,Black/African American,Not Span/Hispanic,3,Emergency,Home or Self Care,2020,NVS005,MULTIPLE SCLEROSIS,,,043,MULTIPLE SCLEROSIS & OTHER DEMYELINATING DISEASES,01,DISEASES AND DISORDERS OF THE NERVOUS SYSTEM,1,Minor,Minor,Medical,Medicaid,,,,,Y,90083.34,17867.28
New York City,Manhattan,7002053,001463,NYU Langone Hospitals,50 to 69,104,M,White,Not Span/Hispanic,1,Elective,Home or Self Care,2020,NVS005,MULTIPLE SCLEROSIS,MST028,"SUBCUTANEOUS TISSUE AND FASCIA PROCEDURES, NEC",043,MULTIPLE SCLEROSIS & OTHER DEMYELINATING DISEASES,01,DISEASES AND DISORDERS OF THE NERVOUS SYSTEM,1,Minor,Minor,Medical,Private Health Insurance,,,,,N,175034.83,27217.92
New York City,Manhattan,7002053,001463,NYU Langone Hospitals,18 to 29,104,F,Other Race,Unknown,2,Emergency,Home or Self Care,2020,NVS005,MULTIPLE SCLEROSIS,,,043,MULTIPLE SCLEROSIS & OTHER DEMYELINATING DISEASES,01,DISEASES AND DISORDERS OF THE NERVOUS SYSTEM,2,Moderate,Minor,Medical,Private Health Insurance,,,,,Y,87076.9,12930.37
New York City,Manhattan,7002053,001463,NYU Langone Hospitals,70 or Older,112,M,Black/African American,Not Span/Hispanic,6,Emergency,Inpatient Rehabilitation Facility,2020,NVS005,MULTIPLE SCLEROSIS,OTR004,ISOLATION PROCEDURES,043,MULTIPLE SCLEROSIS & OTHER DEMYELINATING DISEASES,01,DISEASES AND DISORDERS OF THE NERVOUS SYSTEM,2,Moderate,Minor,Medical,Medicare,Blue Cross/Blue Shield,,,,Y,144335.52,39143.63
New York City,Manhattan,7002053,001463,NYU Langone Hospitals,30 to 49,113,M,White,Not Span/Hispanic,1,Emergency,Home or Self Care,2020,NVS015,POLYNEUROPATHIES,ADM003,ADMINISTRATION OF ALBUMIN AND GLOBULIN,043,MULTIPLE SCLEROSIS & OTHER DEMYELINATING DISEASES,01,DISEASES AND DISORDERS OF THE NERVOUS SYSTEM,1,Minor,Minor,Medical,Blue Cross/Blue Shield,,,,,Y,240276.79,26516.51
New York City,Manhattan,7002053,001463,NYU Langone Hospitals,50 to 69,100,F,Other Race,Spanish/Hispanic,8,Emergency,Skilled Nursing Home,2020,NVS005,MULTIPLE SCLEROSIS,,,043,MULTIPLE SCLEROSIS & OTHER DEMYELINATING DISEASES,01,DISEASES AND DISORDERS OF THE NERVOUS SYSTEM,1,Minor,Minor,Medical,Medicare,,,,,Y,117738.35,38611.56
New York City,Manhattan,7002053,001463,NYU Langone Hospitals,50 to 69,112,F,Other Race,Not Span/Hispanic,5,Emergency,Inpatient Rehabilitation Facility,2020,NVS020,OTHER SPECIFIED NERVOUS SYSTEM DISORDERS,,,043,MULTIPLE SCLEROSIS & OTHER DEMYELINATING DISEASES,01,DISEASES AND DISORDERS OF THE NERVOUS SYSTEM,2,Moderate,Moderate,Medical,Private Health Insurance,Medicaid,,,,Y,96055.7,26566.54
New York City,Manhattan,7002053,001463,NYU Langone Hospitals,30 to 49,112,F,White,Not Span/Hispanic,3,Emergency,Home or Self Care,2020,NVS005,MULTIPLE SCLEROSIS,,,043,MULTIPLE SCLEROSIS & OTHER DEMYELINATING DISEASES,01,DISEASES AND DISORDERS OF THE NERVOUS SYSTEM,1,Minor,Minor,Medical,Private Health Insurance,,,,,Y,104400.87,18386.19
New York City,Manhattan,7002053,001463,NYU Langone Hospitals,30 to 49,112,F,White,Not Span/Hispanic,4,Elective,Home w/ Home Health Services,2020,NVS005,MULTIPLE SCLEROSIS,RHB002,"PHYSICAL, OCCUPATIONAL, AND RESPIRATORY THERAPY TREATMENT",043,MULTIPLE SCLEROSIS & OTHER DEMYELINATING DISEASES,01,DISEASES AND DISORDERS OF THE NERVOUS SYSTEM,1,Minor,Minor,Medical,Medicaid,,,,,N,40030.62,12827.91
New York City,Manhattan,7002053,001463,NYU Langone Hospitals,30 to 49,112,F,White,Not Span/Hispanic,11,Emergency,Inpatient Rehabilitation Facility,2020,NVS005,MULTIPLE SCLEROSIS,EST001,PHERESIS THERAPY,043,MULTIPLE SCLEROSIS & OTHER DEMYELINATING DISEASES,01,DISEASES AND DISORDERS OF THE NERVOUS SYSTEM,2,Moderate,Minor,Medical,Medicaid,,,,,N,179175.25,57435.53
New York City,Manhattan,7002053,001463,NYU Langone Hospitals,0 to 17,OOS,F,Other Race,Unknown,12,Emergency,Home or Self Care,2020,NVS005,MULTIPLE SCLEROSIS,EST001,PHERESIS THERAPY,043,MULTIPLE SCLEROSIS & OTHER DEMYELINATING DISEASES,01,DISEASES AND DISORDERS OF THE NERVOUS SYSTEM,1,Minor,Minor,Medical,Blue Cross/Blue Shield,,,,,Y,229251.59,48155.54
New York City,Manhattan,7002053,001463,NYU Langone Hospitals,50 to 69,112,M,White,Not Span/Hispanic,3,Emergency,Home or Self Care,2020,NVS020,OTHER SPECIFIED NERVOUS SYSTEM DISORDERS,CNS002,LUMBAR PUNCTURE,043,MULTIPLE SCLEROSIS & OTHER DEMYELINATING DISEASES,01,DISEASES AND DISORDERS OF THE NERVOUS SYSTEM,3,Major,Extreme,Medical,Private Health Insurance,,,,,Y,277765.89,27702.09
New York City,Manhattan,7002053,001463,NYU Langone Hospitals,50 to 69,112,M,Black/African American,Not Span/Hispanic,3,Emergency,Home or Self Care,2020,NVS005,MULTIPLE SCLEROSIS,,,043,MULTIPLE SCLEROSIS & OTHER DEMYELINATING DISEASES,01,DISEASES AND DISORDERS OF THE NERVOUS SYSTEM,2,Moderate,Moderate,Medical,Medicare,,,,,Y,63447.84,16777.25
New York City,Manhattan,7002053,001463,NYU Langone Hospitals,50 to 69,103,M,White,Not Span/Hispanic,2,Emergency,Home or Self Care,2020,NVS015,POLYNEUROPATHIES,CNS002,LUMBAR PUNCTURE,043,MULTIPLE SCLEROSIS & OTHER DEMYELINATING DISEASES,01,DISEASES AND DISORDERS OF THE NERVOUS SYSTEM,1,Minor,Minor,Medical,Medicare,,,,,Y,256911.02,30310.98
New York City,Manhattan,7002053,001463,NYU Langone Hospitals,70 or Older,112,F,White,Not Span/Hispanic,3,Emergency,Home w/ Home Health Services,2020,NVS020,OTHER SPECIFIED NERVOUS SYSTEM DISORDERS,,,043,MULTIPLE SCLEROSIS & OTHER DEMYELINATING DISEASES,01,DISEASES AND DISORDERS OF THE NERVOUS SYSTEM,3,Major,Moderate,Medical,Medicare,Blue Cross/Blue Shield,,,,Y,70771.2,17079.27
New York City,Manhattan,7002053,001463,NYU Langone Hospitals,30 to 49,112,F,Black/African American,Not Span/Hispanic,2,Emergency,Home or Self Care,2020,NVS020,OTHER SPECIFIED NERVOUS SYSTEM DISORDERS,,,043,MULTIPLE SCLEROSIS & OTHER DEMYELINATING DISEASES,01,DISEASES AND DISORDERS OF THE NERVOUS SYSTEM,1,Minor,Minor,Medical,Private Health Insurance,,,,,Y,83990.01,12829.13
New York City,Manhattan,7002053,001463,NYU Langone Hospitals,30 to 49,104,F,Black/African American,Not Span/Hispanic,3,Emergency,Home or Self Care,2020,NVS020,OTHER SPECIFIED NERVOUS SYSTEM DISORDERS,,,043,MULTIPLE SCLEROSIS & OTHER DEMYELINATING DISEASES,01,DISEASES AND DISORDERS OF THE NERVOUS SYSTEM,1,Minor,Minor,Medical,Medicaid,,,,,Y,90643.49,17714.67
New York City,Manhattan,7002053,001463,NYU Langone Hospitals,30 to 49,112,M,White,Unknown,5,Emergency,Home w/ Home Health Services,2020,NVS005,MULTIPLE SCLEROSIS,,,043,MULTIPLE SCLEROSIS & OTHER DEMYELINATING DISEASES,01,DISEASES AND DISORDERS OF THE NERVOUS SYSTEM,1,Minor,Minor,Medical,Medicaid,,,,,Y,153898.22,29270.06
New York City,Manhattan,7002053,001463,NYU Langone Hospitals,18 to 29,100,F,Other Race,Not Span/Hispanic,3,Emergency,Home or Self Care,2020,NVS005,MULTIPLE SCLEROSIS,,,043,MULTIPLE SCLEROSIS & OTHER DEMYELINATING DISEASES,01,DISEASES AND DISORDERS OF THE NERVOUS SYSTEM,1,Minor,Minor,Medical,Private Health Insurance,,,,,Y,66979.06,16550.29
New York City,Manhattan,7002053,001463,NYU Langone Hospitals,30 to 49,104,F,Other Race,Not Span/Hispanic,3,Emergency,Home or Self Care,2020,NVS005,MULTIPLE SCLEROSIS,,,043,MULTIPLE SCLEROSIS & OTHER DEMYELINATING DISEASES,01,DISEASES AND DISORDERS OF THE NERVOUS SYSTEM,3,Major,Moderate,Medical,Blue Cross/Blue Shield,,,,,Y,93258.41,17668.44
New York City,Manhattan,7002053,001463,NYU Langone Hospitals,50 to 69,112,F,Other Race,Not Span/Hispanic,15,Elective,Home w/ Home Health Services,2020,NVS020,OTHER SPECIFIED NERVOUS SYSTEM DISORDERS,RHB002,"PHYSICAL, OCCUPATIONAL, AND RESPIRATORY THERAPY TREATMENT",043,MULTIPLE SCLEROSIS & OTHER DEMYELINATING DISEASES,01,DISEASES AND DISORDERS OF THE NERVOUS SYSTEM,2,Moderate,Minor,Medical,Private Health Insurance,Medicaid,,,,N,173404.36,49386.91
New York City,Manhattan,7002053,001463,NYU Langone Hospitals,50 to 69,104,F,Black/African American,Not Span/Hispanic,10,Emergency,Home w/ Home Health Services,2020,NVS005,MULTIPLE SCLEROSIS,CNS002,LUMBAR PUNCTURE,043,MULTIPLE SCLEROSIS & OTHER DEMYELINATING DISEASES,01,DISEASES AND DISORDERS OF THE NERVOUS SYSTEM,2,Moderate,Minor,Medical,Private Health Insurance,,,,,N,219531.84,56269.65
New York City,Manhattan,7002053,001463,NYU Langone Hospitals,18 to 29,103,F,White,Unknown,3,Emergency,Home or Self Care,2020,NVS005,MULTIPLE SCLEROSIS,,,043,MULTIPLE SCLEROSIS & OTHER DEMYELINATING DISEASES,01,DISEASES AND DISORDERS OF THE NERVOUS SYSTEM,1,Minor,Minor,Medical,Medicaid,,,,,Y,77739.57,16923.7
New York City,Manhattan,7002053,001463,NYU Langone Hospitals,50 to 69,104,F,Black/African American,Not Span/Hispanic,9,Elective,Home w/ Home Health Services,2020,NVS005,MULTIPLE SCLEROSIS,RHB002,"PHYSICAL, OCCUPATIONAL, AND RESPIRATORY THERAPY TREATMENT",043,MULTIPLE SCLEROSIS & OTHER DEMYELINATING DISEASES,01,DISEASES AND DISORDERS OF THE NERVOUS SYSTEM,2,Moderate,Moderate,Medical,Medicare,Blue Cross/Blue Shield,,,,N,115872.55,30111.89
New York City,Manhattan,7002053,001463,NYU Langone Hospitals,50 to 69,104,F,Black/African American,Not Span/Hispanic,2,Emergency,Inpatient Rehabilitation Facility,2020,NVS005,MULTIPLE SCLEROSIS,,,043,MULTIPLE SCLEROSIS & OTHER DEMYELINATING DISEASES,01,DISEASES AND DISORDERS OF THE NERVOUS SYSTEM,2,Moderate,Moderate,Medical,Medicare,Blue Cross/Blue Shield,,,,Y,64917.31,12749.36
New York City,Manhattan,7002053,001463,NYU Langone Hospitals,50 to 69,110,F,White,Not Span/Hispanic,7,Emergency,Skilled Nursing Home,2020,NVS015,POLYNEUROPATHIES,,,043,MULTIPLE SCLEROSIS & OTHER DEMYELINATING DISEASES,01,DISEASES AND DISORDERS OF THE NERVOUS SYSTEM,2,Moderate,Minor,Medical,Private Health Insurance,,,,,Y,85438.96,35353.17
New York City,Manhattan,7002053,001463,NYU Langone Hospitals,18 to 29,100,M,Other Race,Not Span/Hispanic,2,Emergency,Home or Self Care,2020,NVS005,MULTIPLE SCLEROSIS,MAM011,ELECTROENCEPHALOGRAM (EEG),043,MULTIPLE SCLEROSIS & OTHER DEMYELINATING DISEASES,01,DISEASES AND DISORDERS OF THE NERVOUS SYSTEM,1,Minor,Minor,Medical,Blue Cross/Blue Shield,Private Health Insurance,,,,Y,117734.04,14876.45
New York City,Manhattan,7002053,001463,NYU Langone Hospitals,50 to 69,100,F,White,Not Span/Hispanic,4,Emergency,Home or Self Care,2020,NVS005,MULTIPLE SCLEROSIS,CNS002,LUMBAR PUNCTURE,043,MULTIPLE SCLEROSIS & OTHER DEMYELINATING DISEASES,01,DISEASES AND DISORDERS OF THE NERVOUS SYSTEM,1,Minor,Minor,Medical,Private Health Insurance,,,,,Y,90439.8,22463.32
New York City,Manhattan,7002053,001463,NYU Langone Hospitals,18 to 29,114,M,Other Race,Not Span/Hispanic,4,Emergency,Home or Self Care,2020,NVS005,MULTIPLE SCLEROSIS,,,043,MULTIPLE SCLEROSIS & OTHER DEMYELINATING DISEASES,01,DISEASES AND DISORDERS OF THE NERVOUS SYSTEM,1,Minor,Minor,Medical,Medicaid,,,,,Y,69526.92,20793.33
New York City,Manhattan,7002053,001463,NYU Langone Hospitals,18 to 29,113,F,White,Not Span/Hispanic,2,Emergency,Home or Self Care,2020,NVS005,MULTIPLE SCLEROSIS,,,043,MULTIPLE SCLEROSIS & OTHER DEMYELINATING DISEASES,01,DISEASES AND DISORDERS OF THE NERVOUS SYSTEM,1,Minor,Minor,Medical,Medicaid,,,,,Y,54941.57,11472.94
New York City,Manhattan,7002053,001463,NYU Langone Hospitals,30 to 49,112,F,White,Not Span/Hispanic,2,Emergency,Home or Self Care,2020,NVS020,OTHER SPECIFIED NERVOUS SYSTEM DISORDERS,CNS002,LUMBAR PUNCTURE,043,MULTIPLE SCLEROSIS & OTHER DEMYELINATING DISEASES,01,DISEASES AND DISORDERS OF THE NERVOUS SYSTEM,1,Minor,Minor,Medical,Private Health Insurance,,,,,Y,78781.48,16852.76
New York City,Manhattan,7002053,001463,NYU Langone Hospitals,70 or Older,112,F,Black/African American,Not Span/Hispanic,3,Emergency,Inpatient Rehabilitation Facility,2020,NVS020,OTHER SPECIFIED NERVOUS SYSTEM DISORDERS,,,043,MULTIPLE SCLEROSIS & OTHER DEMYELINATING DISEASES,01,DISEASES AND DISORDERS OF THE NERVOUS SYSTEM,1,Minor,Minor,Medical,Medicare,Private Health Insurance,Private Health Insurance,,,N,116751.27,18876.63
New York City,Manhattan,7002053,001463,NYU Langone Hospitals,18 to 29,125,M,Other Race,Unknown,7,Emergency,Inpatient Rehabilitation Facility,2020,NVS005,MULTIPLE SCLEROSIS,EST001,PHERESIS THERAPY,043,MULTIPLE SCLEROSIS & OTHER DEMYELINATING DISEASES,01,DISEASES AND DISORDERS OF THE NERVOUS SYSTEM,1,Minor,Minor,Medical,Private Health Insurance,,,,,N,159512.85,40810.64
New York City,Manhattan,7002053,001463,NYU Langone Hospitals,30 to 49,104,M,Black/African American,Not Span/Hispanic,4,Emergency,Home or Self Care,2020,NVS020,OTHER SPECIFIED NERVOUS SYSTEM DISORDERS,,,043,MULTIPLE SCLEROSIS & OTHER DEMYELINATING DISEASES,01,DISEASES AND DISORDERS OF THE NERVOUS SYSTEM,2,Moderate,Minor,Medical,Private Health Insurance,,,,,Y,104256.3,22547.04
New York City,Manhattan,7002053,001463,NYU Langone Hospitals,30 to 49,104,F,Black/African American,Not Span/Hispanic,8,Emergency,Home or Self Care,2020,NVS005,MULTIPLE SCLEROSIS,EST001,PHERESIS THERAPY,043,MULTIPLE SCLEROSIS & OTHER DEMYELINATING DISEASES,01,DISEASES AND DISORDERS OF THE NERVOUS SYSTEM,3,Major,Minor,Medical,Medicaid,,,,,Y,167614.56,43812.75
New York City,Manhattan,7002053,001463,NYU Langone Hospitals,30 to 49,100,F,White,Not Span/Hispanic,6,Emergency,Home or Self Care,2020,NVS020,OTHER SPECIFIED NERVOUS SYSTEM DISORDERS,CNS002,LUMBAR PUNCTURE,043,MULTIPLE SCLEROSIS & OTHER DEMYELINATING DISEASES,01,DISEASES AND DISORDERS OF THE NERVOUS SYSTEM,1,Minor,Minor,Medical,Private Health Insurance,,,,,N,133514.59,32964.06
New York City,Manhattan,7002053,001463,NYU Langone Hospitals,50 to 69,116,F,Black/African American,Not Span/Hispanic,4,Emergency,Home w/ Home Health Services,2020,NVS005,MULTIPLE SCLEROSIS,,,043,MULTIPLE SCLEROSIS & OTHER DEMYELINATING DISEASES,01,DISEASES AND DISORDERS OF THE NERVOUS SYSTEM,1,Minor,Minor,Medical,Medicare,Medicaid,,,,N,107592.34,25473.85
New York City,Manhattan,7002053,001463,NYU Langone Hospitals,70 or Older,112,M,White,Not Span/Hispanic,9,Emergency,Home w/ Home Health Services,2020,NVS015,POLYNEUROPATHIES,ADM003,ADMINISTRATION OF ALBUMIN AND GLOBULIN,043,MULTIPLE SCLEROSIS & OTHER DEMYELINATING DISEASES,01,DISEASES AND DISORDERS OF THE NERVOUS SYSTEM,3,Major,Major,Medical,Medicare,,,,,Y,367316.8,59573.44
New York City,Manhattan,7002053,001463,NYU Langone Hospitals,30 to 49,112,F,Black/African American,Not Span/Hispanic,4,Emergency,Home or Self Care,2020,NVS005,MULTIPLE SCLEROSIS,,,043,MULTIPLE SCLEROSIS & OTHER DEMYELINATING DISEASES,01,DISEASES AND DISORDERS OF THE NERVOUS SYSTEM,2,Moderate,Minor,Medical,Private Health Insurance,,,,,Y,116009.9,23575.28
New York City,Manhattan,7002053,001463,NYU Langone Hospitals,70 or Older,OOS,F,White,Not Span/Hispanic,12,Emergency,Home w/ Home Health Services,2020,NVS020,OTHER SPECIFIED NERVOUS SYSTEM DISORDERS,CAR024,VENOUS AND ARTERIAL CATHETER PLACEMENT,043,MULTIPLE SCLEROSIS & OTHER DEMYELINATING DISEASES,01,DISEASES AND DISORDERS OF THE NERVOUS SYSTEM,3,Major,Moderate,Medical,Medicare,,,,,N,196420.29,62810.59
New York City,Manhattan,7002053,001463,NYU Langone Hospitals,30 to 49,OOS,F,White,Unknown,3,Emergency,Home or Self Care,2020,NVS005,MULTIPLE SCLEROSIS,,,043,MULTIPLE SCLEROSIS & OTHER DEMYELINATING DISEASES,01,DISEASES AND DISORDERS OF THE NERVOUS SYSTEM,1,Minor,Minor,Medical,Private Health Insurance,,,,,N,44975.46,15141.5
New York City,Manhattan,7002053,001463,NYU Langone Hospitals,50 to 69,110,F,White,Not Span/Hispanic,4,Emergency,Inpatient Rehabilitation Facility,2020,NVS015,POLYNEUROPATHIES,,,043,MULTIPLE SCLEROSIS & OTHER DEMYELINATING DISEASES,01,DISEASES AND DISORDERS OF THE NERVOUS SYSTEM,3,Major,Moderate,Medical,Private Health Insurance,,,,,Y,57604.74,21393.9
New York City,Manhattan,7002053,001463,NYU Langone Hospitals,50 to 69,100,M,Black/African American,Not Span/Hispanic,5,Emergency,Inpatient Rehabilitation Facility,2020,NVS005,MULTIPLE SCLEROSIS,OTR004,ISOLATION PROCEDURES,043,MULTIPLE SCLEROSIS & OTHER DEMYELINATING DISEASES,01,DISEASES AND DISORDERS OF THE NERVOUS SYSTEM,3,Major,Moderate,Medical,Medicare,Blue Cross/Blue Shield,,,,Y,93750.09,29210.66
