Hospital Service Area,Hospital County,Operating Certificate Number,Permanent Facility Id,Facility Name,Age Group,Zip Code - 3 digits,Gender,Race,Ethnicity,Length of Stay,Type of Admission,Patient Disposition,Discharge Year,CCS Diagnosis Code,CCS Diagnosis Description,CCS Procedure Code,CCS Procedure Description,APR DRG Code,APR DRG Description,APR MDC Code,APR MDC Description,APR Severity of Illness Code,APR Severity of Illness Description,APR Risk of Mortality,APR Medical Surgical Description,Payment Typology 1,Payment Typology 2,Payment Typology 3,Birth Weight,Abortion Edit Indicator,Emergency Department Indicator,Total Charges,Total Costs
Long Island,Nassau,2908000,000511,NYU Langone Hospital-Long Island,50 to 69,110,M,Other Race,Not Span/Hispanic,1,Emergency,Expired,2020,CIR021,ACUTE HEMORRHAGIC CEREBROVASCULAR DISEASE,ESA003,MECHANICAL VENTILATION,044,INTRACRANIAL HEMORRHAGE,01,DISEASES AND DISORDERS OF THE NERVOUS SYSTEM,3,Major,Extreme,Medical,Medicare,,,,,Y,28432.41,8300.52
Long Island,Nassau,2908000,000511,NYU Langone Hospital-Long Island,70 or Older,115,F,White,Not Span/Hispanic,11,Emergency,Skilled Nursing Home,2020,CIR021,ACUTE HEMORRHAGIC CEREBROVASCULAR DISEASE,,,044,INTRACRANIAL HEMORRHAGE,01,DISEASES AND DISORDERS OF THE NERVOUS SYSTEM,2,Moderate,Major,Medical,Medicare,Medicare,,,,Y,128761.26,39429.11
Long Island,Nassau,2908000,000511,NYU Langone Hospital-Long Island,70 or Older,114,F,White,Not Span/Hispanic,3,Emergency,Home w/ Home Health Services,2020,CIR021,ACUTE HEMORRHAGIC CEREBROVASCULAR DISEASE,ADM004,TRANSFUSION OF CLOTTING FACTORS,044,INTRACRANIAL HEMORRHAGE,01,DISEASES AND DISORDERS OF THE NERVOUS SYSTEM,3,Major,Major,Medical,Medicare,Medicare,,,,Y,127391.69,22831.51
Long Island,Nassau,2908000,000511,NYU Langone Hospital-Long Island,70 or Older,110,F,White,Spanish/Hispanic,6,Emergency,Skilled Nursing Home,2020,CIR021,ACUTE HEMORRHAGIC CEREBROVASCULAR DISEASE,,,044,INTRACRANIAL HEMORRHAGE,01,DISEASES AND DISORDERS OF THE NERVOUS SYSTEM,2,Moderate,Moderate,Medical,Medicare,Medicaid,,,,Y,158389.96,41456.11
Long Island,Nassau,2908000,000511,NYU Langone Hospital-Long Island,30 to 49,118,M,White,Spanish/Hispanic,6,Emergency,Home or Self Care,2020,CIR021,ACUTE HEMORRHAGIC CEREBROVASCULAR DISEASE,IMG002,FLUOROSCOPIC ANGIOGRAPHY (EXCLUDING CORONARY),044,INTRACRANIAL HEMORRHAGE,01,DISEASES AND DISORDERS OF THE NERVOUS SYSTEM,2,Moderate,Moderate,Medical,Private Health Insurance,,,,,Y,116200.17,27301.73
Long Island,Nassau,2908000,000511,NYU Langone Hospital-Long Island,70 or Older,115,F,White,Not Span/Hispanic,1,Emergency,Expired,2020,CIR021,ACUTE HEMORRHAGIC CEREBROVASCULAR DISEASE,,,044,INTRACRANIAL HEMORRHAGE,01,DISEASES AND DISORDERS OF THE NERVOUS SYSTEM,3,Major,Extreme,Medical,Medicare,Blue Cross/Blue Shield,,,,Y,76417.37,13876.97
Long Island,Nassau,2908000,000511,NYU Langone Hospital-Long Island,70 or Older,115,F,White,Not Span/Hispanic,7,Emergency,Inpatient Rehabilitation Facility,2020,CIR021,ACUTE HEMORRHAGIC CEREBROVASCULAR DISEASE,ADM017,ADMINISTRATION OF NUTRITIONAL AND ELECTROLYTIC SUBSTANCES,044,INTRACRANIAL HEMORRHAGE,01,DISEASES AND DISORDERS OF THE NERVOUS SYSTEM,3,Major,Major,Medical,Medicare,Blue Cross/Blue Shield,,,,Y,162980.14,42576.09
Long Island,Nassau,2908000,000511,NYU Langone Hospital-Long Island,70 or Older,115,M,White,Not Span/Hispanic,9,Emergency,Skilled Nursing Home,2020,CIR021,ACUTE HEMORRHAGIC CEREBROVASCULAR DISEASE,GIS017,GASTROSTOMY,044,INTRACRANIAL HEMORRHAGE,01,DISEASES AND DISORDERS OF THE NERVOUS SYSTEM,3,Major,Major,Medical,Medicare,,,,,Y,214441.29,54603.57
Long Island,Nassau,2908000,000511,NYU Langone Hospital-Long Island,30 to 49,110,M,White,Unknown,24,Emergency,Skilled Nursing Home,2020,CIR021,ACUTE HEMORRHAGIC CEREBROVASCULAR DISEASE,IMG008,ULTRASONOGRAPHY,044,INTRACRANIAL HEMORRHAGE,01,DISEASES AND DISORDERS OF THE NERVOUS SYSTEM,4,Extreme,Extreme,Medical,Medicaid,,,,,Y,476143.41,114291.92
Long Island,Nassau,2908000,000511,NYU Langone Hospital-Long Island,70 or Older,115,M,White,Not Span/Hispanic,2,Emergency,Hospice - Medical Facility,2020,CIR021,ACUTE HEMORRHAGIC CEREBROVASCULAR DISEASE,,,044,INTRACRANIAL HEMORRHAGE,01,DISEASES AND DISORDERS OF THE NERVOUS SYSTEM,2,Moderate,Moderate,Medical,Medicare,Blue Cross/Blue Shield,,,,Y,74732.66,22588.38
Long Island,Nassau,2908000,000511,NYU Langone Hospital-Long Island,50 to 69,115,F,White,Not Span/Hispanic,5,Emergency,Home w/ Home Health Services,2020,CIR021,ACUTE HEMORRHAGIC CEREBROVASCULAR DISEASE,IMG002,FLUOROSCOPIC ANGIOGRAPHY (EXCLUDING CORONARY),044,INTRACRANIAL HEMORRHAGE,01,DISEASES AND DISORDERS OF THE NERVOUS SYSTEM,4,Extreme,Extreme,Medical,Blue Cross/Blue Shield,,,,,Y,167958.88,36719.65
Long Island,Nassau,2908000,000511,NYU Langone Hospital-Long Island,70 or Older,115,F,White,Not Span/Hispanic,2,Emergency,Home w/ Home Health Services,2020,CIR021,ACUTE HEMORRHAGIC CEREBROVASCULAR DISEASE,SKB006,SKIN LACERATION REPAIR (EXCLUDING PERINEUM),044,INTRACRANIAL HEMORRHAGE,01,DISEASES AND DISORDERS OF THE NERVOUS SYSTEM,3,Major,Major,Medical,Medicare,Blue Cross/Blue Shield,,,,Y,68398.2,15332.36
Long Island,Nassau,2908000,000511,NYU Langone Hospital-Long Island,70 or Older,110,F,Other Race,Not Span/Hispanic,3,Emergency,Home w/ Home Health Services,2020,CIR021,ACUTE HEMORRHAGIC CEREBROVASCULAR DISEASE,,,044,INTRACRANIAL HEMORRHAGE,01,DISEASES AND DISORDERS OF THE NERVOUS SYSTEM,2,Moderate,Moderate,Medical,Medicare,,,,,Y,98502.07,18050.27
Long Island,Nassau,2908000,000511,NYU Langone Hospital-Long Island,50 to 69,110,M,White,Not Span/Hispanic,8,Emergency,Home w/ Home Health Services,2020,CIR021,ACUTE HEMORRHAGIC CEREBROVASCULAR DISEASE,IMG002,FLUOROSCOPIC ANGIOGRAPHY (EXCLUDING CORONARY),044,INTRACRANIAL HEMORRHAGE,01,DISEASES AND DISORDERS OF THE NERVOUS SYSTEM,3,Major,Major,Medical,Blue Cross/Blue Shield,,,,,Y,190671.67,51949.91
Long Island,Nassau,2908000,000511,NYU Langone Hospital-Long Island,50 to 69,115,M,White,Not Span/Hispanic,1,Emergency,Home or Self Care,2020,CIR021,ACUTE HEMORRHAGIC CEREBROVASCULAR DISEASE,,,044,INTRACRANIAL HEMORRHAGE,01,DISEASES AND DISORDERS OF THE NERVOUS SYSTEM,1,Minor,Minor,Medical,Blue Cross/Blue Shield,,,,,Y,24067.72,5109.77
Long Island,Nassau,2908000,000511,NYU Langone Hospital-Long Island,70 or Older,114,M,White,Not Span/Hispanic,6,Emergency,Skilled Nursing Home,2020,CIR021,ACUTE HEMORRHAGIC CEREBROVASCULAR DISEASE,,,044,INTRACRANIAL HEMORRHAGE,01,DISEASES AND DISORDERS OF THE NERVOUS SYSTEM,3,Major,Major,Medical,Medicare,Private Health Insurance,,,,Y,109539.31,30693.92
Long Island,Nassau,2908000,000511,NYU Langone Hospital-Long Island,70 or Older,115,M,White,Not Span/Hispanic,1,Emergency,Home w/ Home Health Services,2020,CIR021,ACUTE HEMORRHAGIC CEREBROVASCULAR DISEASE,EST001,PHERESIS THERAPY,044,INTRACRANIAL HEMORRHAGE,01,DISEASES AND DISORDERS OF THE NERVOUS SYSTEM,1,Minor,Major,Medical,Medicare,Blue Cross/Blue Shield,,,,Y,57473.05,10455.83
Long Island,Nassau,2908000,000511,NYU Langone Hospital-Long Island,70 or Older,115,F,White,Not Span/Hispanic,6,Emergency,Skilled Nursing Home,2020,CIR021,ACUTE HEMORRHAGIC CEREBROVASCULAR DISEASE,ADM004,TRANSFUSION OF CLOTTING FACTORS,044,INTRACRANIAL HEMORRHAGE,01,DISEASES AND DISORDERS OF THE NERVOUS SYSTEM,3,Major,Major,Medical,Medicare,Medicaid,,,,Y,150671.07,32486.21
Long Island,Nassau,2908000,000511,NYU Langone Hospital-Long Island,70 or Older,114,M,White,Not Span/Hispanic,5,Emergency,Home w/ Home Health Services,2020,CIR021,ACUTE HEMORRHAGIC CEREBROVASCULAR DISEASE,MAM011,ELECTROENCEPHALOGRAM (EEG),044,INTRACRANIAL HEMORRHAGE,01,DISEASES AND DISORDERS OF THE NERVOUS SYSTEM,4,Extreme,Extreme,Medical,Medicare,,,,,N,149151.12,42629.29
Long Island,Nassau,2908000,000511,NYU Langone Hospital-Long Island,50 to 69,110,M,Other Race,Not Span/Hispanic,2,Emergency,Home w/ Home Health Services,2020,CIR021,ACUTE HEMORRHAGIC CEREBROVASCULAR DISEASE,,,044,INTRACRANIAL HEMORRHAGE,01,DISEASES AND DISORDERS OF THE NERVOUS SYSTEM,1,Minor,Minor,Medical,Medicare,Blue Cross/Blue Shield,,,,Y,61090.07,13739.22
Long Island,Nassau,2908000,000511,NYU Langone Hospital-Long Island,70 or Older,115,M,White,Not Span/Hispanic,1,Emergency,Hospice - Medical Facility,2020,CIR021,ACUTE HEMORRHAGIC CEREBROVASCULAR DISEASE,ADM001,TRANSFUSION OF BLOOD AND BLOOD PRODUCTS,044,INTRACRANIAL HEMORRHAGE,01,DISEASES AND DISORDERS OF THE NERVOUS SYSTEM,3,Major,Major,Medical,Medicare,Federal/State/Local/VA,,,,Y,50339.41,7394.43
Long Island,Nassau,2908000,000511,NYU Langone Hospital-Long Island,30 to 49,115,M,Other Race,Spanish/Hispanic,9,Emergency,Home w/ Home Health Services,2020,CIR021,ACUTE HEMORRHAGIC CEREBROVASCULAR DISEASE,CAR024,VENOUS AND ARTERIAL CATHETER PLACEMENT,044,INTRACRANIAL HEMORRHAGE,01,DISEASES AND DISORDERS OF THE NERVOUS SYSTEM,3,Major,Extreme,Medical,Medicaid,,,,,Y,201422.47,35909.31
Long Island,Nassau,2908000,000511,NYU Langone Hospital-Long Island,50 to 69,115,M,Black/African American,Not Span/Hispanic,2,Emergency,Home w/ Home Health Services,2020,CIR021,ACUTE HEMORRHAGIC CEREBROVASCULAR DISEASE,MAM011,ELECTROENCEPHALOGRAM (EEG),044,INTRACRANIAL HEMORRHAGE,01,DISEASES AND DISORDERS OF THE NERVOUS SYSTEM,1,Minor,Moderate,Medical,Private Health Insurance,,,,,Y,71444.74,10437.66
Long Island,Nassau,2908000,000511,NYU Langone Hospital-Long Island,70 or Older,115,M,White,Not Span/Hispanic,6,Emergency,Inpatient Rehabilitation Facility,2020,CIR021,ACUTE HEMORRHAGIC CEREBROVASCULAR DISEASE,,,044,INTRACRANIAL HEMORRHAGE,01,DISEASES AND DISORDERS OF THE NERVOUS SYSTEM,3,Major,Major,Medical,Medicare,Blue Cross/Blue Shield,,,,Y,152312.83,33044.84
Long Island,Nassau,2908000,000511,NYU Langone Hospital-Long Island,70 or Older,117,M,White,Not Span/Hispanic,7,Emergency,Inpatient Rehabilitation Facility,2020,CIR021,ACUTE HEMORRHAGIC CEREBROVASCULAR DISEASE,ADM021,"ADMINISTRATION OF THERAPEUTIC SUBSTANCES, NEC",044,INTRACRANIAL HEMORRHAGE,01,DISEASES AND DISORDERS OF THE NERVOUS SYSTEM,3,Major,Extreme,Medical,Medicare,,,,,Y,251559.17,58249.28
Long Island,Nassau,2908000,000511,NYU Langone Hospital-Long Island,50 to 69,117,M,White,Not Span/Hispanic,4,Emergency,Home w/ Home Health Services,2020,CIR021,ACUTE HEMORRHAGIC CEREBROVASCULAR DISEASE,MST028,"SUBCUTANEOUS TISSUE AND FASCIA PROCEDURES, NEC",044,INTRACRANIAL HEMORRHAGE,01,DISEASES AND DISORDERS OF THE NERVOUS SYSTEM,2,Moderate,Moderate,Medical,Blue Cross/Blue Shield,,,,,Y,210186.63,40101.93
Long Island,Nassau,2908000,000511,NYU Langone Hospital-Long Island,70 or Older,117,F,White,Not Span/Hispanic,5,Emergency,Hospice - Medical Facility,2020,CIR021,ACUTE HEMORRHAGIC CEREBROVASCULAR DISEASE,,,044,INTRACRANIAL HEMORRHAGE,01,DISEASES AND DISORDERS OF THE NERVOUS SYSTEM,3,Major,Major,Medical,Medicare,,,,,Y,118963.98,30261.83
Long Island,Nassau,2908000,000511,NYU Langone Hospital-Long Island,70 or Older,115,F,White,Not Span/Hispanic,6,Emergency,Home w/ Home Health Services,2020,CIR021,ACUTE HEMORRHAGIC CEREBROVASCULAR DISEASE,,,044,INTRACRANIAL HEMORRHAGE,01,DISEASES AND DISORDERS OF THE NERVOUS SYSTEM,3,Major,Major,Medical,Medicare,Blue Cross/Blue Shield,,,,Y,167630.3,36653.19
Long Island,Nassau,2908000,000511,NYU Langone Hospital-Long Island,50 to 69,115,M,White,Not Span/Hispanic,1,Emergency,Expired,2020,CIR021,ACUTE HEMORRHAGIC CEREBROVASCULAR DISEASE,ESA004,NON-INVASIVE VENTILATION,044,INTRACRANIAL HEMORRHAGE,01,DISEASES AND DISORDERS OF THE NERVOUS SYSTEM,4,Extreme,Extreme,Medical,Blue Cross/Blue Shield,,,,,Y,121633.85,27102.71
Long Island,Nassau,2908000,000511,NYU Langone Hospital-Long Island,70 or Older,115,F,Other Race,Not Span/Hispanic,1,Emergency,Expired,2020,CIR021,ACUTE HEMORRHAGIC CEREBROVASCULAR DISEASE,ESA003,MECHANICAL VENTILATION,044,INTRACRANIAL HEMORRHAGE,01,DISEASES AND DISORDERS OF THE NERVOUS SYSTEM,4,Extreme,Extreme,Medical,Medicare,,,,,Y,108756.73,12089.96
Long Island,Nassau,2908000,000511,NYU Langone Hospital-Long Island,30 to 49,115,M,White,Not Span/Hispanic,3,Emergency,Home or Self Care,2020,CIR021,ACUTE HEMORRHAGIC CEREBROVASCULAR DISEASE,,,044,INTRACRANIAL HEMORRHAGE,01,DISEASES AND DISORDERS OF THE NERVOUS SYSTEM,3,Major,Major,Medical,Blue Cross/Blue Shield,,,,,Y,109189.81,22842.81
Long Island,Nassau,2908000,000511,NYU Langone Hospital-Long Island,50 to 69,115,F,Black/African American,Not Span/Hispanic,10,Emergency,Inpatient Rehabilitation Facility,2020,CIR021,ACUTE HEMORRHAGIC CEREBROVASCULAR DISEASE,,,044,INTRACRANIAL HEMORRHAGE,01,DISEASES AND DISORDERS OF THE NERVOUS SYSTEM,3,Major,Moderate,Medical,Blue Cross/Blue Shield,,,,,Y,192140.09,42909.39
Long Island,Nassau,2908000,000511,NYU Langone Hospital-Long Island,70 or Older,110,M,Multi-racial,Not Span/Hispanic,6,Emergency,Home or Self Care,2020,CIR021,ACUTE HEMORRHAGIC CEREBROVASCULAR DISEASE,MAM011,ELECTROENCEPHALOGRAM (EEG),044,INTRACRANIAL HEMORRHAGE,01,DISEASES AND DISORDERS OF THE NERVOUS SYSTEM,3,Major,Major,Medical,Medicare,,,,,Y,190493.15,40916.8
Long Island,Nassau,2908000,000511,NYU Langone Hospital-Long Island,70 or Older,115,F,White,Not Span/Hispanic,1,Emergency,Home or Self Care,2020,CIR021,ACUTE HEMORRHAGIC CEREBROVASCULAR DISEASE,,,044,INTRACRANIAL HEMORRHAGE,01,DISEASES AND DISORDERS OF THE NERVOUS SYSTEM,2,Moderate,Minor,Medical,Medicare,Blue Cross/Blue Shield,,,,Y,33489.83,10055.51
Long Island,Nassau,2908000,000511,NYU Langone Hospital-Long Island,70 or Older,110,M,White,Not Span/Hispanic,6,Emergency,Home w/ Home Health Services,2020,CIR021,ACUTE HEMORRHAGIC CEREBROVASCULAR DISEASE,,,044,INTRACRANIAL HEMORRHAGE,01,DISEASES AND DISORDERS OF THE NERVOUS SYSTEM,3,Major,Major,Medical,Medicare,,,,,Y,152669.51,39033.95
Long Island,Nassau,2908000,000511,NYU Langone Hospital-Long Island,30 to 49,112,M,Black/African American,Not Span/Hispanic,8,Emergency,Home or Self Care,2020,CIR021,ACUTE HEMORRHAGIC CEREBROVASCULAR DISEASE,IMG002,FLUOROSCOPIC ANGIOGRAPHY (EXCLUDING CORONARY),044,INTRACRANIAL HEMORRHAGE,01,DISEASES AND DISORDERS OF THE NERVOUS SYSTEM,3,Major,Major,Medical,Medicaid,,,,,Y,192022.87,51802.51
Long Island,Nassau,2908000,000511,NYU Langone Hospital-Long Island,70 or Older,115,F,White,Not Span/Hispanic,6,Emergency,Home w/ Home Health Services,2020,CIR021,ACUTE HEMORRHAGIC CEREBROVASCULAR DISEASE,MST001,ARTHROCENTESIS,044,INTRACRANIAL HEMORRHAGE,01,DISEASES AND DISORDERS OF THE NERVOUS SYSTEM,3,Major,Major,Medical,Medicare,Medicare,,,,Y,182231.22,43317.13
Long Island,Nassau,2908000,000511,NYU Langone Hospital-Long Island,70 or Older,115,F,White,Not Span/Hispanic,2,Emergency,Hospice - Home,2020,CIR021,ACUTE HEMORRHAGIC CEREBROVASCULAR DISEASE,,,044,INTRACRANIAL HEMORRHAGE,01,DISEASES AND DISORDERS OF THE NERVOUS SYSTEM,3,Major,Major,Medical,Medicare,Medicare,,,,Y,97142.42,28398.41
Long Island,Nassau,2908000,000511,NYU Langone Hospital-Long Island,70 or Older,117,F,White,Not Span/Hispanic,9,Emergency,Inpatient Rehabilitation Facility,2020,CIR021,ACUTE HEMORRHAGIC CEREBROVASCULAR DISEASE,IMG002,FLUOROSCOPIC ANGIOGRAPHY (EXCLUDING CORONARY),044,INTRACRANIAL HEMORRHAGE,01,DISEASES AND DISORDERS OF THE NERVOUS SYSTEM,3,Major,Major,Medical,Medicare,Medicare,,,,Y,348414.99,80390.97
Long Island,Nassau,2908000,000511,NYU Langone Hospital-Long Island,70 or Older,115,M,Black/African American,Not Span/Hispanic,4,Emergency,Home w/ Home Health Services,2020,CIR021,ACUTE HEMORRHAGIC CEREBROVASCULAR DISEASE,,,044,INTRACRANIAL HEMORRHAGE,01,DISEASES AND DISORDERS OF THE NERVOUS SYSTEM,1,Minor,Major,Medical,Medicare,Blue Cross/Blue Shield,,,,Y,72296.21,24580.9
Long Island,Nassau,2908000,000511,NYU Langone Hospital-Long Island,50 to 69,110,M,Black/African American,Not Span/Hispanic,8,Emergency,Skilled Nursing Home,2020,CIR021,ACUTE HEMORRHAGIC CEREBROVASCULAR DISEASE,GIS001,ESOPHAGOGASTRODUODENOSCOPY (EGD) WITH BIOPSY,044,INTRACRANIAL HEMORRHAGE,01,DISEASES AND DISORDERS OF THE NERVOUS SYSTEM,3,Major,Major,Medical,Medicaid,,,,,Y,186933.22,45917.14
Long Island,Nassau,2908000,000511,NYU Langone Hospital-Long Island,70 or Older,110,M,White,Not Span/Hispanic,9,Emergency,Hospice - Medical Facility,2020,CIR021,ACUTE HEMORRHAGIC CEREBROVASCULAR DISEASE,RES007,AIRWAY INTUBATION,044,INTRACRANIAL HEMORRHAGE,01,DISEASES AND DISORDERS OF THE NERVOUS SYSTEM,4,Extreme,Extreme,Medical,Medicare,Private Health Insurance,,,,Y,362854.03,78635.58
Long Island,Nassau,2908000,000511,NYU Langone Hospital-Long Island,50 to 69,117,M,White,Not Span/Hispanic,1,Emergency,Left Against Medical Advice,2020,CIR021,ACUTE HEMORRHAGIC CEREBROVASCULAR DISEASE,,,044,INTRACRANIAL HEMORRHAGE,01,DISEASES AND DISORDERS OF THE NERVOUS SYSTEM,2,Moderate,Extreme,Medical,Medicaid,,,,,Y,58695.5,13151.72
Long Island,Nassau,2908000,000511,NYU Langone Hospital-Long Island,70 or Older,118,M,White,Not Span/Hispanic,1,Emergency,Home w/ Home Health Services,2020,CIR021,ACUTE HEMORRHAGIC CEREBROVASCULAR DISEASE,,,044,INTRACRANIAL HEMORRHAGE,01,DISEASES AND DISORDERS OF THE NERVOUS SYSTEM,3,Major,Major,Medical,Medicare,Medicaid,,,,Y,134151.41,19859.28
Long Island,Nassau,2908000,000511,NYU Langone Hospital-Long Island,70 or Older,,M,Black/African American,Not Span/Hispanic,10,Emergency,Home w/ Home Health Services,2020,CIR021,ACUTE HEMORRHAGIC CEREBROVASCULAR DISEASE,CAR025,PLACEMENT OF TUNNELED OR IMPLANTABLE PORTION OF A VASCULAR ACCESS DEVICE,044,INTRACRANIAL HEMORRHAGE,01,DISEASES AND DISORDERS OF THE NERVOUS SYSTEM,3,Major,Major,Medical,Medicare,Private Health Insurance,,,,Y,230397.06,77822.55
Long Island,Nassau,2908000,000511,NYU Langone Hospital-Long Island,70 or Older,115,M,Other Race,Spanish/Hispanic,8,Emergency,Home w/ Home Health Services,2020,CIR021,ACUTE HEMORRHAGIC CEREBROVASCULAR DISEASE,,,044,INTRACRANIAL HEMORRHAGE,01,DISEASES AND DISORDERS OF THE NERVOUS SYSTEM,3,Major,Extreme,Medical,Medicare,Medicare,,,,Y,227945.45,49067.95
Long Island,Nassau,2908000,000511,NYU Langone Hospital-Long Island,70 or Older,115,F,White,Not Span/Hispanic,2,Emergency,Expired,2020,CIR021,ACUTE HEMORRHAGIC CEREBROVASCULAR DISEASE,RES007,AIRWAY INTUBATION,044,INTRACRANIAL HEMORRHAGE,01,DISEASES AND DISORDERS OF THE NERVOUS SYSTEM,4,Extreme,Extreme,Medical,Medicare,Medicare,,,,Y,65378.51,16208.26
Long Island,Nassau,2908000,000511,NYU Langone Hospital-Long Island,50 to 69,115,M,Black/African American,Not Span/Hispanic,2,Emergency,Home or Self Care,2020,CIR021,ACUTE HEMORRHAGIC CEREBROVASCULAR DISEASE,,,044,INTRACRANIAL HEMORRHAGE,01,DISEASES AND DISORDERS OF THE NERVOUS SYSTEM,2,Moderate,Moderate,Medical,Blue Cross/Blue Shield,,,,,Y,78994.24,15526.33
Long Island,Nassau,2908000,000511,NYU Langone Hospital-Long Island,50 to 69,115,F,White,Not Span/Hispanic,7,Emergency,Home w/ Home Health Services,2020,CIR021,ACUTE HEMORRHAGIC CEREBROVASCULAR DISEASE,MAM011,ELECTROENCEPHALOGRAM (EEG),044,INTRACRANIAL HEMORRHAGE,01,DISEASES AND DISORDERS OF THE NERVOUS SYSTEM,4,Extreme,Extreme,Medical,Medicare,Medicare,,,,Y,249666.97,50294.04
Long Island,Nassau,2908000,000511,NYU Langone Hospital-Long Island,70 or Older,115,F,Black/African American,Not Span/Hispanic,6,Emergency,Home w/ Home Health Services,2020,CIR021,ACUTE HEMORRHAGIC CEREBROVASCULAR DISEASE,MAM011,ELECTROENCEPHALOGRAM (EEG),044,INTRACRANIAL HEMORRHAGE,01,DISEASES AND DISORDERS OF THE NERVOUS SYSTEM,3,Major,Major,Medical,Medicare,,,,,Y,197332.38,43973.68
Long Island,Nassau,2908000,000511,NYU Langone Hospital-Long Island,30 to 49,110,F,White,Not Span/Hispanic,9,Emergency,Home or Self Care,2020,CIR021,ACUTE HEMORRHAGIC CEREBROVASCULAR DISEASE,CAR024,VENOUS AND ARTERIAL CATHETER PLACEMENT,044,INTRACRANIAL HEMORRHAGE,01,DISEASES AND DISORDERS OF THE NERVOUS SYSTEM,4,Extreme,Extreme,Medical,Blue Cross/Blue Shield,,,,,Y,354589.05,84866.59
Long Island,Nassau,2908000,000511,NYU Langone Hospital-Long Island,70 or Older,115,F,Black/African American,Not Span/Hispanic,8,Emergency,Home w/ Home Health Services,2020,CIR021,ACUTE HEMORRHAGIC CEREBROVASCULAR DISEASE,,,044,INTRACRANIAL HEMORRHAGE,01,DISEASES AND DISORDERS OF THE NERVOUS SYSTEM,3,Major,Major,Medical,Medicare,Private Health Insurance,,,,Y,195791.45,51872.12
Long Island,Nassau,2908000,000511,NYU Langone Hospital-Long Island,50 to 69,115,F,White,Not Span/Hispanic,9,Emergency,Home w/ Home Health Services,2020,CIR021,ACUTE HEMORRHAGIC CEREBROVASCULAR DISEASE,IMG002,FLUOROSCOPIC ANGIOGRAPHY (EXCLUDING CORONARY),044,INTRACRANIAL HEMORRHAGE,01,DISEASES AND DISORDERS OF THE NERVOUS SYSTEM,3,Major,Major,Medical,Medicare,Medicare,,,,Y,219442.12,54004.63
Long Island,Nassau,2908000,000511,NYU Langone Hospital-Long Island,70 or Older,114,M,White,Not Span/Hispanic,4,Emergency,Home w/ Home Health Services,2020,CIR021,ACUTE HEMORRHAGIC CEREBROVASCULAR DISEASE,ADM001,TRANSFUSION OF BLOOD AND BLOOD PRODUCTS,044,INTRACRANIAL HEMORRHAGE,01,DISEASES AND DISORDERS OF THE NERVOUS SYSTEM,3,Major,Major,Medical,Medicare,,,,,Y,125938.83,29285.84
Long Island,Nassau,2908000,000511,NYU Langone Hospital-Long Island,30 to 49,115,F,Other Race,Spanish/Hispanic,13,Emergency,Home w/ Home Health Services,2020,CIR021,ACUTE HEMORRHAGIC CEREBROVASCULAR DISEASE,CAR024,VENOUS AND ARTERIAL CATHETER PLACEMENT,044,INTRACRANIAL HEMORRHAGE,01,DISEASES AND DISORDERS OF THE NERVOUS SYSTEM,4,Extreme,Extreme,Medical,Medicaid,,,,,Y,384861.98,95625.54
Long Island,Nassau,2908000,000511,NYU Langone Hospital-Long Island,50 to 69,115,F,White,Not Span/Hispanic,1,Emergency,Expired,2020,CIR021,ACUTE HEMORRHAGIC CEREBROVASCULAR DISEASE,ESA003,MECHANICAL VENTILATION,044,INTRACRANIAL HEMORRHAGE,01,DISEASES AND DISORDERS OF THE NERVOUS SYSTEM,4,Extreme,Extreme,Medical,Medicare,Medicare,,,,Y,110256.1,24906.32
Long Island,Nassau,2908000,000511,NYU Langone Hospital-Long Island,30 to 49,115,F,Black/African American,Not Span/Hispanic,2,Emergency,Home or Self Care,2020,CIR021,ACUTE HEMORRHAGIC CEREBROVASCULAR DISEASE,IMG002,FLUOROSCOPIC ANGIOGRAPHY (EXCLUDING CORONARY),044,INTRACRANIAL HEMORRHAGE,01,DISEASES AND DISORDERS OF THE NERVOUS SYSTEM,1,Minor,Minor,Medical,Blue Cross/Blue Shield,,,,,Y,115287.08,17712.06
Long Island,Nassau,2908000,000511,NYU Langone Hospital-Long Island,50 to 69,115,M,Black/African American,Unknown,10,Emergency,Home w/ Home Health Services,2020,CIR021,ACUTE HEMORRHAGIC CEREBROVASCULAR DISEASE,ADM004,TRANSFUSION OF CLOTTING FACTORS,044,INTRACRANIAL HEMORRHAGE,01,DISEASES AND DISORDERS OF THE NERVOUS SYSTEM,3,Major,Major,Medical,Medicaid,,,,,Y,270244.9,74402.92
Long Island,Nassau,2908000,000511,NYU Langone Hospital-Long Island,30 to 49,110,M,White,Unknown,13,Emergency,Skilled Nursing Home,2020,CIR021,ACUTE HEMORRHAGIC CEREBROVASCULAR DISEASE,MAM011,ELECTROENCEPHALOGRAM (EEG),044,INTRACRANIAL HEMORRHAGE,01,DISEASES AND DISORDERS OF THE NERVOUS SYSTEM,3,Major,Major,Medical,Medicaid,,,,,Y,452604.51,91404.04
Long Island,Nassau,2908000,000511,NYU Langone Hospital-Long Island,50 to 69,115,F,Black/African American,Unknown,3,Emergency,Expired,2020,CIR021,ACUTE HEMORRHAGIC CEREBROVASCULAR DISEASE,RES007,AIRWAY INTUBATION,044,INTRACRANIAL HEMORRHAGE,01,DISEASES AND DISORDERS OF THE NERVOUS SYSTEM,4,Extreme,Extreme,Medical,Medicaid,,,,,Y,124940.93,28672.23
Long Island,Nassau,2908000,000511,NYU Langone Hospital-Long Island,50 to 69,115,M,White,Not Span/Hispanic,1,Elective,Expired,2020,CIR021,ACUTE HEMORRHAGIC CEREBROVASCULAR DISEASE,,,044,INTRACRANIAL HEMORRHAGE,01,DISEASES AND DISORDERS OF THE NERVOUS SYSTEM,4,Extreme,Extreme,Medical,Medicare,,,,,N,19040.97,9846.19
Long Island,Nassau,2908000,000511,NYU Langone Hospital-Long Island,50 to 69,115,M,Multi-racial,Spanish/Hispanic,1,Elective,Expired,2020,CIR021,ACUTE HEMORRHAGIC CEREBROVASCULAR DISEASE,,,044,INTRACRANIAL HEMORRHAGE,01,DISEASES AND DISORDERS OF THE NERVOUS SYSTEM,4,Extreme,Extreme,Medical,Self-Pay,,,,,N,5576.14,2955.05