Hospital Service Area,Hospital County,Operating Certificate Number,Permanent Facility Id,Facility Name,Age Group,Zip Code - 3 digits,Gender,Race,Ethnicity,Length of Stay,Type of Admission,Patient Disposition,Discharge Year,CCS Diagnosis Code,CCS Diagnosis Description,CCS Procedure Code,CCS Procedure Description,APR DRG Code,APR DRG Description,APR MDC Code,APR MDC Description,APR Severity of Illness Code,APR Severity of Illness Description,APR Risk of Mortality,APR Medical Surgical Description,Payment Typology 1,Payment Typology 2,Payment Typology 3,Birth Weight,Abortion Edit Indicator,Emergency Department Indicator,Total Charges,Total Costs
New York City,Manhattan,7002054,001458,New York-Presbyterian Hospital - New York Weill Cornell Center,50 to 69,112,M,Multi-racial,Not Span/Hispanic,5,Elective,Home or Self Care,2019,GEN003,CHRONIC KIDNEY DISEASE,URN011,KIDNEY TRANSPLANT,440,KIDNEY TRANSPLANT,11,DISEASES AND DISORDERS OF THE KIDNEY AND URINARY TRACT,2,Moderate,Moderate,Surgical,Private Health Insurance,Medicare,,,,false,232653.01,64551.91
Western NY,Erie,1401005,000210,Erie County Medical Center,70 or Older,140,M,Black/African American,Not Span/Hispanic,7,Emergency,Home w/ Home Health Services,2019,END003,DIABETES MELLITUS WITH COMPLICATION,URN011,KIDNEY TRANSPLANT,440,KIDNEY TRANSPLANT,11,DISEASES AND DISORDERS OF THE KIDNEY AND URINARY TRACT,3,Major,Extreme,Surgical,Medicare,Blue Cross/Blue Shield,,,,false,376591.01,339231.27
New York City,Manhattan,7002054,001458,New York-Presbyterian Hospital - New York Weill Cornell Center,30 to 49,113,M,Other Race,Not Span/Hispanic,4,Elective,Home w/ Home Health Services,2019,END003,DIABETES MELLITUS WITH COMPLICATION,URN011,KIDNEY TRANSPLANT,440,KIDNEY TRANSPLANT,11,DISEASES AND DISORDERS OF THE KIDNEY AND URINARY TRACT,3,Major,Major,Surgical,Medicare,Medicaid,Self-Pay,,,false,199384.31,51604.64
Central NY,Onondaga,3301007,000635,University Hospital SUNY Health Science Center,30 to 49,132,F,Black/African American,Not Span/Hispanic,21,Emergency,Home or Self Care,2019,GEN003,CHRONIC KIDNEY DISEASE,URN011,KIDNEY TRANSPLANT,440,KIDNEY TRANSPLANT,11,DISEASES AND DISORDERS OF THE KIDNEY AND URINARY TRACT,3,Major,Major,Surgical,Medicaid,,,,,false,519994.17,225421.9
Central NY,Onondaga,3301007,000635,University Hospital SUNY Health Science Center,30 to 49,149,M,Black/African American,Not Span/Hispanic,5,Emergency,Court/Law Enforcement,2019,GEN003,CHRONIC KIDNEY DISEASE,URN011,KIDNEY TRANSPLANT,440,KIDNEY TRANSPLANT,11,DISEASES AND DISORDERS OF THE KIDNEY AND URINARY TRACT,2,Moderate,Minor,Surgical,Medicaid,,,,,false,217651.7,132670.5
New York City,Bronx,7000006,001169,Montefiore Medical Center - Henry & Lucy Moses Div,30 to 49,104,M,Other Race,Spanish/Hispanic,3,Elective,Home w/ Home Health Services,2019,END003,DIABETES MELLITUS WITH COMPLICATION,URN011,KIDNEY TRANSPLANT,440,KIDNEY TRANSPLANT,11,DISEASES AND DISORDERS OF THE KIDNEY AND URINARY TRACT,2,Moderate,Moderate,Surgical,Medicaid,,,,,false,225765.71,42427.92
New York City,Manhattan,7002054,001458,New York-Presbyterian Hospital - New York Weill Cornell Center,70 or Older,100,M,White,Not Span/Hispanic,4,Elective,Home or Self Care,2019,GEN003,CHRONIC KIDNEY DISEASE,URN011,KIDNEY TRANSPLANT,440,KIDNEY TRANSPLANT,11,DISEASES AND DISORDERS OF THE KIDNEY AND URINARY TRACT,2,Moderate,Major,Surgical,Medicare,Private Health Insurance,Self-Pay,,,false,213259.7,56553.79
Western NY,Erie,1401005,000210,Erie County Medical Center,30 to 49,142,M,Black/African American,Not Span/Hispanic,5,Elective,Home w/ Home Health Services,2019,GEN003,CHRONIC KIDNEY DISEASE,URN011,KIDNEY TRANSPLANT,440,KIDNEY TRANSPLANT,11,DISEASES AND DISORDERS OF THE KIDNEY AND URINARY TRACT,3,Major,Moderate,Surgical,Medicare,Medicaid,,,,false,189118.13,168358.27
Western NY,Erie,1401005,000210,Erie County Medical Center,50 to 69,140,F,Black/African American,Not Span/Hispanic,8,Elective,Skilled Nursing Home,2019,END003,DIABETES MELLITUS WITH COMPLICATION,URN011,KIDNEY TRANSPLANT,440,KIDNEY TRANSPLANT,11,DISEASES AND DISORDERS OF THE KIDNEY AND URINARY TRACT,3,Major,Moderate,Surgical,Blue Cross/Blue Shield,Medicare,,,,false,257495.13,232784.97
Long Island,Suffolk,5151001,000245,Stony Brook University Hospital,50 to 69,117,F,White,Spanish/Hispanic,4,Urgent,Home or Self Care,2019,GEN003,CHRONIC KIDNEY DISEASE,URN011,KIDNEY TRANSPLANT,440,KIDNEY TRANSPLANT,11,DISEASES AND DISORDERS OF THE KIDNEY AND URINARY TRACT,4,Extreme,Moderate,Surgical,Medicare,Private Health Insurance,,,,false,165469.75,1566864.19
New York City,Manhattan,7002054,001464,New York-Presbyterian Hospital - Columbia Presbyterian Center,30 to 49,100,M,White,Not Span/Hispanic,5,Elective,Home or Self Care,2019,GEN003,CHRONIC KIDNEY DISEASE,URN011,KIDNEY TRANSPLANT,440,KIDNEY TRANSPLANT,11,DISEASES AND DISORDERS OF THE KIDNEY AND URINARY TRACT,2,Moderate,Moderate,Surgical,Medicare,Private Health Insurance,Medicaid,,,false,230560.9,59923.39
New York City,Manhattan,7002053,001463,NYU Langone Hospitals,50 to 69,100,M,Black/African American,Not Span/Hispanic,9,Emergency,Home w/ Home Health Services,2019,END003,DIABETES MELLITUS WITH COMPLICATION,URN011,KIDNEY TRANSPLANT,440,KIDNEY TRANSPLANT,11,DISEASES AND DISORDERS OF THE KIDNEY AND URINARY TRACT,3,Major,Major,Surgical,Medicare,Medicaid,,,,false,690535.29,280954.03
Long Island,Suffolk,5151001,000245,Stony Brook University Hospital,30 to 49,117,M,Other Race,Spanish/Hispanic,11,Urgent,Home w/ Home Health Services,2019,END003,DIABETES MELLITUS WITH COMPLICATION,URN011,KIDNEY TRANSPLANT,440,KIDNEY TRANSPLANT,11,DISEASES AND DISORDERS OF THE KIDNEY AND URINARY TRACT,4,Extreme,Extreme,Surgical,Medicare,Private Health Insurance,,,,false,323025.2,1613291.36
New York City,Manhattan,7002054,001464,New York-Presbyterian Hospital - Columbia Presbyterian Center,30 to 49,105,F,White,Not Span/Hispanic,4,Elective,Home w/ Home Health Services,2019,GEN003,CHRONIC KIDNEY DISEASE,URN011,KIDNEY TRANSPLANT,440,KIDNEY TRANSPLANT,11,DISEASES AND DISORDERS OF THE KIDNEY AND URINARY TRACT,2,Moderate,Minor,Surgical,Medicare,Medicare,Self-Pay,,,false,224260.11,60407.34
New York City,Manhattan,7002024,001456,Mount Sinai Hospital,50 to 69,115,M,Other Race,Spanish/Hispanic,8,Elective,Home or Self Care,2019,INJ036,"COMPLICATION OF TRANSPLANTED ORGANS OR TISSUE, INITIAL ENCOUNTER",URN011,KIDNEY TRANSPLANT,440,KIDNEY TRANSPLANT,11,DISEASES AND DISORDERS OF THE KIDNEY AND URINARY TRACT,3,Major,Minor,Surgical,Medicare,Medicaid,Self-Pay,,,false,241167.33,83520.6
New York City,Bronx,7000006,001169,Montefiore Medical Center - Henry & Lucy Moses Div,50 to 69,112,F,Other Race,Unknown,3,Elective,Home or Self Care,2019,GEN003,CHRONIC KIDNEY DISEASE,URN011,KIDNEY TRANSPLANT,440,KIDNEY TRANSPLANT,11,DISEASES AND DISORDERS OF THE KIDNEY AND URINARY TRACT,2,Moderate,Moderate,Surgical,Private Health Insurance,,,,,false,221463.16,43165.08
Capital/Adirond,Albany,0101000,000001,Albany Medical Center Hospital,30 to 49,131,M,White,Not Span/Hispanic,7,Urgent,Home or Self Care,2019,MAL003,GENITOURINARY CONGENITAL ANOMALIES,URN011,KIDNEY TRANSPLANT,440,KIDNEY TRANSPLANT,11,DISEASES AND DISORDERS OF THE KIDNEY AND URINARY TRACT,1,Minor,Minor,Surgical,"Managed Care, Unspecified",,,,,false,170601.08,97623.09
Central NY,Onondaga,3301007,000635,University Hospital SUNY Health Science Center,50 to 69,145,M,White,Not Span/Hispanic,3,Elective,Home or Self Care,2019,GEN003,CHRONIC KIDNEY DISEASE,URN011,KIDNEY TRANSPLANT,440,KIDNEY TRANSPLANT,11,DISEASES AND DISORDERS OF THE KIDNEY AND URINARY TRACT,2,Moderate,Minor,Surgical,Medicare,Private Health Insurance,,,,false,213255.3,133916.81
Western NY,Erie,1401005,000210,Erie County Medical Center,50 to 69,140,M,White,Not Span/Hispanic,7,Urgent,Home or Self Care,2019,GEN003,CHRONIC KIDNEY DISEASE,ADM001,TRANSFUSION OF BLOOD AND BLOOD PRODUCTS,440,KIDNEY TRANSPLANT,11,DISEASES AND DISORDERS OF THE KIDNEY AND URINARY TRACT,3,Major,Extreme,Surgical,Medicare,Medicare,,,,false,193884.91,169530.91
Long Island,Suffolk,5151001,000245,Stony Brook University Hospital,50 to 69,115,M,White,Not Span/Hispanic,4,Urgent,Home or Self Care,2019,GEN003,CHRONIC KIDNEY DISEASE,URN011,KIDNEY TRANSPLANT,440,KIDNEY TRANSPLANT,11,DISEASES AND DISORDERS OF THE KIDNEY AND URINARY TRACT,2,Moderate,Minor,Surgical,Blue Cross/Blue Shield,Medicare,,,,false,192126.73,1954793.64
Long Island,Suffolk,5151001,000245,Stony Brook University Hospital,70 or Older,117,M,White,Not Span/Hispanic,4,Elective,Home or Self Care,2019,END003,DIABETES MELLITUS WITH COMPLICATION,URN011,KIDNEY TRANSPLANT,440,KIDNEY TRANSPLANT,11,DISEASES AND DISORDERS OF THE KIDNEY AND URINARY TRACT,2,Moderate,Major,Surgical,Medicare,Medicare,,,,false,181424.07,1951026.06
New York City,Manhattan,7002054,001458,New York-Presbyterian Hospital - New York Weill Cornell Center,50 to 69,112,M,White,Not Span/Hispanic,4,Elective,Home or Self Care,2019,GEN003,CHRONIC KIDNEY DISEASE,URN011,KIDNEY TRANSPLANT,440,KIDNEY TRANSPLANT,11,DISEASES AND DISORDERS OF THE KIDNEY AND URINARY TRACT,2,Moderate,Moderate,Surgical,"Managed Care, Unspecified",Medicaid,Self-Pay,,,false,220226.75,58789.52
Hudson Valley,Westchester,5957001,001139,Westchester Medical Center,30 to 49,106,M,White,Not Span/Hispanic,6,Urgent,Home w/ Home Health Services,2019,GEN003,CHRONIC KIDNEY DISEASE,URN011,KIDNEY TRANSPLANT,440,KIDNEY TRANSPLANT,11,DISEASES AND DISORDERS OF THE KIDNEY AND URINARY TRACT,1,Minor,Minor,Surgical,Private Health Insurance,Medicaid,,,,false,352561.94,69406.97
New York City,Manhattan,7002053,001463,NYU Langone Hospitals,50 to 69,113,M,White,Not Span/Hispanic,8,Elective,Home w/ Home Health Services,2019,INJ036,"COMPLICATION OF TRANSPLANTED ORGANS OR TISSUE, INITIAL ENCOUNTER",URN011,KIDNEY TRANSPLANT,440,KIDNEY TRANSPLANT,11,DISEASES AND DISORDERS OF THE KIDNEY AND URINARY TRACT,3,Major,Major,Surgical,Medicare,Medicare,,,,false,739433.64,275888.89
New York City,Manhattan,7002053,001463,NYU Langone Hospitals,30 to 49,113,M,Other Race,Not Span/Hispanic,6,Emergency,Home w/ Home Health Services,2019,GEN003,CHRONIC KIDNEY DISEASE,URN011,KIDNEY TRANSPLANT,440,KIDNEY TRANSPLANT,11,DISEASES AND DISORDERS OF THE KIDNEY AND URINARY TRACT,3,Major,Moderate,Surgical,Medicare,Medicaid,,,,false,649114.14,267109.94
Finger Lakes,Monroe,2701005,000413,Strong Memorial Hospital,50 to 69,145,M,White,Not Span/Hispanic,5,Elective,Home w/ Home Health Services,2019,INJ036,"COMPLICATION OF TRANSPLANTED ORGANS OR TISSUE, INITIAL ENCOUNTER",URN011,KIDNEY TRANSPLANT,440,KIDNEY TRANSPLANT,11,DISEASES AND DISORDERS OF THE KIDNEY AND URINARY TRACT,4,Extreme,Moderate,Surgical,Private Health Insurance,Blue Cross/Blue Shield,,,,false,160544.9,79971.08
New York City,Manhattan,7002054,001458,New York-Presbyterian Hospital - New York Weill Cornell Center,18 to 29,116,M,Black/African American,Not Span/Hispanic,6,Elective,Home or Self Care,2019,GEN003,CHRONIC KIDNEY DISEASE,URN011,KIDNEY TRANSPLANT,440,KIDNEY TRANSPLANT,11,DISEASES AND DISORDERS OF THE KIDNEY AND URINARY TRACT,2,Moderate,Moderate,Surgical,Medicare,Medicaid,Self-Pay,,,false,253501.98,69607.57
New York City,Manhattan,7002054,001464,New York-Presbyterian Hospital - Columbia Presbyterian Center,30 to 49,112,F,Black/African American,Not Span/Hispanic,15,Elective,Home w/ Home Health Services,2019,GEN003,CHRONIC KIDNEY DISEASE,GNR009,"RETROPERITONEAL PROCEDURES, NEC",440,KIDNEY TRANSPLANT,11,DISEASES AND DISORDERS OF THE KIDNEY AND URINARY TRACT,3,Major,Major,Surgical,Medicare,Medicaid,Self-Pay,,,true,337292.89,88190.92
New York City,Manhattan,7002054,001464,New York-Presbyterian Hospital - Columbia Presbyterian Center,30 to 49,117,M,White,Not Span/Hispanic,5,Elective,Home or Self Care,2019,GEN003,CHRONIC KIDNEY DISEASE,URN011,KIDNEY TRANSPLANT,440,KIDNEY TRANSPLANT,11,DISEASES AND DISORDERS OF THE KIDNEY AND URINARY TRACT,3,Major,Moderate,Surgical,Private Health Insurance,Medicare,Self-Pay,,,false,185160.18,44271.73
New York City,Manhattan,7002054,001464,New York-Presbyterian Hospital - Columbia Presbyterian Center,50 to 69,OOS,F,Black/African American,Not Span/Hispanic,7,Elective,Home w/ Home Health Services,2019,GEN003,CHRONIC KIDNEY DISEASE,URN011,KIDNEY TRANSPLANT,440,KIDNEY TRANSPLANT,11,DISEASES AND DISORDERS OF THE KIDNEY AND URINARY TRACT,2,Moderate,Moderate,Surgical,Medicare,Private Health Insurance,Self-Pay,,,false,223144.5,54206.21
New York City,Manhattan,7002054,001458,New York-Presbyterian Hospital - New York Weill Cornell Center,50 to 69,100,M,Other Race,Not Span/Hispanic,7,Emergency,Home or Self Care,2019,GEN003,CHRONIC KIDNEY DISEASE,URN011,KIDNEY TRANSPLANT,440,KIDNEY TRANSPLANT,11,DISEASES AND DISORDERS OF THE KIDNEY AND URINARY TRACT,3,Major,Major,Surgical,Medicare,Medicaid,Self-Pay,,,false,251860.6,67894.59
New York City,Manhattan,7002054,001464,New York-Presbyterian Hospital - Columbia Presbyterian Center,18 to 29,104,F,Black/African American,Not Span/Hispanic,4,Elective,Home w/ Home Health Services,2019,GEN003,CHRONIC KIDNEY DISEASE,URN011,KIDNEY TRANSPLANT,440,KIDNEY TRANSPLANT,11,DISEASES AND DISORDERS OF THE KIDNEY AND URINARY TRACT,2,Moderate,Minor,Surgical,Medicare,Medicaid,Self-Pay,,,false,215682.78,56730.4
New York City,Manhattan,7002054,001464,New York-Presbyterian Hospital - Columbia Presbyterian Center,30 to 49,,M,Black/African American,Multi-ethnic,3,Elective,Home w/ Home Health Services,2019,INJ036,"COMPLICATION OF TRANSPLANTED ORGANS OR TISSUE, INITIAL ENCOUNTER",URN011,KIDNEY TRANSPLANT,440,KIDNEY TRANSPLANT,11,DISEASES AND DISORDERS OF THE KIDNEY AND URINARY TRACT,2,Moderate,Minor,Surgical,Medicare,Medicaid,Self-Pay,,,false,196273.02,51605.5
New York City,Manhattan,7002053,001463,NYU Langone Hospitals,50 to 69,115,M,Black/African American,Not Span/Hispanic,6,Emergency,Home w/ Home Health Services,2019,GEN003,CHRONIC KIDNEY DISEASE,URN011,KIDNEY TRANSPLANT,440,KIDNEY TRANSPLANT,11,DISEASES AND DISORDERS OF THE KIDNEY AND URINARY TRACT,3,Major,Major,Surgical,Medicare,Private Health Insurance,,,,false,700562.09,277047.8
New York City,Manhattan,7002054,001464,New York-Presbyterian Hospital - Columbia Presbyterian Center,50 to 69,109,F,White,Not Span/Hispanic,4,Elective,Home w/ Home Health Services,2019,INJ036,"COMPLICATION OF TRANSPLANTED ORGANS OR TISSUE, INITIAL ENCOUNTER",URN011,KIDNEY TRANSPLANT,440,KIDNEY TRANSPLANT,11,DISEASES AND DISORDERS OF THE KIDNEY AND URINARY TRACT,3,Major,Major,Surgical,Private Health Insurance,Self-Pay,,,,false,212778.14,56492.75
New York City,Manhattan,7002054,001464,New York-Presbyterian Hospital - Columbia Presbyterian Center,0 to 17,104,M,Multi-racial,Multi-ethnic,14,Elective,Home or Self Care,2019,GEN003,CHRONIC KIDNEY DISEASE,URN011,KIDNEY TRANSPLANT,440,KIDNEY TRANSPLANT,11,DISEASES AND DISORDERS OF THE KIDNEY AND URINARY TRACT,2,Moderate,Minor,Surgical,Medicare,Medicaid,Self-Pay,,,false,359798.54,115350.56
New York City,Manhattan,7002054,001458,New York-Presbyterian Hospital - New York Weill Cornell Center,50 to 69,OOS,M,Other Race,Not Span/Hispanic,4,Elective,Home or Self Care,2019,GEN003,CHRONIC KIDNEY DISEASE,URN011,KIDNEY TRANSPLANT,440,KIDNEY TRANSPLANT,11,DISEASES AND DISORDERS OF THE KIDNEY AND URINARY TRACT,2,Moderate,Minor,Surgical,Medicare,Blue Cross/Blue Shield,Self-Pay,,,false,195624.84,48493.5
New York City,Manhattan,7002024,001456,Mount Sinai Hospital,50 to 69,100,F,Other Race,Spanish/Hispanic,6,Urgent,Home w/ Home Health Services,2019,GEN003,CHRONIC KIDNEY DISEASE,URN011,KIDNEY TRANSPLANT,440,KIDNEY TRANSPLANT,11,DISEASES AND DISORDERS OF THE KIDNEY AND URINARY TRACT,3,Major,Moderate,Surgical,Medicaid,Medicaid,Self-Pay,,,false,235145.73,81182.13
Central NY,Onondaga,3301007,000635,University Hospital SUNY Health Science Center,30 to 49,130,F,White,Not Span/Hispanic,7,Emergency,Home or Self Care,2019,GEN003,CHRONIC KIDNEY DISEASE,URN011,KIDNEY TRANSPLANT,440,KIDNEY TRANSPLANT,11,DISEASES AND DISORDERS OF THE KIDNEY AND URINARY TRACT,2,Moderate,Minor,Surgical,Medicare,Medicaid,,,,false,247613.7,138924.38
New York City,Manhattan,7002054,001458,New York-Presbyterian Hospital - New York Weill Cornell Center,50 to 69,113,F,Other Race,Not Span/Hispanic,13,Emergency,Home w/ Home Health Services,2019,GEN003,CHRONIC KIDNEY DISEASE,URN011,KIDNEY TRANSPLANT,440,KIDNEY TRANSPLANT,11,DISEASES AND DISORDERS OF THE KIDNEY AND URINARY TRACT,3,Major,Major,Surgical,Medicare,Medicaid,Self-Pay,,,false,336725.79,86794.42
New York City,Manhattan,7002053,001463,NYU Langone Hospitals,50 to 69,115,F,Black/African American,Not Span/Hispanic,8,Emergency,Home w/ Home Health Services,2019,END003,DIABETES MELLITUS WITH COMPLICATION,URN011,KIDNEY TRANSPLANT,440,KIDNEY TRANSPLANT,11,DISEASES AND DISORDERS OF THE KIDNEY AND URINARY TRACT,3,Major,Major,Surgical,Medicare,,,,,false,701516.72,275905.98
New York City,Manhattan,7002053,001463,NYU Langone Hospitals,18 to 29,OOS,F,White,Not Span/Hispanic,4,Elective,Home w/ Home Health Services,2019,GEN003,CHRONIC KIDNEY DISEASE,URN011,KIDNEY TRANSPLANT,440,KIDNEY TRANSPLANT,11,DISEASES AND DISORDERS OF THE KIDNEY AND URINARY TRACT,2,Moderate,Minor,Surgical,Blue Cross/Blue Shield,,,,,false,570652.91,241989.02
New York City,Manhattan,7002054,001458,New York-Presbyterian Hospital - New York Weill Cornell Center,50 to 69,100,M,Other Race,Not Span/Hispanic,4,Emergency,Home or Self Care,2019,GEN003,CHRONIC KIDNEY DISEASE,URN011,KIDNEY TRANSPLANT,440,KIDNEY TRANSPLANT,11,DISEASES AND DISORDERS OF THE KIDNEY AND URINARY TRACT,2,Moderate,Moderate,Surgical,Medicare,Private Health Insurance,Self-Pay,,,false,210475.64,54135.56
New York City,Manhattan,7002054,001464,New York-Presbyterian Hospital - Columbia Presbyterian Center,50 to 69,115,M,White,Not Span/Hispanic,6,Elective,Home or Self Care,2019,GEN003,CHRONIC KIDNEY DISEASE,URN011,KIDNEY TRANSPLANT,440,KIDNEY TRANSPLANT,11,DISEASES AND DISORDERS OF THE KIDNEY AND URINARY TRACT,3,Major,Major,Surgical,Blue Cross/Blue Shield,Self-Pay,,,,false,190156.4,45721.37
New York City,Manhattan,7002053,001463,NYU Langone Hospitals,50 to 69,112,F,White,Not Span/Hispanic,5,Elective,Home w/ Home Health Services,2019,GEN003,CHRONIC KIDNEY DISEASE,URN011,KIDNEY TRANSPLANT,440,KIDNEY TRANSPLANT,11,DISEASES AND DISORDERS OF THE KIDNEY AND URINARY TRACT,2,Moderate,Moderate,Surgical,Blue Cross/Blue Shield,,,,,false,598879.46,245206.8
New York City,Manhattan,7002024,001456,Mount Sinai Hospital,50 to 69,112,M,Other Race,Spanish/Hispanic,3,Elective,Home or Self Care,2019,GEN003,CHRONIC KIDNEY DISEASE,URN011,KIDNEY TRANSPLANT,440,KIDNEY TRANSPLANT,11,DISEASES AND DISORDERS OF THE KIDNEY AND URINARY TRACT,2,Moderate,Moderate,Surgical,Medicaid,Medicaid,Self-Pay,,,false,191882.6,68524.56
Finger Lakes,Monroe,2701005,000413,Strong Memorial Hospital,50 to 69,146,M,White,Not Span/Hispanic,4,Elective,Home w/ Home Health Services,2019,GEN003,CHRONIC KIDNEY DISEASE,URN011,KIDNEY TRANSPLANT,440,KIDNEY TRANSPLANT,11,DISEASES AND DISORDERS OF THE KIDNEY AND URINARY TRACT,2,Moderate,Minor,Surgical,Blue Cross/Blue Shield,,,,,false,93024.25,52522.01
Finger Lakes,Monroe,2701005,000413,Strong Memorial Hospital,50 to 69,149,M,White,Not Span/Hispanic,4,Urgent,Home or Self Care,2019,GEN003,CHRONIC KIDNEY DISEASE,URN011,KIDNEY TRANSPLANT,440,KIDNEY TRANSPLANT,11,DISEASES AND DISORDERS OF THE KIDNEY AND URINARY TRACT,3,Major,Moderate,Surgical,Medicare,,,,,false,130473.18,68760.64
Finger Lakes,Monroe,2701005,000413,Strong Memorial Hospital,30 to 49,146,M,Black/African American,Not Span/Hispanic,5,Urgent,Home w/ Home Health Services,2019,END003,DIABETES MELLITUS WITH COMPLICATION,URN011,KIDNEY TRANSPLANT,440,KIDNEY TRANSPLANT,11,DISEASES AND DISORDERS OF THE KIDNEY AND URINARY TRACT,3,Major,Major,Surgical,Medicare,Blue Cross/Blue Shield,,,,false,139722.7,73540.29
Finger Lakes,Monroe,2701005,000413,Strong Memorial Hospital,50 to 69,146,F,Black/African American,Not Span/Hispanic,6,Urgent,Home w/ Home Health Services,2019,GEN003,CHRONIC KIDNEY DISEASE,URN011,KIDNEY TRANSPLANT,440,KIDNEY TRANSPLANT,11,DISEASES AND DISORDERS OF THE KIDNEY AND URINARY TRACT,3,Major,Major,Surgical,Medicare,Private Health Insurance,,,,false,138246.51,74831.05
New York City,Manhattan,7002054,001464,New York-Presbyterian Hospital - Columbia Presbyterian Center,30 to 49,112,M,Black/African American,Not Span/Hispanic,4,Urgent,Home or Self Care,2019,GEN003,CHRONIC KIDNEY DISEASE,URN011,KIDNEY TRANSPLANT,440,KIDNEY TRANSPLANT,11,DISEASES AND DISORDERS OF THE KIDNEY AND URINARY TRACT,3,Major,Major,Surgical,Medicare,Medicaid,Self-Pay,,,false,228653.85,59794.53
Western NY,Erie,1401005,000210,Erie County Medical Center,50 to 69,142,F,White,Not Span/Hispanic,5,Elective,Home or Self Care,2019,GEN003,CHRONIC KIDNEY DISEASE,URN011,KIDNEY TRANSPLANT,440,KIDNEY TRANSPLANT,11,DISEASES AND DISORDERS OF THE KIDNEY AND URINARY TRACT,3,Major,Moderate,Surgical,Blue Cross/Blue Shield,Blue Cross/Blue Shield,,,,false,170147.41,153689.63
New York City,Manhattan,7002054,001464,New York-Presbyterian Hospital - Columbia Presbyterian Center,50 to 69,105,F,White,Spanish/Hispanic,4,Elective,Home w/ Home Health Services,2019,END003,DIABETES MELLITUS WITH COMPLICATION,URN011,KIDNEY TRANSPLANT,440,KIDNEY TRANSPLANT,11,DISEASES AND DISORDERS OF THE KIDNEY AND URINARY TRACT,2,Moderate,Moderate,Surgical,Medicare,Medicaid,Self-Pay,,,false,193891.42,49452.9
New York City,Manhattan,7002024,001456,Mount Sinai Hospital,50 to 69,112,M,Other Race,Not Span/Hispanic,6,Elective,Home w/ Home Health Services,2019,GEN003,CHRONIC KIDNEY DISEASE,URN011,KIDNEY TRANSPLANT,440,KIDNEY TRANSPLANT,11,DISEASES AND DISORDERS OF THE KIDNEY AND URINARY TRACT,3,Major,Moderate,Surgical,Medicare,Medicaid,Self-Pay,,,false,216678.96,74389.46
New York City,Manhattan,7002054,001458,New York-Presbyterian Hospital - New York Weill Cornell Center,50 to 69,117,F,White,Not Span/Hispanic,6,Elective,Home or Self Care,2019,GEN003,CHRONIC KIDNEY DISEASE,URN011,KIDNEY TRANSPLANT,440,KIDNEY TRANSPLANT,11,DISEASES AND DISORDERS OF THE KIDNEY AND URINARY TRACT,2,Moderate,Moderate,Surgical,Medicare,Self-Pay,,,,false,240253.25,62185.17
Central NY,Onondaga,3301007,000635,University Hospital SUNY Health Science Center,30 to 49,135,M,Other Race,Not Span/Hispanic,32,Emergency,Home or Self Care,2019,GEN003,CHRONIC KIDNEY DISEASE,URN011,KIDNEY TRANSPLANT,440,KIDNEY TRANSPLANT,11,DISEASES AND DISORDERS OF THE KIDNEY AND URINARY TRACT,4,Extreme,Extreme,Surgical,Medicare,,,,,false,547715.52,226782.07
Finger Lakes,Monroe,2701005,000413,Strong Memorial Hospital,30 to 49,146,F,Other Race,Spanish/Hispanic,13,Urgent,Home w/ Home Health Services,2019,END003,DIABETES MELLITUS WITH COMPLICATION,URN011,KIDNEY TRANSPLANT,440,KIDNEY TRANSPLANT,11,DISEASES AND DISORDERS OF THE KIDNEY AND URINARY TRACT,3,Major,Major,Surgical,Medicare,Medicaid,,,,false,158645.6,84067.5
Finger Lakes,Monroe,2701005,000413,Strong Memorial Hospital,30 to 49,146,F,Black/African American,Not Span/Hispanic,25,Urgent,Home or Self Care,2019,GEN003,CHRONIC KIDNEY DISEASE,URN011,KIDNEY TRANSPLANT,440,KIDNEY TRANSPLANT,11,DISEASES AND DISORDERS OF THE KIDNEY AND URINARY TRACT,3,Major,Major,Surgical,Medicaid,,,,,false,260520.08,126180.13
Finger Lakes,Monroe,2701005,000413,Strong Memorial Hospital,50 to 69,145,F,White,Not Span/Hispanic,3,Elective,Home w/ Home Health Services,2019,GEN003,CHRONIC KIDNEY DISEASE,URN011,KIDNEY TRANSPLANT,440,KIDNEY TRANSPLANT,11,DISEASES AND DISORDERS OF THE KIDNEY AND URINARY TRACT,2,Moderate,Minor,Surgical,Medicare,,,,,false,89610.95,50544.4
New York City,Manhattan,7002053,001463,NYU Langone Hospitals,50 to 69,113,F,White,Not Span/Hispanic,4,Elective,Home w/ Home Health Services,2019,END003,DIABETES MELLITUS WITH COMPLICATION,URN011,KIDNEY TRANSPLANT,440,KIDNEY TRANSPLANT,11,DISEASES AND DISORDERS OF THE KIDNEY AND URINARY TRACT,3,Major,Major,Surgical,Medicare,Medicare,Medicaid,,,false,629514.77,244033.53