Hospital Service Area,Hospital County,Operating Certificate Number,Permanent Facility Id,Facility Name,Age Group,Zip Code - 3 digits,Gender,Race,Ethnicity,Length of Stay,Type of Admission,Patient Disposition,Discharge Year,CCS Diagnosis Code,CCS Diagnosis Description,CCS Procedure Code,CCS Procedure Description,APR DRG Code,APR DRG Description,APR MDC Code,APR MDC Description,APR Severity of Illness Code,APR Severity of Illness Description,APR Risk of Mortality,APR Medical Surgical Description,Payment Typology 1,Payment Typology 2,Payment Typology 3,Birth Weight,Abortion Edit Indicator,Emergency Department Indicator,Total Charges,Total Costs
New York City,Manhattan,7002020,001453,Memorial Hospital for Cancer and Allied Diseases,70 or Older,117,F,White,Not Span/Hispanic,4,Elective,Home or Self Care,2018,NEO043,URINARY SYSTEM CANCERS - BLADDER,URN009,CYSTECTOMY (INCLUDING FULGURATION) AND URETHRECTOMY,441,MAJOR BLADDER PROCEDURES,11,DISEASES AND DISORDERS OF THE KIDNEY AND URINARY TRACT,3,Major,Moderate,Surgical,Medicare,Private Health Insurance,Medicare,,,false,106216.68,42670.9
New York City,Manhattan,7002054,001464,New York-Presbyterian Hospital - Columbia Presbyterian Center,50 to 69,104,M,Black/African American,Not Span/Hispanic,2,Elective,Home or Self Care,2018,GEN007,OTHER SPECIFIED AND UNSPECIFIED DISEASES OF BLADDER AND URETHRA,GIS009,COLECTOMY,441,MAJOR BLADDER PROCEDURES,11,DISEASES AND DISORDERS OF THE KIDNEY AND URINARY TRACT,2,Moderate,Minor,Surgical,Private Health Insurance,Self-Pay,,,,false,63315.02,19698.49
Western NY,Erie,1401014,000207,Buffalo General Medical Center,18 to 29,140,F,White,Not Span/Hispanic,6,Elective,Home w/ Home Health Services,2018,GEN026,POSTPROCEDURAL OR POSTOPERATIVE GENITOURINARY SYSTEM COMPLICATION,URN010,URINARY DIVERSION WITH ANASTOMOSIS OR OSTOMY,441,MAJOR BLADDER PROCEDURES,11,DISEASES AND DISORDERS OF THE KIDNEY AND URINARY TRACT,2,Moderate,Minor,Surgical,Private Health Insurance,Medicaid,Self-Pay,,,false,55644.92,19843.05
New York City,Manhattan,7002024,001456,Mount Sinai Hospital,0 to 17,113,M,Other Race,Spanish/Hispanic,8,Elective,Home or Self Care,2018,GEN007,OTHER SPECIFIED AND UNSPECIFIED DISEASES OF BLADDER AND URETHRA,GIS011,SMALL BOWEL RESECTION,441,MAJOR BLADDER PROCEDURES,11,DISEASES AND DISORDERS OF THE KIDNEY AND URINARY TRACT,2,Moderate,Moderate,Surgical,Medicaid,Medicaid,Self-Pay,,,false,93404.82,61211.48
Hudson Valley,Westchester,5957001,001139,Westchester Medical Center,0 to 17,125,M,White,Not Span/Hispanic,7,Emergency,Home or Self Care,2018,INJ010,"INTERNAL ORGAN INJURY, INITIAL ENCOUNTER",URN007,URINARY TRACT REPAIR,441,MAJOR BLADDER PROCEDURES,11,DISEASES AND DISORDERS OF THE KIDNEY AND URINARY TRACT,3,Major,Moderate,Surgical,Blue Cross/Blue Shield,Medicaid,,,,true,176020.59,31798.7
Long Island,Suffolk,5151001,000245,Stony Brook University Hospital,50 to 69,117,M,White,Not Span/Hispanic,4,Elective,Home w/ Home Health Services,2018,NEO043,URINARY SYSTEM CANCERS - BLADDER,URN009,CYSTECTOMY (INCLUDING FULGURATION) AND URETHRECTOMY,441,MAJOR BLADDER PROCEDURES,11,DISEASES AND DISORDERS OF THE KIDNEY AND URINARY TRACT,3,Major,Moderate,Surgical,Private Health Insurance,,,,,false,75690.71,33030.72
Central NY,Onondaga,3301007,000635,University Hospital SUNY Health Science Center,30 to 49,130,M,White,Not Span/Hispanic,6,Elective,Home or Self Care,2018,MAL003,GENITOURINARY CONGENITAL ANOMALIES,URN010,URINARY DIVERSION WITH ANASTOMOSIS OR OSTOMY,441,MAJOR BLADDER PROCEDURES,11,DISEASES AND DISORDERS OF THE KIDNEY AND URINARY TRACT,2,Moderate,Minor,Surgical,Medicaid,,,,,false,99115.14,29010.95
Finger Lakes,Monroe,2701005,000413,Strong Memorial Hospital,0 to 17,145,M,Black/African American,Not Span/Hispanic,4,Elective,Home or Self Care,2018,GEN026,POSTPROCEDURAL OR POSTOPERATIVE GENITOURINARY SYSTEM COMPLICATION,URN007,URINARY TRACT REPAIR,441,MAJOR BLADDER PROCEDURES,11,DISEASES AND DISORDERS OF THE KIDNEY AND URINARY TRACT,1,Minor,Minor,Surgical,Medicaid,Medicaid,Self-Pay,,,false,19539.03,10722.87
New York City,Manhattan,7002054,001464,New York-Presbyterian Hospital - Columbia Presbyterian Center,50 to 69,103,M,White,Not Span/Hispanic,5,Elective,Home w/ Home Health Services,2018,NEO043,URINARY SYSTEM CANCERS - BLADDER,URN009,CYSTECTOMY (INCLUDING FULGURATION) AND URETHRECTOMY,441,MAJOR BLADDER PROCEDURES,11,DISEASES AND DISORDERS OF THE KIDNEY AND URINARY TRACT,2,Moderate,Minor,Surgical,Medicare,Medicare,Self-Pay,,,false,107976.76,37318.24
New York City,Manhattan,7002053,001463,NYU Langone Hospitals,70 or Older,112,M,Black/African American,Not Span/Hispanic,38,Elective,Skilled Nursing Home,2018,GEN007,OTHER SPECIFIED AND UNSPECIFIED DISEASES OF BLADDER AND URETHRA,GIS011,SMALL BOWEL RESECTION,441,MAJOR BLADDER PROCEDURES,11,DISEASES AND DISORDERS OF THE KIDNEY AND URINARY TRACT,4,Extreme,Extreme,Surgical,Medicare,Medicaid,,,,false,1245046.28,351078.68
Western NY,Erie,1401014,003067,Millard Fillmore Suburban Hospital,70 or Older,142,F,White,Not Span/Hispanic,7,Elective,Home w/ Home Health Services,2018,NEO043,URINARY SYSTEM CANCERS - BLADDER,URN009,CYSTECTOMY (INCLUDING FULGURATION) AND URETHRECTOMY,441,MAJOR BLADDER PROCEDURES,11,DISEASES AND DISORDERS OF THE KIDNEY AND URINARY TRACT,3,Major,Moderate,Surgical,Medicare,Blue Cross/Blue Shield,Self-Pay,,,false,91030.71,28120.21
New York City,Manhattan,7002024,001456,Mount Sinai Hospital,50 to 69,112,M,Other Race,Not Span/Hispanic,4,Elective,Home w/ Home Health Services,2018,NEO043,URINARY SYSTEM CANCERS - BLADDER,URN010,URINARY DIVERSION WITH ANASTOMOSIS OR OSTOMY,441,MAJOR BLADDER PROCEDURES,11,DISEASES AND DISORDERS OF THE KIDNEY AND URINARY TRACT,3,Major,Moderate,Surgical,Medicare,Medicare,Medicaid,,,false,67056.2,24496.54
Long Island,Nassau,2951001,000541,North Shore University Hospital,18 to 29,117,M,White,Not Span/Hispanic,5,Elective,Home or Self Care,2018,GEN007,OTHER SPECIFIED AND UNSPECIFIED DISEASES OF BLADDER AND URETHRA,URN007,URINARY TRACT REPAIR,441,MAJOR BLADDER PROCEDURES,11,DISEASES AND DISORDERS OF THE KIDNEY AND URINARY TRACT,2,Moderate,Moderate,Surgical,Blue Cross/Blue Shield,Medicare,,,,false,72125.69,16796.25
New York City,Manhattan,7002020,001453,Memorial Hospital for Cancer and Allied Diseases,70 or Older,105,F,White,Not Span/Hispanic,8,Elective,Home w/ Home Health Services,2018,NEO043,URINARY SYSTEM CANCERS - BLADDER,URN012,"URINARY SYSTEM PROCEDURES, NEC",441,MAJOR BLADDER PROCEDURES,11,DISEASES AND DISORDERS OF THE KIDNEY AND URINARY TRACT,3,Major,Major,Surgical,Medicare,Private Health Insurance,,,,false,97872.38,36206.63
New York City,Manhattan,7002020,001453,Memorial Hospital for Cancer and Allied Diseases,70 or Older,OOS,M,White,Not Span/Hispanic,10,Elective,Short-term Hospital,2018,NEO043,URINARY SYSTEM CANCERS - BLADDER,URN009,CYSTECTOMY (INCLUDING FULGURATION) AND URETHRECTOMY,441,MAJOR BLADDER PROCEDURES,11,DISEASES AND DISORDERS OF THE KIDNEY AND URINARY TRACT,4,Extreme,Extreme,Surgical,Medicare,Private Health Insurance,,,,false,212930.94,86516.69
New York City,Manhattan,7002020,001453,Memorial Hospital for Cancer and Allied Diseases,70 or Older,103,M,White,Unknown,4,Elective,Home w/ Home Health Services,2018,NEO043,URINARY SYSTEM CANCERS - BLADDER,URN012,"URINARY SYSTEM PROCEDURES, NEC",441,MAJOR BLADDER PROCEDURES,11,DISEASES AND DISORDERS OF THE KIDNEY AND URINARY TRACT,3,Major,Major,Surgical,Medicare,Blue Cross/Blue Shield,,,,false,74526.07,28476.5
Finger Lakes,Monroe,2701003,000411,Rochester General Hospital,70 or Older,145,M,White,Not Span/Hispanic,34,Elective,Home w/ Home Health Services,2018,NEO043,URINARY SYSTEM CANCERS - BLADDER,URN009,CYSTECTOMY (INCLUDING FULGURATION) AND URETHRECTOMY,441,MAJOR BLADDER PROCEDURES,11,DISEASES AND DISORDERS OF THE KIDNEY AND URINARY TRACT,4,Extreme,Extreme,Surgical,Medicare,,,,,false,231114.67,99899.28
New York City,Manhattan,7002054,001464,New York-Presbyterian Hospital - Columbia Presbyterian Center,70 or Older,OOS,M,White,Not Span/Hispanic,7,Elective,Home w/ Home Health Services,2018,NEO043,URINARY SYSTEM CANCERS - BLADDER,MRS003,PROSTATECTOMY,441,MAJOR BLADDER PROCEDURES,11,DISEASES AND DISORDERS OF THE KIDNEY AND URINARY TRACT,2,Moderate,Moderate,Surgical,Medicare,Blue Cross/Blue Shield,Self-Pay,,,false,143500.03,48881.37
Central NY,Onondaga,3301007,000635,University Hospital SUNY Health Science Center,70 or Older,130,M,White,Not Span/Hispanic,7,Emergency,Home w/ Home Health Services,2018,NEO043,URINARY SYSTEM CANCERS - BLADDER,URN009,CYSTECTOMY (INCLUDING FULGURATION) AND URETHRECTOMY,441,MAJOR BLADDER PROCEDURES,11,DISEASES AND DISORDERS OF THE KIDNEY AND URINARY TRACT,3,Major,Minor,Surgical,Medicare,,,,,true,92825.92,26746.07
New York City,Manhattan,7002020,001453,Memorial Hospital for Cancer and Allied Diseases,70 or Older,OOS,M,White,Not Span/Hispanic,7,Elective,Home w/ Home Health Services,2018,NEO043,URINARY SYSTEM CANCERS - BLADDER,URN012,"URINARY SYSTEM PROCEDURES, NEC",441,MAJOR BLADDER PROCEDURES,11,DISEASES AND DISORDERS OF THE KIDNEY AND URINARY TRACT,3,Major,Major,Surgical,Blue Cross/Blue Shield,Medicare,,,,false,90405.63,35250.14
Central NY,Onondaga,3301007,000635,University Hospital SUNY Health Science Center,18 to 29,136,F,White,Not Span/Hispanic,2,Emergency,Home or Self Care,2018,GEN005,CALCULUS OF URINARY TRACT,URN007,URINARY TRACT REPAIR,441,MAJOR BLADDER PROCEDURES,11,DISEASES AND DISORDERS OF THE KIDNEY AND URINARY TRACT,2,Moderate,Minor,Surgical,Federal/State/Local/VA,,,,,false,50110.6,14055.91
New York City,Kings,7001016,001301,Kings County Hospital Center,30 to 49,112,F,Black/African American,Not Span/Hispanic,14,Emergency,Home w/ Home Health Services,2018,NEO046,URINARY SYSTEM CANCERS - URETHRA,URN009,CYSTECTOMY (INCLUDING FULGURATION) AND URETHRECTOMY,441,MAJOR BLADDER PROCEDURES,11,DISEASES AND DISORDERS OF THE KIDNEY AND URINARY TRACT,2,Moderate,Minor,Surgical,Medicaid,Medicaid,,,,true,107299.06,76221.07
Hudson Valley,Westchester,5902001,001045,White Plains Hospital Center,70 or Older,OOS,F,Black/African American,Not Span/Hispanic,8,Urgent,Home w/ Home Health Services,2018,NEO043,URINARY SYSTEM CANCERS - BLADDER,URN009,CYSTECTOMY (INCLUDING FULGURATION) AND URETHRECTOMY,441,MAJOR BLADDER PROCEDURES,11,DISEASES AND DISORDERS OF THE KIDNEY AND URINARY TRACT,2,Moderate,Minor,Surgical,Medicare,Blue Cross/Blue Shield,,,,false,114456,29505.61
New York City,Manhattan,7002020,001453,Memorial Hospital for Cancer and Allied Diseases,50 to 69,112,M,White,Not Span/Hispanic,5,Elective,Home w/ Home Health Services,2018,NEO043,URINARY SYSTEM CANCERS - BLADDER,URN012,"URINARY SYSTEM PROCEDURES, NEC",441,MAJOR BLADDER PROCEDURES,11,DISEASES AND DISORDERS OF THE KIDNEY AND URINARY TRACT,3,Major,Major,Surgical,Medicare,Blue Cross/Blue Shield,,,,false,104610.11,42084.12
Long Island,Nassau,2908000,000511,NYU Langone Hospital-Long Island,50 to 69,115,M,White,Not Span/Hispanic,6,Elective,Home w/ Home Health Services,2018,NEO043,URINARY SYSTEM CANCERS - BLADDER,URN009,CYSTECTOMY (INCLUDING FULGURATION) AND URETHRECTOMY,441,MAJOR BLADDER PROCEDURES,11,DISEASES AND DISORDERS OF THE KIDNEY AND URINARY TRACT,2,Moderate,Minor,Surgical,Blue Cross/Blue Shield,Medicare,Medicare,,,false,211497.46,34941.58
Hudson Valley,Westchester,5902001,001045,White Plains Hospital Center,30 to 49,107,M,Other Race,Not Span/Hispanic,6,Urgent,Home w/ Home Health Services,2018,NEO043,URINARY SYSTEM CANCERS - BLADDER,MRS003,PROSTATECTOMY,441,MAJOR BLADDER PROCEDURES,11,DISEASES AND DISORDERS OF THE KIDNEY AND URINARY TRACT,3,Major,Major,Surgical,Blue Cross/Blue Shield,Private Health Insurance,,,,false,118525,27895.66
New York City,Manhattan,7002020,001453,Memorial Hospital for Cancer and Allied Diseases,50 to 69,OOS,M,White,Not Span/Hispanic,4,Elective,Home w/ Home Health Services,2018,NEO043,URINARY SYSTEM CANCERS - BLADDER,URN012,"URINARY SYSTEM PROCEDURES, NEC",441,MAJOR BLADDER PROCEDURES,11,DISEASES AND DISORDERS OF THE KIDNEY AND URINARY TRACT,3,Major,Moderate,Surgical,Private Health Insurance,,,,,false,80831.17,33600.46
New York City,Manhattan,7002020,001453,Memorial Hospital for Cancer and Allied Diseases,70 or Older,105,M,White,Not Span/Hispanic,5,Elective,Home w/ Home Health Services,2018,NEO043,URINARY SYSTEM CANCERS - BLADDER,URN012,"URINARY SYSTEM PROCEDURES, NEC",441,MAJOR BLADDER PROCEDURES,11,DISEASES AND DISORDERS OF THE KIDNEY AND URINARY TRACT,3,Major,Major,Surgical,Medicare,Blue Cross/Blue Shield,Medicare,,,false,93602.14,37122.37
New York City,Manhattan,7002020,001453,Memorial Hospital for Cancer and Allied Diseases,50 to 69,105,M,Other Race,Spanish/Hispanic,4,Elective,Home w/ Home Health Services,2018,NEO043,URINARY SYSTEM CANCERS - BLADDER,URN012,"URINARY SYSTEM PROCEDURES, NEC",441,MAJOR BLADDER PROCEDURES,11,DISEASES AND DISORDERS OF THE KIDNEY AND URINARY TRACT,3,Major,Major,Surgical,Private Health Insurance,Medicare,,,,false,88513.87,35315.18
New York City,Manhattan,7002020,001453,Memorial Hospital for Cancer and Allied Diseases,70 or Older,117,M,White,Not Span/Hispanic,3,Elective,Home w/ Home Health Services,2018,NEO043,URINARY SYSTEM CANCERS - BLADDER,URN009,CYSTECTOMY (INCLUDING FULGURATION) AND URETHRECTOMY,441,MAJOR BLADDER PROCEDURES,11,DISEASES AND DISORDERS OF THE KIDNEY AND URINARY TRACT,3,Major,Moderate,Surgical,Medicare,Blue Cross/Blue Shield,Medicare,,,false,90959.31,37514.73
Central NY,Onondaga,3301008,000636,Crouse Hospital,50 to 69,134,M,White,Not Span/Hispanic,7,Elective,Home w/ Home Health Services,2018,NEO043,URINARY SYSTEM CANCERS - BLADDER,URN009,CYSTECTOMY (INCLUDING FULGURATION) AND URETHRECTOMY,441,MAJOR BLADDER PROCEDURES,11,DISEASES AND DISORDERS OF THE KIDNEY AND URINARY TRACT,3,Major,Major,Surgical,Blue Cross/Blue Shield,Medicare,,,,false,65919.49,28398.02
Western NY,Erie,1401014,003067,Millard Fillmore Suburban Hospital,50 to 69,140,M,White,Not Span/Hispanic,7,Elective,Home w/ Home Health Services,2018,NEO043,URINARY SYSTEM CANCERS - BLADDER,URN009,CYSTECTOMY (INCLUDING FULGURATION) AND URETHRECTOMY,441,MAJOR BLADDER PROCEDURES,11,DISEASES AND DISORDERS OF THE KIDNEY AND URINARY TRACT,3,Major,Moderate,Surgical,Medicare,Self-Pay,,,,false,101087.02,31127.3
Western NY,Erie,1401014,003067,Millard Fillmore Suburban Hospital,50 to 69,147,M,White,Not Span/Hispanic,5,Elective,Home w/ Home Health Services,2018,NEO043,URINARY SYSTEM CANCERS - BLADDER,URN009,CYSTECTOMY (INCLUDING FULGURATION) AND URETHRECTOMY,441,MAJOR BLADDER PROCEDURES,11,DISEASES AND DISORDERS OF THE KIDNEY AND URINARY TRACT,3,Major,Minor,Surgical,Federal/State/Local/VA,Self-Pay,,,,false,108588.85,31567.29
New York City,Queens,7003010,001637,New York - Presbyterian/Queens,50 to 69,114,M,White,Not Span/Hispanic,4,Elective,Home or Self Care,2018,NEO043,URINARY SYSTEM CANCERS - BLADDER,URN009,CYSTECTOMY (INCLUDING FULGURATION) AND URETHRECTOMY,441,MAJOR BLADDER PROCEDURES,11,DISEASES AND DISORDERS OF THE KIDNEY AND URINARY TRACT,3,Major,Minor,Surgical,Private Health Insurance,"Managed Care, Unspecified",Self-Pay,,,false,71806.64,30703.51
Central NY,Onondaga,3301007,000628,UPSTATE University Hospital at Community General,70 or Older,131,F,White,Not Span/Hispanic,8,Elective,Home w/ Home Health Services,2018,NEO043,URINARY SYSTEM CANCERS - BLADDER,URN009,CYSTECTOMY (INCLUDING FULGURATION) AND URETHRECTOMY,441,MAJOR BLADDER PROCEDURES,11,DISEASES AND DISORDERS OF THE KIDNEY AND URINARY TRACT,3,Major,Moderate,Surgical,Medicare,,,,,false,110323.04,39590.15
Central NY,Onondaga,3301008,000636,Crouse Hospital,50 to 69,130,F,White,Not Span/Hispanic,7,Elective,Home or Self Care,2018,GEN007,OTHER SPECIFIED AND UNSPECIFIED DISEASES OF BLADDER AND URETHRA,URN007,URINARY TRACT REPAIR,441,MAJOR BLADDER PROCEDURES,11,DISEASES AND DISORDERS OF THE KIDNEY AND URINARY TRACT,2,Moderate,Moderate,Surgical,Blue Cross/Blue Shield,,,,,false,45009.83,19420.64
New York City,Manhattan,7002020,001453,Memorial Hospital for Cancer and Allied Diseases,50 to 69,117,M,White,Not Span/Hispanic,4,Elective,Home w/ Home Health Services,2018,NEO043,URINARY SYSTEM CANCERS - BLADDER,URN012,"URINARY SYSTEM PROCEDURES, NEC",441,MAJOR BLADDER PROCEDURES,11,DISEASES AND DISORDERS OF THE KIDNEY AND URINARY TRACT,3,Major,Moderate,Surgical,Private Health Insurance,,,,,false,95303.29,39572.63
New York City,Kings,7001009,001294,Coney Island Hospital,50 to 69,112,M,White,Not Span/Hispanic,21,Emergency,Home or Self Care,2018,GEN007,OTHER SPECIFIED AND UNSPECIFIED DISEASES OF BLADDER AND URETHRA,URN006,BLADDER CATHETERIZATION AND DRAINAGE,441,MAJOR BLADDER PROCEDURES,11,DISEASES AND DISORDERS OF THE KIDNEY AND URINARY TRACT,4,Extreme,Extreme,Surgical,Medicaid,Medicaid,,,,true,182404.5,102097.09
New York City,Manhattan,7002054,001464,New York-Presbyterian Hospital - Columbia Presbyterian Center,70 or Older,109,M,White,Not Span/Hispanic,5,Elective,Home w/ Home Health Services,2018,NEO043,URINARY SYSTEM CANCERS - BLADDER,URN012,"URINARY SYSTEM PROCEDURES, NEC",441,MAJOR BLADDER PROCEDURES,11,DISEASES AND DISORDERS OF THE KIDNEY AND URINARY TRACT,2,Moderate,Moderate,Surgical,Medicare,Private Health Insurance,Self-Pay,,,false,119489.97,34540.93
Western NY,Erie,1401010,000216,Roswell Park Cancer Institute,70 or Older,140,M,White,Not Span/Hispanic,8,Elective,Home w/ Home Health Services,2018,NEO043,URINARY SYSTEM CANCERS - BLADDER,URN009,CYSTECTOMY (INCLUDING FULGURATION) AND URETHRECTOMY,441,MAJOR BLADDER PROCEDURES,11,DISEASES AND DISORDERS OF THE KIDNEY AND URINARY TRACT,2,Moderate,Minor,Surgical,"Managed Care, Unspecified",,,,,false,99826.3,34198.69
New York City,Kings,7001020,001305,Maimonides Medical Center,50 to 69,112,M,White,Unknown,4,Elective,Home w/ Home Health Services,2018,GEN007,OTHER SPECIFIED AND UNSPECIFIED DISEASES OF BLADDER AND URETHRA,GIS016,GI SYSTEM ENDOSCOPIC THERAPEUTIC PROCEDURES,441,MAJOR BLADDER PROCEDURES,11,DISEASES AND DISORDERS OF THE KIDNEY AND URINARY TRACT,2,Moderate,Minor,Surgical,Medicaid,Medicaid,Self-Pay,,,false,75932.03,25000.39
New York City,Kings,7001021,001306,New York - Presbyterian Brooklyn Methodist Hospital,70 or Older,112,F,White,Not Span/Hispanic,6,Elective,Home w/ Home Health Services,2018,NEO043,URINARY SYSTEM CANCERS - BLADDER,URN012,"URINARY SYSTEM PROCEDURES, NEC",441,MAJOR BLADDER PROCEDURES,11,DISEASES AND DISORDERS OF THE KIDNEY AND URINARY TRACT,3,Major,Minor,Surgical,Medicare,Medicaid,Self-Pay,,,false,50285.12,20128.45
New York City,Queens,7003000,001626,Elmhurst Hospital Center,30 to 49,114,F,Other Race,Not Span/Hispanic,6,Elective,Home or Self Care,2018,NEO043,URINARY SYSTEM CANCERS - BLADDER,URN009,CYSTECTOMY (INCLUDING FULGURATION) AND URETHRECTOMY,441,MAJOR BLADDER PROCEDURES,11,DISEASES AND DISORDERS OF THE KIDNEY AND URINARY TRACT,3,Major,Minor,Surgical,Medicaid,Medicaid,,,,false,63268.84,37642.81
Hudson Valley,Westchester,5902001,001045,White Plains Hospital Center,70 or Older,126,F,Other Race,Not Span/Hispanic,10,Elective,Home w/ Home Health Services,2018,GEN004,URINARY TRACT INFECTIONS,URN009,CYSTECTOMY (INCLUDING FULGURATION) AND URETHRECTOMY,441,MAJOR BLADDER PROCEDURES,11,DISEASES AND DISORDERS OF THE KIDNEY AND URINARY TRACT,2,Moderate,Moderate,Surgical,Medicare,Private Health Insurance,,,,false,128708,33036.5
Long Island,Nassau,2950001,000527,Mount Sinai South Nassau,70 or Older,110,M,Black/African American,Not Span/Hispanic,3,Emergency,Home or Self Care,2018,INJ034,"COMPLICATION OF GENITOURINARY DEVICE, IMPLANT OR GRAFT, INITIAL ENCOUNTER",URN007,URINARY TRACT REPAIR,441,MAJOR BLADDER PROCEDURES,11,DISEASES AND DISORDERS OF THE KIDNEY AND URINARY TRACT,3,Major,Major,Surgical,Medicare,Medicare,,,,true,53142.1,9156.68
New York City,Manhattan,7002054,001464,New York-Presbyterian Hospital - Columbia Presbyterian Center,0 to 17,112,M,White,Not Span/Hispanic,8,Emergency,Home or Self Care,2018,GEN007,OTHER SPECIFIED AND UNSPECIFIED DISEASES OF BLADDER AND URETHRA,URN010,URINARY DIVERSION WITH ANASTOMOSIS OR OSTOMY,441,MAJOR BLADDER PROCEDURES,11,DISEASES AND DISORDERS OF THE KIDNEY AND URINARY TRACT,2,Moderate,Minor,Surgical,Private Health Insurance,Medicaid,Self-Pay,,,false,149590.66,53417.68
Long Island,Suffolk,5151001,000245,Stony Brook University Hospital,70 or Older,119,M,White,Not Span/Hispanic,11,Elective,Skilled Nursing Home,2018,NEO043,URINARY SYSTEM CANCERS - BLADDER,URN009,CYSTECTOMY (INCLUDING FULGURATION) AND URETHRECTOMY,441,MAJOR BLADDER PROCEDURES,11,DISEASES AND DISORDERS OF THE KIDNEY AND URINARY TRACT,3,Major,Moderate,Surgical,Medicare,Medicare,,,,false,171969.51,63999.34
New York City,Manhattan,7002020,001453,Memorial Hospital for Cancer and Allied Diseases,30 to 49,117,M,White,Not Span/Hispanic,5,Elective,Home w/ Home Health Services,2018,NEO043,URINARY SYSTEM CANCERS - BLADDER,URN012,"URINARY SYSTEM PROCEDURES, NEC",441,MAJOR BLADDER PROCEDURES,11,DISEASES AND DISORDERS OF THE KIDNEY AND URINARY TRACT,3,Major,Minor,Surgical,Private Health Insurance,,,,,false,116187.84,47747.96
New York City,Manhattan,7002020,001453,Memorial Hospital for Cancer and Allied Diseases,50 to 69,107,M,Other Race,Spanish/Hispanic,5,Elective,Home or Self Care,2018,NEO043,URINARY SYSTEM CANCERS - BLADDER,URN012,"URINARY SYSTEM PROCEDURES, NEC",441,MAJOR BLADDER PROCEDURES,11,DISEASES AND DISORDERS OF THE KIDNEY AND URINARY TRACT,2,Moderate,Moderate,Surgical,Medicare,Private Health Insurance,,,,false,105252.76,41791.46
New York City,Manhattan,7002020,001453,Memorial Hospital for Cancer and Allied Diseases,50 to 69,117,F,White,Not Span/Hispanic,5,Elective,Home w/ Home Health Services,2018,NEO043,URINARY SYSTEM CANCERS - BLADDER,URN009,CYSTECTOMY (INCLUDING FULGURATION) AND URETHRECTOMY,441,MAJOR BLADDER PROCEDURES,11,DISEASES AND DISORDERS OF THE KIDNEY AND URINARY TRACT,3,Major,Minor,Surgical,Medicare,Private Health Insurance,,,,false,96169.87,37146.13
Long Island,Suffolk,5151001,000245,Stony Brook University Hospital,30 to 49,117,F,White,Not Span/Hispanic,2,Urgent,Home or Self Care,2018,GEN005,CALCULUS OF URINARY TRACT,URN009,CYSTECTOMY (INCLUDING FULGURATION) AND URETHRECTOMY,441,MAJOR BLADDER PROCEDURES,11,DISEASES AND DISORDERS OF THE KIDNEY AND URINARY TRACT,2,Moderate,Moderate,Surgical,Private Health Insurance,,,,,false,45619.62,19852.49
Central NY,Onondaga,3301007,000635,University Hospital SUNY Health Science Center,50 to 69,130,M,White,Not Span/Hispanic,3,Elective,Home w/ Home Health Services,2018,NEO043,URINARY SYSTEM CANCERS - BLADDER,URN009,CYSTECTOMY (INCLUDING FULGURATION) AND URETHRECTOMY,441,MAJOR BLADDER PROCEDURES,11,DISEASES AND DISORDERS OF THE KIDNEY AND URINARY TRACT,3,Major,Moderate,Surgical,Medicaid,,,,,false,76373.53,20844.72
Central NY,Onondaga,3301007,000635,University Hospital SUNY Health Science Center,50 to 69,136,M,White,Not Span/Hispanic,3,Elective,Home or Self Care,2018,NEO043,URINARY SYSTEM CANCERS - BLADDER,URN009,CYSTECTOMY (INCLUDING FULGURATION) AND URETHRECTOMY,441,MAJOR BLADDER PROCEDURES,11,DISEASES AND DISORDERS OF THE KIDNEY AND URINARY TRACT,3,Major,Moderate,Surgical,Federal/State/Local/VA,,,,,false,75866.4,20587.05
New York City,Manhattan,7002032,001466,Mount Sinai West,70 or Older,108,M,White,Not Span/Hispanic,4,Elective,Home w/ Home Health Services,2018,GEN007,OTHER SPECIFIED AND UNSPECIFIED DISEASES OF BLADDER AND URETHRA,URN003,URETER AND OTHER URINARY TRACT DILATION,441,MAJOR BLADDER PROCEDURES,11,DISEASES AND DISORDERS OF THE KIDNEY AND URINARY TRACT,1,Minor,Minor,Surgical,Medicare,Private Health Insurance,Self-Pay,,,false,68763.99,19923.8
Central NY,Onondaga,3301003,000630,St. Joseph's Hospital Health Center,70 or Older,130,M,White,Not Span/Hispanic,8,Elective,Home w/ Home Health Services,2018,NEO043,URINARY SYSTEM CANCERS - BLADDER,URN009,CYSTECTOMY (INCLUDING FULGURATION) AND URETHRECTOMY,441,MAJOR BLADDER PROCEDURES,11,DISEASES AND DISORDERS OF THE KIDNEY AND URINARY TRACT,3,Major,Moderate,Surgical,Medicare,,,,,false,64042.84,27613.8