Hospital Service Area,Hospital County,Operating Certificate Number,Permanent Facility Id,Facility Name,Age Group,Zip Code - 3 digits,Gender,Race,Ethnicity,Length of Stay,Type of Admission,Patient Disposition,Discharge Year,CCS Diagnosis Code,CCS Diagnosis Description,CCS Procedure Code,CCS Procedure Description,APR DRG Code,APR DRG Description,APR MDC Code,APR MDC Description,APR Severity of Illness Code,APR Severity of Illness Description,APR Risk of Mortality,APR Medical Surgical Description,Payment Typology 1,Payment Typology 2,Payment Typology 3,Birth Weight,Abortion Edit Indicator,Emergency Department Indicator,Total Charges,Total Costs
New York City,Manhattan,7002053,001463,NYU Langone Hospitals,30 to 49,103,M,White,Not Span/Hispanic,6,Elective,Home w/ Home Health Services,2019,NEO043,URINARY SYSTEM CANCERS - BLADDER,URN009,CYSTECTOMY (INCLUDING FULGURATION) AND URETHRECTOMY,441,MAJOR BLADDER PROCEDURES,11,DISEASES AND DISORDERS OF THE KIDNEY AND URINARY TRACT,2,Moderate,Moderate,Surgical,Blue Cross/Blue Shield,,,,,false,359308.58,64794.86
New York City,Manhattan,7002053,001463,NYU Langone Hospitals,50 to 69,112,F,Other Race,Unknown,11,Emergency,Home w/ Home Health Services,2019,GEN004,URINARY TRACT INFECTIONS,URN012,"URINARY SYSTEM PROCEDURES, NEC",441,MAJOR BLADDER PROCEDURES,11,DISEASES AND DISORDERS OF THE KIDNEY AND URINARY TRACT,3,Major,Major,Surgical,Medicaid,,,,,true,224014.17,54199.11
New York City,Manhattan,7002053,001463,NYU Langone Hospitals,70 or Older,112,M,White,Not Span/Hispanic,5,Elective,Home w/ Home Health Services,2019,NEO043,URINARY SYSTEM CANCERS - BLADDER,URN009,CYSTECTOMY (INCLUDING FULGURATION) AND URETHRECTOMY,441,MAJOR BLADDER PROCEDURES,11,DISEASES AND DISORDERS OF THE KIDNEY AND URINARY TRACT,3,Major,Moderate,Surgical,Medicare,Blue Cross/Blue Shield,,,,false,181383.03,35137.47
New York City,Manhattan,7002053,001463,NYU Langone Hospitals,50 to 69,117,F,White,Not Span/Hispanic,5,Elective,Home w/ Home Health Services,2019,NEO043,URINARY SYSTEM CANCERS - BLADDER,URN009,CYSTECTOMY (INCLUDING FULGURATION) AND URETHRECTOMY,441,MAJOR BLADDER PROCEDURES,11,DISEASES AND DISORDERS OF THE KIDNEY AND URINARY TRACT,2,Moderate,Minor,Surgical,Private Health Insurance,,,,,false,305085.63,54586.65
New York City,Manhattan,7002053,001463,NYU Langone Hospitals,70 or Older,100,M,White,Not Span/Hispanic,6,Elective,Skilled Nursing Home,2019,NEO043,URINARY SYSTEM CANCERS - BLADDER,URN012,"URINARY SYSTEM PROCEDURES, NEC",441,MAJOR BLADDER PROCEDURES,11,DISEASES AND DISORDERS OF THE KIDNEY AND URINARY TRACT,3,Major,Major,Surgical,Medicare,,,,,false,278541.85,52543.6
New York City,Manhattan,7002053,001463,NYU Langone Hospitals,70 or Older,100,M,White,Not Span/Hispanic,8,Elective,Home w/ Home Health Services,2019,NEO043,URINARY SYSTEM CANCERS - BLADDER,URN012,"URINARY SYSTEM PROCEDURES, NEC",441,MAJOR BLADDER PROCEDURES,11,DISEASES AND DISORDERS OF THE KIDNEY AND URINARY TRACT,3,Major,Minor,Surgical,Medicare,Blue Cross/Blue Shield,,,,false,208156.27,46426.83
New York City,Manhattan,7002053,001463,NYU Langone Hospitals,30 to 49,116,M,White,Not Span/Hispanic,3,Elective,Home or Self Care,2019,NEO043,URINARY SYSTEM CANCERS - BLADDER,URN012,"URINARY SYSTEM PROCEDURES, NEC",441,MAJOR BLADDER PROCEDURES,11,DISEASES AND DISORDERS OF THE KIDNEY AND URINARY TRACT,2,Moderate,Minor,Surgical,Private Health Insurance,,,,,false,308827.09,50234.62
New York City,Manhattan,7002053,001463,NYU Langone Hospitals,70 or Older,OOS,M,White,Not Span/Hispanic,8,Emergency,Home w/ Home Health Services,2019,GEN009,HEMATURIA,URN009,CYSTECTOMY (INCLUDING FULGURATION) AND URETHRECTOMY,441,MAJOR BLADDER PROCEDURES,11,DISEASES AND DISORDERS OF THE KIDNEY AND URINARY TRACT,4,Extreme,Extreme,Surgical,Medicaid,,,,,true,273181.34,58301.06
New York City,Manhattan,7002053,001463,NYU Langone Hospitals,50 to 69,OOS,F,White,Not Span/Hispanic,20,Elective,Inpatient Rehabilitation Facility,2019,NEO043,URINARY SYSTEM CANCERS - BLADDER,URN012,"URINARY SYSTEM PROCEDURES, NEC",441,MAJOR BLADDER PROCEDURES,11,DISEASES AND DISORDERS OF THE KIDNEY AND URINARY TRACT,4,Extreme,Major,Surgical,Blue Cross/Blue Shield,,,,,false,429643.38,108507.5
New York City,Manhattan,7002053,001463,NYU Langone Hospitals,50 to 69,105,M,White,Not Span/Hispanic,1,Elective,Home or Self Care,2019,GEN006,OTHER SPECIFIED AND UNSPECIFIED DISEASES OF KIDNEY AND URETERS,URN005,NEPHROSTOMY AND URETEROSTOMY PROCEDURES (INCLUDING STENTS),441,MAJOR BLADDER PROCEDURES,11,DISEASES AND DISORDERS OF THE KIDNEY AND URINARY TRACT,3,Major,Moderate,Surgical,Blue Cross/Blue Shield,,,,,false,224454.32,35516.98
New York City,Manhattan,7002053,001463,NYU Langone Hospitals,50 to 69,OOS,M,White,Not Span/Hispanic,10,Elective,Home w/ Home Health Services,2019,NEO043,URINARY SYSTEM CANCERS - BLADDER,MRS003,PROSTATECTOMY,441,MAJOR BLADDER PROCEDURES,11,DISEASES AND DISORDERS OF THE KIDNEY AND URINARY TRACT,3,Major,Major,Surgical,Private Health Insurance,,,,,false,228988.83,54563.69
New York City,Manhattan,7002053,001463,NYU Langone Hospitals,70 or Older,103,M,White,Not Span/Hispanic,9,Elective,Home w/ Home Health Services,2019,GEN004,URINARY TRACT INFECTIONS,OTR001,ROBOTIC-ASSISTED PROCEDURES,441,MAJOR BLADDER PROCEDURES,11,DISEASES AND DISORDERS OF THE KIDNEY AND URINARY TRACT,2,Moderate,Minor,Surgical,Medicare,Blue Cross/Blue Shield,,,,false,417264.35,82659.85
New York City,Manhattan,7002053,001463,NYU Langone Hospitals,50 to 69,OOS,M,White,Not Span/Hispanic,4,Elective,Home w/ Home Health Services,2019,GEN026,POSTPROCEDURAL OR POSTOPERATIVE GENITOURINARY SYSTEM COMPLICATION,URN010,URINARY DIVERSION WITH ANASTOMOSIS OR OSTOMY,441,MAJOR BLADDER PROCEDURES,11,DISEASES AND DISORDERS OF THE KIDNEY AND URINARY TRACT,2,Moderate,Minor,Surgical,Medicaid,,,,,false,288164.28,49669.79
New York City,Manhattan,7002053,001463,NYU Langone Hospitals,30 to 49,100,F,White,Not Span/Hispanic,8,Emergency,Home w/ Home Health Services,2019,NEO043,URINARY SYSTEM CANCERS - BLADDER,URN009,CYSTECTOMY (INCLUDING FULGURATION) AND URETHRECTOMY,441,MAJOR BLADDER PROCEDURES,11,DISEASES AND DISORDERS OF THE KIDNEY AND URINARY TRACT,3,Major,Moderate,Surgical,Private Health Insurance,Medicare,,,,false,218636.75,46896.13
New York City,Manhattan,7002053,001463,NYU Langone Hospitals,50 to 69,OOS,M,White,Not Span/Hispanic,6,Elective,Home w/ Home Health Services,2019,NEO043,URINARY SYSTEM CANCERS - BLADDER,OTR001,ROBOTIC-ASSISTED PROCEDURES,441,MAJOR BLADDER PROCEDURES,11,DISEASES AND DISORDERS OF THE KIDNEY AND URINARY TRACT,3,Major,Moderate,Surgical,Private Health Insurance,,,,,false,321947.5,58171.37
New York City,Manhattan,7002053,001463,NYU Langone Hospitals,50 to 69,OOS,M,White,Not Span/Hispanic,7,Elective,Home w/ Home Health Services,2019,NEO043,URINARY SYSTEM CANCERS - BLADDER,MRS003,PROSTATECTOMY,441,MAJOR BLADDER PROCEDURES,11,DISEASES AND DISORDERS OF THE KIDNEY AND URINARY TRACT,3,Major,Moderate,Surgical,Blue Cross/Blue Shield,,,,,false,170118.72,40568.77
New York City,Manhattan,7002053,001463,NYU Langone Hospitals,0 to 17,113,M,White,Not Span/Hispanic,11,Elective,Home or Self Care,2019,GEN007,OTHER SPECIFIED AND UNSPECIFIED DISEASES OF BLADDER AND URETHRA,URN010,URINARY DIVERSION WITH ANASTOMOSIS OR OSTOMY,441,MAJOR BLADDER PROCEDURES,11,DISEASES AND DISORDERS OF THE KIDNEY AND URINARY TRACT,3,Major,Moderate,Surgical,Private Health Insurance,,,,,false,245538.83,53743.7
New York City,Manhattan,7002053,001463,NYU Langone Hospitals,50 to 69,112,F,White,Not Span/Hispanic,2,Elective,Home or Self Care,2019,GEN007,OTHER SPECIFIED AND UNSPECIFIED DISEASES OF BLADDER AND URETHRA,URN007,URINARY TRACT REPAIR,441,MAJOR BLADDER PROCEDURES,11,DISEASES AND DISORDERS OF THE KIDNEY AND URINARY TRACT,3,Major,Moderate,Surgical,Blue Cross/Blue Shield,,,,,false,188690.95,31310.64
New York City,Manhattan,7002053,001463,NYU Langone Hospitals,50 to 69,105,F,White,Not Span/Hispanic,5,Elective,Home w/ Home Health Services,2019,NEO043,URINARY SYSTEM CANCERS - BLADDER,URN009,CYSTECTOMY (INCLUDING FULGURATION) AND URETHRECTOMY,441,MAJOR BLADDER PROCEDURES,11,DISEASES AND DISORDERS OF THE KIDNEY AND URINARY TRACT,2,Moderate,Minor,Surgical,Private Health Insurance,,,,,false,267821.61,48729.03
New York City,Manhattan,7002053,001463,NYU Langone Hospitals,50 to 69,109,M,White,Not Span/Hispanic,7,Elective,Home w/ Home Health Services,2019,NEO043,URINARY SYSTEM CANCERS - BLADDER,URN012,"URINARY SYSTEM PROCEDURES, NEC",441,MAJOR BLADDER PROCEDURES,11,DISEASES AND DISORDERS OF THE KIDNEY AND URINARY TRACT,2,Moderate,Minor,Surgical,Private Health Insurance,,,,,false,206828.57,43963.21
New York City,Manhattan,7002053,001463,NYU Langone Hospitals,70 or Older,OOS,M,White,Not Span/Hispanic,5,Elective,Home w/ Home Health Services,2019,NEO043,URINARY SYSTEM CANCERS - BLADDER,URN012,"URINARY SYSTEM PROCEDURES, NEC",441,MAJOR BLADDER PROCEDURES,11,DISEASES AND DISORDERS OF THE KIDNEY AND URINARY TRACT,3,Major,Minor,Surgical,Medicare,Blue Cross/Blue Shield,,,,false,297582.61,53122.26
New York City,Manhattan,7002053,001463,NYU Langone Hospitals,0 to 17,112,F,Black/African American,Not Span/Hispanic,5,Elective,Home or Self Care,2019,MAL003,GENITOURINARY CONGENITAL ANOMALIES,URN010,URINARY DIVERSION WITH ANASTOMOSIS OR OSTOMY,441,MAJOR BLADDER PROCEDURES,11,DISEASES AND DISORDERS OF THE KIDNEY AND URINARY TRACT,3,Major,Moderate,Surgical,Medicaid,,,,,false,176505.36,33896.24
New York City,Manhattan,7002053,001463,NYU Langone Hospitals,70 or Older,100,M,White,Not Span/Hispanic,7,Elective,Home w/ Home Health Services,2019,NEO043,URINARY SYSTEM CANCERS - BLADDER,MRS003,PROSTATECTOMY,441,MAJOR BLADDER PROCEDURES,11,DISEASES AND DISORDERS OF THE KIDNEY AND URINARY TRACT,2,Moderate,Moderate,Surgical,Medicare,Medicare,,,,false,160718.31,37383.21
New York City,Manhattan,7002053,001463,NYU Langone Hospitals,50 to 69,OOS,M,White,Not Span/Hispanic,6,Elective,Home or Self Care,2019,GEN006,OTHER SPECIFIED AND UNSPECIFIED DISEASES OF KIDNEY AND URETERS,URN009,CYSTECTOMY (INCLUDING FULGURATION) AND URETHRECTOMY,441,MAJOR BLADDER PROCEDURES,11,DISEASES AND DISORDERS OF THE KIDNEY AND URINARY TRACT,2,Moderate,Minor,Surgical,Private Health Insurance,,,,,false,317491.32,59552.84
New York City,Manhattan,7002053,001463,NYU Langone Hospitals,70 or Older,100,M,White,Not Span/Hispanic,5,Elective,Home w/ Home Health Services,2019,NEO043,URINARY SYSTEM CANCERS - BLADDER,URN009,CYSTECTOMY (INCLUDING FULGURATION) AND URETHRECTOMY,441,MAJOR BLADDER PROCEDURES,11,DISEASES AND DISORDERS OF THE KIDNEY AND URINARY TRACT,3,Major,Moderate,Surgical,Blue Cross/Blue Shield,Medicare,,,,false,138832.49,30376.64
New York City,Manhattan,7002053,001463,NYU Langone Hospitals,50 to 69,112,M,Other Race,Not Span/Hispanic,3,Elective,Home or Self Care,2019,NEO043,URINARY SYSTEM CANCERS - BLADDER,URN009,CYSTECTOMY (INCLUDING FULGURATION) AND URETHRECTOMY,441,MAJOR BLADDER PROCEDURES,11,DISEASES AND DISORDERS OF THE KIDNEY AND URINARY TRACT,2,Moderate,Minor,Surgical,Blue Cross/Blue Shield,,,,,false,359133.89,58365.88
New York City,Manhattan,7002053,001463,NYU Langone Hospitals,50 to 69,104,M,White,Not Span/Hispanic,5,Elective,Home or Self Care,2019,NEO043,URINARY SYSTEM CANCERS - BLADDER,OTR001,ROBOTIC-ASSISTED PROCEDURES,441,MAJOR BLADDER PROCEDURES,11,DISEASES AND DISORDERS OF THE KIDNEY AND URINARY TRACT,2,Moderate,Minor,Surgical,Private Health Insurance,,,,,false,403655.9,68302.77
New York City,Manhattan,7002053,001463,NYU Langone Hospitals,30 to 49,100,M,White,Not Span/Hispanic,7,Elective,Home w/ Home Health Services,2019,NEO043,URINARY SYSTEM CANCERS - BLADDER,URN012,"URINARY SYSTEM PROCEDURES, NEC",441,MAJOR BLADDER PROCEDURES,11,DISEASES AND DISORDERS OF THE KIDNEY AND URINARY TRACT,3,Major,Minor,Surgical,Blue Cross/Blue Shield,,,,,false,167964.69,38708.1
New York City,Manhattan,7002053,001463,NYU Langone Hospitals,50 to 69,100,M,White,Not Span/Hispanic,2,Elective,Home w/ Home Health Services,2019,GEN006,OTHER SPECIFIED AND UNSPECIFIED DISEASES OF KIDNEY AND URETERS,URN010,URINARY DIVERSION WITH ANASTOMOSIS OR OSTOMY,441,MAJOR BLADDER PROCEDURES,11,DISEASES AND DISORDERS OF THE KIDNEY AND URINARY TRACT,2,Moderate,Minor,Surgical,Private Health Insurance,,,,,false,168345.17,27874.02
New York City,Manhattan,7002053,001463,NYU Langone Hospitals,70 or Older,112,M,Other Race,Spanish/Hispanic,5,Elective,Home w/ Home Health Services,2019,NEO043,URINARY SYSTEM CANCERS - BLADDER,URN009,CYSTECTOMY (INCLUDING FULGURATION) AND URETHRECTOMY,441,MAJOR BLADDER PROCEDURES,11,DISEASES AND DISORDERS OF THE KIDNEY AND URINARY TRACT,3,Major,Moderate,Surgical,Medicare,Medicaid,,,,false,278311.1,49944.84
New York City,Manhattan,7002053,001463,NYU Langone Hospitals,50 to 69,103,M,White,Not Span/Hispanic,8,Elective,Home w/ Home Health Services,2019,NEO043,URINARY SYSTEM CANCERS - BLADDER,URN009,CYSTECTOMY (INCLUDING FULGURATION) AND URETHRECTOMY,441,MAJOR BLADDER PROCEDURES,11,DISEASES AND DISORDERS OF THE KIDNEY AND URINARY TRACT,3,Major,Moderate,Surgical,Medicare,Medicaid,,,,false,203967.4,44472.14
New York City,Manhattan,7002053,001463,NYU Langone Hospitals,70 or Older,112,M,White,Not Span/Hispanic,6,Elective,Home w/ Home Health Services,2019,NEO043,URINARY SYSTEM CANCERS - BLADDER,URN009,CYSTECTOMY (INCLUDING FULGURATION) AND URETHRECTOMY,441,MAJOR BLADDER PROCEDURES,11,DISEASES AND DISORDERS OF THE KIDNEY AND URINARY TRACT,3,Major,Major,Surgical,Medicare,,,,,false,195462.09,40955.42
New York City,Manhattan,7002053,001463,NYU Langone Hospitals,50 to 69,114,F,White,Not Span/Hispanic,5,Elective,Home w/ Home Health Services,2019,GEN007,OTHER SPECIFIED AND UNSPECIFIED DISEASES OF BLADDER AND URETHRA,URN012,"URINARY SYSTEM PROCEDURES, NEC",441,MAJOR BLADDER PROCEDURES,11,DISEASES AND DISORDERS OF THE KIDNEY AND URINARY TRACT,2,Moderate,Minor,Surgical,Medicare,Medicaid,,,,false,187565.88,39595.74
New York City,Manhattan,7002053,001463,NYU Langone Hospitals,50 to 69,103,M,Other Race,Spanish/Hispanic,5,Elective,Home w/ Home Health Services,2019,NEO043,URINARY SYSTEM CANCERS - BLADDER,URN009,CYSTECTOMY (INCLUDING FULGURATION) AND URETHRECTOMY,441,MAJOR BLADDER PROCEDURES,11,DISEASES AND DISORDERS OF THE KIDNEY AND URINARY TRACT,3,Major,Minor,Surgical,Private Health Insurance,,,,,false,148146.19,30673.53
New York City,Manhattan,7002053,001463,NYU Langone Hospitals,50 to 69,OOS,M,White,Not Span/Hispanic,7,Elective,Skilled Nursing Home,2019,NEO043,URINARY SYSTEM CANCERS - BLADDER,URN012,"URINARY SYSTEM PROCEDURES, NEC",441,MAJOR BLADDER PROCEDURES,11,DISEASES AND DISORDERS OF THE KIDNEY AND URINARY TRACT,3,Major,Moderate,Surgical,Medicare,,,,,false,201589.31,43876.25
New York City,Manhattan,7002053,001463,NYU Langone Hospitals,70 or Older,114,M,White,Not Span/Hispanic,7,Elective,Home w/ Home Health Services,2019,NEO043,URINARY SYSTEM CANCERS - BLADDER,URN012,"URINARY SYSTEM PROCEDURES, NEC",441,MAJOR BLADDER PROCEDURES,11,DISEASES AND DISORDERS OF THE KIDNEY AND URINARY TRACT,3,Major,Moderate,Surgical,Medicare,Blue Cross/Blue Shield,,,,false,167103.09,38310.94
New York City,Manhattan,7002053,001463,NYU Langone Hospitals,50 to 69,107,M,White,Not Span/Hispanic,9,Elective,Home w/ Home Health Services,2019,NEO043,URINARY SYSTEM CANCERS - BLADDER,MRS003,PROSTATECTOMY,441,MAJOR BLADDER PROCEDURES,11,DISEASES AND DISORDERS OF THE KIDNEY AND URINARY TRACT,3,Major,Minor,Surgical,Private Health Insurance,,,,,false,319164.31,64909.98
New York City,Manhattan,7002053,001463,NYU Langone Hospitals,50 to 69,,M,Other Race,Not Span/Hispanic,6,Elective,Home or Self Care,2019,NEO043,URINARY SYSTEM CANCERS - BLADDER,URN009,CYSTECTOMY (INCLUDING FULGURATION) AND URETHRECTOMY,441,MAJOR BLADDER PROCEDURES,11,DISEASES AND DISORDERS OF THE KIDNEY AND URINARY TRACT,2,Moderate,Minor,Surgical,Self-Pay,,,,,false,205736.71,39995.32
New York City,Manhattan,7002053,001463,NYU Langone Hospitals,70 or Older,OOS,M,White,Not Span/Hispanic,5,Elective,Home w/ Home Health Services,2019,NEO043,URINARY SYSTEM CANCERS - BLADDER,URN009,CYSTECTOMY (INCLUDING FULGURATION) AND URETHRECTOMY,441,MAJOR BLADDER PROCEDURES,11,DISEASES AND DISORDERS OF THE KIDNEY AND URINARY TRACT,2,Moderate,Moderate,Surgical,Private Health Insurance,Medicare,Blue Cross/Blue Shield,,,false,281478.77,50821.87
New York City,Manhattan,7002053,001463,NYU Langone Hospitals,50 to 69,OOS,M,White,Not Span/Hispanic,12,Elective,Home w/ Home Health Services,2019,NEO043,URINARY SYSTEM CANCERS - BLADDER,URN009,CYSTECTOMY (INCLUDING FULGURATION) AND URETHRECTOMY,441,MAJOR BLADDER PROCEDURES,11,DISEASES AND DISORDERS OF THE KIDNEY AND URINARY TRACT,3,Major,Major,Surgical,Private Health Insurance,,,,,false,351136.22,78075.98
New York City,Manhattan,7002053,001463,NYU Langone Hospitals,70 or Older,100,F,White,Not Span/Hispanic,7,Elective,Home w/ Home Health Services,2019,NEO043,URINARY SYSTEM CANCERS - BLADDER,URN012,"URINARY SYSTEM PROCEDURES, NEC",441,MAJOR BLADDER PROCEDURES,11,DISEASES AND DISORDERS OF THE KIDNEY AND URINARY TRACT,3,Major,Minor,Surgical,Medicare,Blue Cross/Blue Shield,,,,false,180726.54,42573.25
New York City,Manhattan,7002053,001463,NYU Langone Hospitals,70 or Older,OOS,M,White,Not Span/Hispanic,5,Elective,Home w/ Home Health Services,2019,NEO043,URINARY SYSTEM CANCERS - BLADDER,URN009,CYSTECTOMY (INCLUDING FULGURATION) AND URETHRECTOMY,441,MAJOR BLADDER PROCEDURES,11,DISEASES AND DISORDERS OF THE KIDNEY AND URINARY TRACT,3,Major,Moderate,Surgical,Medicare,,,,,false,152823.25,31781.06
New York City,Manhattan,7002053,001463,NYU Langone Hospitals,70 or Older,115,F,White,Not Span/Hispanic,6,Elective,Home w/ Home Health Services,2019,NEO043,URINARY SYSTEM CANCERS - BLADDER,URN009,CYSTECTOMY (INCLUDING FULGURATION) AND URETHRECTOMY,441,MAJOR BLADDER PROCEDURES,11,DISEASES AND DISORDERS OF THE KIDNEY AND URINARY TRACT,3,Major,Minor,Surgical,Medicare,,,,,false,183668.96,39380.97
New York City,Manhattan,7002053,001463,NYU Langone Hospitals,70 or Older,103,M,White,Not Span/Hispanic,5,Elective,Home w/ Home Health Services,2019,NEO043,URINARY SYSTEM CANCERS - BLADDER,URN009,CYSTECTOMY (INCLUDING FULGURATION) AND URETHRECTOMY,441,MAJOR BLADDER PROCEDURES,11,DISEASES AND DISORDERS OF THE KIDNEY AND URINARY TRACT,3,Major,Moderate,Surgical,Medicare,,,,,false,282977.56,50748.45
New York City,Manhattan,7002053,001463,NYU Langone Hospitals,70 or Older,125,M,White,Not Span/Hispanic,5,Elective,Home w/ Home Health Services,2019,NEO043,URINARY SYSTEM CANCERS - BLADDER,URN009,CYSTECTOMY (INCLUDING FULGURATION) AND URETHRECTOMY,441,MAJOR BLADDER PROCEDURES,11,DISEASES AND DISORDERS OF THE KIDNEY AND URINARY TRACT,3,Major,Moderate,Surgical,Medicare,,,,,false,150879.04,33388.16
New York City,Manhattan,7002053,001463,NYU Langone Hospitals,50 to 69,112,M,White,Not Span/Hispanic,7,Elective,Home or Self Care,2019,NEO043,URINARY SYSTEM CANCERS - BLADDER,URN012,"URINARY SYSTEM PROCEDURES, NEC",441,MAJOR BLADDER PROCEDURES,11,DISEASES AND DISORDERS OF THE KIDNEY AND URINARY TRACT,3,Major,Moderate,Surgical,Self-Pay,,,,,false,174688.66,40165.05
