Hospital Service Area,Hospital County,Operating Certificate Number,Permanent Facility Id,Facility Name,Age Group,Zip Code - 3 digits,Gender,Race,Ethnicity,Length of Stay,Type of Admission,Patient Disposition,Discharge Year,CCS Diagnosis Code,CCS Diagnosis Description,CCS Procedure Code,CCS Procedure Description,APR DRG Code,APR DRG Description,APR MDC Code,APR MDC Description,APR Severity of Illness Code,APR Severity of Illness Description,APR Risk of Mortality,APR Medical Surgical Description,Payment Typology 1,Payment Typology 2,Payment Typology 3,Birth Weight,Abortion Edit Indicator,Emergency Department Indicator,Total Charges,Total Costs
New York City,Manhattan,7002053,001463,NYU Langone Hospitals,70 or Older,100,F,White,Not Span/Hispanic,6,Elective,Home w/ Home Health Services,2020,NEO043,URINARY SYSTEM CANCERS - BLADDER,FRS001,HYSTERECTOMY,441,MAJOR BLADDER PROCEDURES,11,DISEASES AND DISORDERS OF THE KIDNEY AND URINARY TRACT,3,Major,Moderate,Surgical,Medicare,Medicaid,,,,N,274566.33,49325.36
New York City,Manhattan,7002053,001463,NYU Langone Hospitals,70 or Older,112,F,White,Not Span/Hispanic,5,Elective,Home w/ Home Health Services,2020,NEO043,URINARY SYSTEM CANCERS - BLADDER,URN012,"URINARY SYSTEM PROCEDURES, NEC",441,MAJOR BLADDER PROCEDURES,11,DISEASES AND DISORDERS OF THE KIDNEY AND URINARY TRACT,2,Moderate,Minor,Surgical,Medicaid,,,,,N,152979.75,30573.84
New York City,Manhattan,7002053,001463,NYU Langone Hospitals,50 to 69,125,M,Multi-racial,Not Span/Hispanic,6,Elective,Home w/ Home Health Services,2020,NEO043,URINARY SYSTEM CANCERS - BLADDER,URN012,"URINARY SYSTEM PROCEDURES, NEC",441,MAJOR BLADDER PROCEDURES,11,DISEASES AND DISORDERS OF THE KIDNEY AND URINARY TRACT,2,Moderate,Minor,Surgical,Blue Cross/Blue Shield,Blue Cross/Blue Shield,,,,N,157142.42,32712.19
New York City,Manhattan,7002053,001463,NYU Langone Hospitals,50 to 69,OOS,M,White,Not Span/Hispanic,2,Elective,Home or Self Care,2020,GEN026,POSTPROCEDURAL OR POSTOPERATIVE GENITOURINARY SYSTEM COMPLICATION,URN001,CYSTOSCOPY AND URETEROSCOPY (INCLUDING BIOPSY),441,MAJOR BLADDER PROCEDURES,11,DISEASES AND DISORDERS OF THE KIDNEY AND URINARY TRACT,2,Moderate,Minor,Surgical,Medicare,,,,,N,215828.77,33369.63
New York City,Manhattan,7002053,001463,NYU Langone Hospitals,70 or Older,103,F,White,Unknown,7,Elective,Home w/ Home Health Services,2020,NEO043,URINARY SYSTEM CANCERS - BLADDER,URN009,CYSTECTOMY (INCLUDING FULGURATION) AND URETHRECTOMY,441,MAJOR BLADDER PROCEDURES,11,DISEASES AND DISORDERS OF THE KIDNEY AND URINARY TRACT,3,Major,Minor,Surgical,Medicare,Blue Cross/Blue Shield,,,,N,167807.88,35409.01
New York City,Manhattan,7002053,001463,NYU Langone Hospitals,50 to 69,OOS,M,White,Not Span/Hispanic,5,Elective,Home w/ Home Health Services,2020,NEO043,URINARY SYSTEM CANCERS - BLADDER,URN012,"URINARY SYSTEM PROCEDURES, NEC",441,MAJOR BLADDER PROCEDURES,11,DISEASES AND DISORDERS OF THE KIDNEY AND URINARY TRACT,2,Moderate,Minor,Surgical,Blue Cross/Blue Shield,,,,,N,144645.26,29689.74
New York City,Manhattan,7002053,001463,NYU Langone Hospitals,50 to 69,112,M,White,Not Span/Hispanic,8,Elective,Short-term Hospital,2020,NEO043,URINARY SYSTEM CANCERS - BLADDER,URN012,"URINARY SYSTEM PROCEDURES, NEC",441,MAJOR BLADDER PROCEDURES,11,DISEASES AND DISORDERS OF THE KIDNEY AND URINARY TRACT,3,Major,Minor,Surgical,Medicare,Blue Cross/Blue Shield,,,,N,182671.38,40054.48
New York City,Manhattan,7002053,001463,NYU Langone Hospitals,70 or Older,100,M,White,Not Span/Hispanic,6,Elective,Home w/ Home Health Services,2020,NEO043,URINARY SYSTEM CANCERS - BLADDER,URN009,CYSTECTOMY (INCLUDING FULGURATION) AND URETHRECTOMY,441,MAJOR BLADDER PROCEDURES,11,DISEASES AND DISORDERS OF THE KIDNEY AND URINARY TRACT,3,Major,Moderate,Surgical,Medicare,Blue Cross/Blue Shield,,,,N,287617.32,51489.15
New York City,Manhattan,7002053,001463,NYU Langone Hospitals,50 to 69,112,M,White,Not Span/Hispanic,3,Elective,Home or Self Care,2020,NEO043,URINARY SYSTEM CANCERS - BLADDER,URN010,URINARY DIVERSION WITH ANASTOMOSIS OR OSTOMY,441,MAJOR BLADDER PROCEDURES,11,DISEASES AND DISORDERS OF THE KIDNEY AND URINARY TRACT,2,Moderate,Moderate,Surgical,Private Health Insurance,,,,,N,223256.1,35424.34
New York City,Manhattan,7002053,001463,NYU Langone Hospitals,50 to 69,OOS,M,White,Not Span/Hispanic,6,Elective,Home w/ Home Health Services,2020,NEO043,URINARY SYSTEM CANCERS - BLADDER,URN009,CYSTECTOMY (INCLUDING FULGURATION) AND URETHRECTOMY,441,MAJOR BLADDER PROCEDURES,11,DISEASES AND DISORDERS OF THE KIDNEY AND URINARY TRACT,2,Moderate,Moderate,Surgical,Medicare,Private Health Insurance,,,,N,156674.1,32770.29
New York City,Manhattan,7002053,001463,NYU Langone Hospitals,70 or Older,111,F,White,Not Span/Hispanic,5,Elective,Home w/ Home Health Services,2020,NEO043,URINARY SYSTEM CANCERS - BLADDER,URN012,"URINARY SYSTEM PROCEDURES, NEC",441,MAJOR BLADDER PROCEDURES,11,DISEASES AND DISORDERS OF THE KIDNEY AND URINARY TRACT,3,Major,Minor,Surgical,Medicare,Private Health Insurance,,,,N,161300.47,32058.51
New York City,Manhattan,7002053,001463,NYU Langone Hospitals,70 or Older,112,M,White,Not Span/Hispanic,6,Elective,Home w/ Home Health Services,2020,NEO043,URINARY SYSTEM CANCERS - BLADDER,MRS003,PROSTATECTOMY,441,MAJOR BLADDER PROCEDURES,11,DISEASES AND DISORDERS OF THE KIDNEY AND URINARY TRACT,3,Major,Moderate,Surgical,Medicare,Blue Cross/Blue Shield,,,,N,288426.27,51785.26
New York City,Manhattan,7002053,001463,NYU Langone Hospitals,70 or Older,112,M,White,Not Span/Hispanic,5,Elective,Home w/ Home Health Services,2020,NEO043,URINARY SYSTEM CANCERS - BLADDER,URN009,CYSTECTOMY (INCLUDING FULGURATION) AND URETHRECTOMY,441,MAJOR BLADDER PROCEDURES,11,DISEASES AND DISORDERS OF THE KIDNEY AND URINARY TRACT,3,Major,Major,Surgical,Medicare,Blue Cross/Blue Shield,,,,N,185107.55,37431.58
New York City,Manhattan,7002053,001463,NYU Langone Hospitals,70 or Older,112,F,White,Not Span/Hispanic,7,Emergency,Home w/ Home Health Services,2020,NEO043,URINARY SYSTEM CANCERS - BLADDER,URN009,CYSTECTOMY (INCLUDING FULGURATION) AND URETHRECTOMY,441,MAJOR BLADDER PROCEDURES,11,DISEASES AND DISORDERS OF THE KIDNEY AND URINARY TRACT,3,Major,Moderate,Surgical,Medicare,,,,,Y,240152.09,44849.61
New York City,Manhattan,7002053,001463,NYU Langone Hospitals,30 to 49,OOS,M,White,Not Span/Hispanic,5,Elective,Home w/ Home Health Services,2020,NEO043,URINARY SYSTEM CANCERS - BLADDER,URN009,CYSTECTOMY (INCLUDING FULGURATION) AND URETHRECTOMY,441,MAJOR BLADDER PROCEDURES,11,DISEASES AND DISORDERS OF THE KIDNEY AND URINARY TRACT,3,Major,Moderate,Surgical,Blue Cross/Blue Shield,,,,,N,169557.54,39615.72
New York City,Manhattan,7002053,001463,NYU Langone Hospitals,50 to 69,117,M,White,Spanish/Hispanic,5,Elective,Home w/ Home Health Services,2020,NEO043,URINARY SYSTEM CANCERS - BLADDER,URN012,"URINARY SYSTEM PROCEDURES, NEC",441,MAJOR BLADDER PROCEDURES,11,DISEASES AND DISORDERS OF THE KIDNEY AND URINARY TRACT,2,Moderate,Moderate,Surgical,Private Health Insurance,,,,,N,158426.71,36513.56
New York City,Manhattan,7002053,001463,NYU Langone Hospitals,50 to 69,112,M,White,Unknown,6,Elective,Home or Self Care,2020,NEO043,URINARY SYSTEM CANCERS - BLADDER,URN010,URINARY DIVERSION WITH ANASTOMOSIS OR OSTOMY,441,MAJOR BLADDER PROCEDURES,11,DISEASES AND DISORDERS OF THE KIDNEY AND URINARY TRACT,3,Major,Moderate,Surgical,Medicaid,,,,,N,207128.21,44580.98
New York City,Manhattan,7002053,001463,NYU Langone Hospitals,50 to 69,100,F,White,Not Span/Hispanic,6,Elective,Home w/ Home Health Services,2020,NEO043,URINARY SYSTEM CANCERS - BLADDER,URN009,CYSTECTOMY (INCLUDING FULGURATION) AND URETHRECTOMY,441,MAJOR BLADDER PROCEDURES,11,DISEASES AND DISORDERS OF THE KIDNEY AND URINARY TRACT,3,Major,Moderate,Surgical,Private Health Insurance,,,,,N,240668.26,51398.22
New York City,Manhattan,7002053,001463,NYU Langone Hospitals,70 or Older,100,M,White,Not Span/Hispanic,4,Elective,Home w/ Home Health Services,2020,NEO043,URINARY SYSTEM CANCERS - BLADDER,MRS003,PROSTATECTOMY,441,MAJOR BLADDER PROCEDURES,11,DISEASES AND DISORDERS OF THE KIDNEY AND URINARY TRACT,3,Major,Moderate,Surgical,Medicare,Blue Cross/Blue Shield,,,,N,153864.96,35799.14
New York City,Manhattan,7002053,001463,NYU Langone Hospitals,70 or Older,OOS,F,White,Not Span/Hispanic,10,Elective,Skilled Nursing Home,2020,GEN004,URINARY TRACT INFECTIONS,URN012,"URINARY SYSTEM PROCEDURES, NEC",441,MAJOR BLADDER PROCEDURES,11,DISEASES AND DISORDERS OF THE KIDNEY AND URINARY TRACT,2,Moderate,Moderate,Surgical,Medicare,Medicare,,,,N,262286.13,64546.14
New York City,Manhattan,7002053,001463,NYU Langone Hospitals,50 to 69,100,F,Other Race,Not Span/Hispanic,3,Emergency,Home w/ Home Health Services,2020,GEN007,OTHER SPECIFIED AND UNSPECIFIED DISEASES OF BLADDER AND URETHRA,URN007,URINARY TRACT REPAIR,441,MAJOR BLADDER PROCEDURES,11,DISEASES AND DISORDERS OF THE KIDNEY AND URINARY TRACT,2,Moderate,Minor,Surgical,Private Health Insurance,,,,,Y,94810.19,21634.94
New York City,Manhattan,7002053,001463,NYU Langone Hospitals,50 to 69,100,M,White,Not Span/Hispanic,10,Elective,Home w/ Home Health Services,2020,NEO043,URINARY SYSTEM CANCERS - BLADDER,URN012,"URINARY SYSTEM PROCEDURES, NEC",441,MAJOR BLADDER PROCEDURES,11,DISEASES AND DISORDERS OF THE KIDNEY AND URINARY TRACT,3,Major,Moderate,Surgical,Medicare,Medicare,,,,N,248284.9,63496.81
New York City,Manhattan,7002053,001463,NYU Langone Hospitals,70 or Older,OOS,M,White,Not Span/Hispanic,9,Elective,Home w/ Home Health Services,2020,NEO043,URINARY SYSTEM CANCERS - BLADDER,URN012,"URINARY SYSTEM PROCEDURES, NEC",441,MAJOR BLADDER PROCEDURES,11,DISEASES AND DISORDERS OF THE KIDNEY AND URINARY TRACT,2,Moderate,Minor,Surgical,Medicare,Medicare,,,,Y,229094.5,58502.71
New York City,Manhattan,7002053,001463,NYU Langone Hospitals,50 to 69,112,F,White,Not Span/Hispanic,6,Elective,Home w/ Home Health Services,2020,NEO043,URINARY SYSTEM CANCERS - BLADDER,URN009,CYSTECTOMY (INCLUDING FULGURATION) AND URETHRECTOMY,441,MAJOR BLADDER PROCEDURES,11,DISEASES AND DISORDERS OF THE KIDNEY AND URINARY TRACT,2,Moderate,Minor,Surgical,Medicaid,,,,,N,166705.72,40915
New York City,Manhattan,7002053,001463,NYU Langone Hospitals,70 or Older,112,M,Black/African American,Not Span/Hispanic,3,Elective,Home or Self Care,2020,GEN026,POSTPROCEDURAL OR POSTOPERATIVE GENITOURINARY SYSTEM COMPLICATION,URN012,"URINARY SYSTEM PROCEDURES, NEC",441,MAJOR BLADDER PROCEDURES,11,DISEASES AND DISORDERS OF THE KIDNEY AND URINARY TRACT,2,Moderate,Moderate,Surgical,Medicare,,,,,N,130506.89,26236.72
New York City,Manhattan,7002053,001463,NYU Langone Hospitals,70 or Older,OOS,M,White,Not Span/Hispanic,46,Elective,Skilled Nursing Home,2020,GEN026,POSTPROCEDURAL OR POSTOPERATIVE GENITOURINARY SYSTEM COMPLICATION,URN009,CYSTECTOMY (INCLUDING FULGURATION) AND URETHRECTOMY,441,MAJOR BLADDER PROCEDURES,11,DISEASES AND DISORDERS OF THE KIDNEY AND URINARY TRACT,4,Extreme,Extreme,Surgical,Medicare,Medicaid,,,,N,1390838.29,326086.76
New York City,Manhattan,7002053,001463,NYU Langone Hospitals,70 or Older,100,M,White,Not Span/Hispanic,7,Elective,Home w/ Home Health Services,2020,NEO043,URINARY SYSTEM CANCERS - BLADDER,URN012,"URINARY SYSTEM PROCEDURES, NEC",441,MAJOR BLADDER PROCEDURES,11,DISEASES AND DISORDERS OF THE KIDNEY AND URINARY TRACT,2,Moderate,Moderate,Surgical,Medicare,Medicare,,,,N,217952.47,48973.37
New York City,Manhattan,7002053,001463,NYU Langone Hospitals,70 or Older,100,F,White,Not Span/Hispanic,8,Elective,Home w/ Home Health Services,2020,NEO043,URINARY SYSTEM CANCERS - BLADDER,URN009,CYSTECTOMY (INCLUDING FULGURATION) AND URETHRECTOMY,441,MAJOR BLADDER PROCEDURES,11,DISEASES AND DISORDERS OF THE KIDNEY AND URINARY TRACT,2,Moderate,Minor,Surgical,Medicare,Blue Cross/Blue Shield,,,,N,293656.46,64322.91
New York City,Manhattan,7002053,001463,NYU Langone Hospitals,70 or Older,OOS,F,White,Not Span/Hispanic,1,Elective,Home w/ Home Health Services,2020,GEN026,POSTPROCEDURAL OR POSTOPERATIVE GENITOURINARY SYSTEM COMPLICATION,URN007,URINARY TRACT REPAIR,441,MAJOR BLADDER PROCEDURES,11,DISEASES AND DISORDERS OF THE KIDNEY AND URINARY TRACT,2,Moderate,Major,Surgical,Medicare,Medicare,,,,N,76115.5,13862.76
New York City,Manhattan,7002053,001463,NYU Langone Hospitals,50 to 69,104,M,Black/African American,Not Span/Hispanic,6,Elective,Home w/ Home Health Services,2020,NEO043,URINARY SYSTEM CANCERS - BLADDER,URN009,CYSTECTOMY (INCLUDING FULGURATION) AND URETHRECTOMY,441,MAJOR BLADDER PROCEDURES,11,DISEASES AND DISORDERS OF THE KIDNEY AND URINARY TRACT,3,Major,Minor,Surgical,Medicare,Blue Cross/Blue Shield,,,,N,302837.84,58498.93
New York City,Manhattan,7002053,001463,NYU Langone Hospitals,50 to 69,112,F,Black/African American,Not Span/Hispanic,5,Elective,Home w/ Home Health Services,2020,NEO043,URINARY SYSTEM CANCERS - BLADDER,URN009,CYSTECTOMY (INCLUDING FULGURATION) AND URETHRECTOMY,441,MAJOR BLADDER PROCEDURES,11,DISEASES AND DISORDERS OF THE KIDNEY AND URINARY TRACT,2,Moderate,Minor,Surgical,Private Health Insurance,,,,,N,263561,48692.73
New York City,Manhattan,7002053,001463,NYU Langone Hospitals,50 to 69,124,M,White,Not Span/Hispanic,3,Elective,Home w/ Home Health Services,2020,NEO043,URINARY SYSTEM CANCERS - BLADDER,URN012,"URINARY SYSTEM PROCEDURES, NEC",441,MAJOR BLADDER PROCEDURES,11,DISEASES AND DISORDERS OF THE KIDNEY AND URINARY TRACT,2,Moderate,Minor,Surgical,Private Health Insurance,,,,,N,259649.28,43883.86
New York City,Manhattan,7002053,001463,NYU Langone Hospitals,30 to 49,112,M,White,Not Span/Hispanic,15,Emergency,Inpatient Rehabilitation Facility,2020,GEN007,OTHER SPECIFIED AND UNSPECIFIED DISEASES OF BLADDER AND URETHRA,GIS022,GI SYSTEM LYSIS OF ADHESIONS,441,MAJOR BLADDER PROCEDURES,11,DISEASES AND DISORDERS OF THE KIDNEY AND URINARY TRACT,3,Major,Major,Surgical,Medicare,Medicaid,,,,N,409397.11,96942.45
New York City,Manhattan,7002053,001463,NYU Langone Hospitals,70 or Older,OOS,F,White,Not Span/Hispanic,6,Elective,Home w/ Home Health Services,2020,NEO043,URINARY SYSTEM CANCERS - BLADDER,URN012,"URINARY SYSTEM PROCEDURES, NEC",441,MAJOR BLADDER PROCEDURES,11,DISEASES AND DISORDERS OF THE KIDNEY AND URINARY TRACT,3,Major,Moderate,Surgical,Medicare,,,,,N,278958.59,56090.44
New York City,Manhattan,7002053,001463,NYU Langone Hospitals,30 to 49,112,M,White,Not Span/Hispanic,5,Elective,Home w/ Home Health Services,2020,NEO043,URINARY SYSTEM CANCERS - BLADDER,URN012,"URINARY SYSTEM PROCEDURES, NEC",441,MAJOR BLADDER PROCEDURES,11,DISEASES AND DISORDERS OF THE KIDNEY AND URINARY TRACT,3,Major,Minor,Surgical,Medicaid,,,,,N,158604.2,36942.32
