Hospital Service Area,Hospital County,Operating Certificate Number,Permanent Facility Id,Facility Name,Age Group,Zip Code - 3 digits,Gender,Race,Ethnicity,Length of Stay,Type of Admission,Patient Disposition,Discharge Year,CCS Diagnosis Code,CCS Diagnosis Description,CCS Procedure Code,CCS Procedure Description,APR DRG Code,APR DRG Description,APR MDC Code,APR MDC Description,APR Severity of Illness Code,APR Severity of Illness Description,APR Risk of Mortality,APR Medical Surgical Description,Payment Typology 1,Payment Typology 2,Payment Typology 3,Birth Weight,Abortion Edit Indicator,Emergency Department Indicator,Total Charges,Total Costs
New York City,Queens,7003004,001630,Long Island Jewish Medical Center,30 to 49,115,F,White,Not Span/Hispanic,2,Elective,Home or Self Care,2018,NEO045,URINARY SYSTEM CANCERS - KIDNEY,URN008,NEPHRECTOMY AND URETERECTOMY,442,KIDNEY & URINARY TRACT PROCEDURES FOR MALIGNANCY,11,DISEASES AND DISORDERS OF THE KIDNEY AND URINARY TRACT,1,Minor,Minor,Surgical,Private Health Insurance,Private Health Insurance,Self-Pay,,,false,39623.25,8572.38
New York City,Queens,7003004,001630,Long Island Jewish Medical Center,70 or Older,116,M,Other Race,Not Span/Hispanic,15,Elective,Home w/ Home Health Services,2018,NEO043,URINARY SYSTEM CANCERS - BLADDER,URN009,CYSTECTOMY (INCLUDING FULGURATION) AND URETHRECTOMY,442,KIDNEY & URINARY TRACT PROCEDURES FOR MALIGNANCY,11,DISEASES AND DISORDERS OF THE KIDNEY AND URINARY TRACT,3,Major,Major,Surgical,Medicare,Medicare,Self-Pay,,,false,214219.68,43331.3
New York City,Manhattan,7002020,001453,Memorial Hospital for Cancer and Allied Diseases,50 to 69,OOS,M,White,Not Span/Hispanic,2,Elective,Home w/ Home Health Services,2018,NEO044,URINARY SYSTEM CANCERS - URETER AND RENAL PELVIS,URN008,NEPHRECTOMY AND URETERECTOMY,442,KIDNEY & URINARY TRACT PROCEDURES FOR MALIGNANCY,11,DISEASES AND DISORDERS OF THE KIDNEY AND URINARY TRACT,2,Moderate,Moderate,Surgical,Blue Cross/Blue Shield,Medicare,,,,false,45367.94,19858.6
New York City,Manhattan,7002020,001453,Memorial Hospital for Cancer and Allied Diseases,50 to 69,125,M,White,Not Span/Hispanic,3,Elective,Home or Self Care,2018,NEO045,URINARY SYSTEM CANCERS - KIDNEY,URN008,NEPHRECTOMY AND URETERECTOMY,442,KIDNEY & URINARY TRACT PROCEDURES FOR MALIGNANCY,11,DISEASES AND DISORDERS OF THE KIDNEY AND URINARY TRACT,3,Major,Moderate,Surgical,Medicare,Private Health Insurance,,,,false,64048,25696.51
New York City,Queens,7003010,001637,New York - Presbyterian/Queens,50 to 69,117,M,White,Not Span/Hispanic,4,Elective,Home or Self Care,2018,NEO045,URINARY SYSTEM CANCERS - KIDNEY,URN008,NEPHRECTOMY AND URETERECTOMY,442,KIDNEY & URINARY TRACT PROCEDURES FOR MALIGNANCY,11,DISEASES AND DISORDERS OF THE KIDNEY AND URINARY TRACT,1,Minor,Minor,Surgical,"Managed Care, Unspecified",Medicaid,Self-Pay,,,false,42254.93,16507.11
Capital/Adirond,Albany,0101004,000005,St. Peter's Hospital,50 to 69,120,M,White,Not Span/Hispanic,2,Elective,Home or Self Care,2018,NEO045,URINARY SYSTEM CANCERS - KIDNEY,URN008,NEPHRECTOMY AND URETERECTOMY,442,KIDNEY & URINARY TRACT PROCEDURES FOR MALIGNANCY,11,DISEASES AND DISORDERS OF THE KIDNEY AND URINARY TRACT,1,Minor,Minor,Surgical,Private Health Insurance,,,,,false,33793.9,13774.83
Long Island,Suffolk,5151001,000245,Stony Brook University Hospital,50 to 69,117,M,White,Not Span/Hispanic,3,Elective,Home or Self Care,2018,NEO045,URINARY SYSTEM CANCERS - KIDNEY,URN008,NEPHRECTOMY AND URETERECTOMY,442,KIDNEY & URINARY TRACT PROCEDURES FOR MALIGNANCY,11,DISEASES AND DISORDERS OF THE KIDNEY AND URINARY TRACT,3,Major,Minor,Surgical,Medicaid,Medicaid,,,,false,46791.28,19043.65
Long Island,Suffolk,5151001,000245,Stony Brook University Hospital,50 to 69,117,M,White,Not Span/Hispanic,3,Elective,Home or Self Care,2018,NEO045,URINARY SYSTEM CANCERS - KIDNEY,URN008,NEPHRECTOMY AND URETERECTOMY,442,KIDNEY & URINARY TRACT PROCEDURES FOR MALIGNANCY,11,DISEASES AND DISORDERS OF THE KIDNEY AND URINARY TRACT,2,Moderate,Moderate,Surgical,Medicare,Private Health Insurance,,,,false,54100.33,21053.95
Central NY,Onondaga,3301007,000635,University Hospital SUNY Health Science Center,70 or Older,130,F,White,Not Span/Hispanic,3,Elective,Home or Self Care,2018,NEO045,URINARY SYSTEM CANCERS - KIDNEY,URN008,NEPHRECTOMY AND URETERECTOMY,442,KIDNEY & URINARY TRACT PROCEDURES FOR MALIGNANCY,11,DISEASES AND DISORDERS OF THE KIDNEY AND URINARY TRACT,1,Minor,Minor,Surgical,Medicare,Private Health Insurance,,,,false,59587.9,17288.69
Central NY,Onondaga,3301007,000635,University Hospital SUNY Health Science Center,50 to 69,130,M,White,Not Span/Hispanic,1,Elective,Home or Self Care,2018,NEO045,URINARY SYSTEM CANCERS - KIDNEY,URN008,NEPHRECTOMY AND URETERECTOMY,442,KIDNEY & URINARY TRACT PROCEDURES FOR MALIGNANCY,11,DISEASES AND DISORDERS OF THE KIDNEY AND URINARY TRACT,2,Moderate,Minor,Surgical,Self-Pay,,,,,false,52205.1,14866.55
Hudson Valley,Dutchess,5957001,000180,Mid-Hudson Valley Division of Westchester Medical Center,50 to 69,126,F,White,Not Span/Hispanic,1,Elective,Home or Self Care,2018,NEO045,URINARY SYSTEM CANCERS - KIDNEY,URN008,NEPHRECTOMY AND URETERECTOMY,442,KIDNEY & URINARY TRACT PROCEDURES FOR MALIGNANCY,11,DISEASES AND DISORDERS OF THE KIDNEY AND URINARY TRACT,1,Minor,Minor,Surgical,Private Health Insurance,,,,,false,41090.41,8041.01
Central NY,Onondaga,3301007,000635,University Hospital SUNY Health Science Center,50 to 69,132,M,White,Not Span/Hispanic,1,Elective,Home or Self Care,2018,NEO045,URINARY SYSTEM CANCERS - KIDNEY,URN008,NEPHRECTOMY AND URETERECTOMY,442,KIDNEY & URINARY TRACT PROCEDURES FOR MALIGNANCY,11,DISEASES AND DISORDERS OF THE KIDNEY AND URINARY TRACT,2,Moderate,Minor,Surgical,Medicare,,,,,false,65302.4,22290.4
Central NY,Onondaga,3301007,000635,University Hospital SUNY Health Science Center,50 to 69,130,M,Black/African American,Not Span/Hispanic,4,Elective,Home or Self Care,2018,NEO045,URINARY SYSTEM CANCERS - KIDNEY,URN008,NEPHRECTOMY AND URETERECTOMY,442,KIDNEY & URINARY TRACT PROCEDURES FOR MALIGNANCY,11,DISEASES AND DISORDERS OF THE KIDNEY AND URINARY TRACT,3,Major,Major,Surgical,Medicare,,,,,false,75945.2,22577.07
Capital/Adirond,Schenectady,4601001,000829,Ellis Hospital,70 or Older,123,M,White,Not Span/Hispanic,6,Elective,Home w/ Home Health Services,2018,NEO044,URINARY SYSTEM CANCERS - URETER AND RENAL PELVIS,URN008,NEPHRECTOMY AND URETERECTOMY,442,KIDNEY & URINARY TRACT PROCEDURES FOR MALIGNANCY,11,DISEASES AND DISORDERS OF THE KIDNEY AND URINARY TRACT,3,Major,Major,Surgical,Medicare,Medicare,,,,false,46583.08,17640.87
New York City,Manhattan,7002020,001453,Memorial Hospital for Cancer and Allied Diseases,50 to 69,105,M,White,Not Span/Hispanic,1,Elective,Home or Self Care,2018,NEO045,URINARY SYSTEM CANCERS - KIDNEY,URN008,NEPHRECTOMY AND URETERECTOMY,442,KIDNEY & URINARY TRACT PROCEDURES FOR MALIGNANCY,11,DISEASES AND DISORDERS OF THE KIDNEY AND URINARY TRACT,2,Moderate,Minor,Surgical,Private Health Insurance,Private Health Insurance,,,,false,34899.77,14754.23
New York City,Manhattan,7002053,001463,NYU Langone Hospitals,70 or Older,100,M,White,Not Span/Hispanic,1,Elective,Home or Self Care,2018,NEO045,URINARY SYSTEM CANCERS - KIDNEY,URN008,NEPHRECTOMY AND URETERECTOMY,442,KIDNEY & URINARY TRACT PROCEDURES FOR MALIGNANCY,11,DISEASES AND DISORDERS OF THE KIDNEY AND URINARY TRACT,2,Moderate,Minor,Surgical,Medicare,,,,,false,148778.16,23857.62
Finger Lakes,Monroe,2701003,000411,Rochester General Hospital,70 or Older,145,M,White,Not Span/Hispanic,3,Elective,Home or Self Care,2018,NEO045,URINARY SYSTEM CANCERS - KIDNEY,URN008,NEPHRECTOMY AND URETERECTOMY,442,KIDNEY & URINARY TRACT PROCEDURES FOR MALIGNANCY,11,DISEASES AND DISORDERS OF THE KIDNEY AND URINARY TRACT,3,Major,Moderate,Surgical,Medicare,Blue Cross/Blue Shield,,,,false,20946.12,9136.08
Long Island,Suffolk,5149000,000895,John T Mather Memorial Hospital of Port Jefferson New York Inc,70 or Older,117,F,White,Not Span/Hispanic,3,Elective,Home w/ Home Health Services,2018,NEO044,URINARY SYSTEM CANCERS - URETER AND RENAL PELVIS,URN008,NEPHRECTOMY AND URETERECTOMY,442,KIDNEY & URINARY TRACT PROCEDURES FOR MALIGNANCY,11,DISEASES AND DISORDERS OF THE KIDNEY AND URINARY TRACT,2,Moderate,Minor,Surgical,Medicare,Medicare,,,,false,44734.4,11763.91
Finger Lakes,Monroe,2701003,000411,Rochester General Hospital,70 or Older,146,M,Other Race,Not Span/Hispanic,2,Elective,Home or Self Care,2018,NEO044,URINARY SYSTEM CANCERS - URETER AND RENAL PELVIS,URN008,NEPHRECTOMY AND URETERECTOMY,442,KIDNEY & URINARY TRACT PROCEDURES FOR MALIGNANCY,11,DISEASES AND DISORDERS OF THE KIDNEY AND URINARY TRACT,1,Minor,Moderate,Surgical,Medicare,,,,,false,19002.56,8082.62
Western NY,Erie,1401010,000216,Roswell Park Cancer Institute,50 to 69,142,M,White,Not Span/Hispanic,1,Elective,Home or Self Care,2018,NEO045,URINARY SYSTEM CANCERS - KIDNEY,URN008,NEPHRECTOMY AND URETERECTOMY,442,KIDNEY & URINARY TRACT PROCEDURES FOR MALIGNANCY,11,DISEASES AND DISORDERS OF THE KIDNEY AND URINARY TRACT,2,Moderate,Minor,Surgical,"Managed Care, Unspecified",Medicaid,,,,false,57009.81,20207.2
New York City,Bronx,7000006,003058,Montefiore Med Center - Jack D Weiler Hosp of A Einstein College Div,50 to 69,104,F,Black/African American,Not Span/Hispanic,1,Elective,Home or Self Care,2018,NEO045,URINARY SYSTEM CANCERS - KIDNEY,URN008,NEPHRECTOMY AND URETERECTOMY,442,KIDNEY & URINARY TRACT PROCEDURES FOR MALIGNANCY,11,DISEASES AND DISORDERS OF THE KIDNEY AND URINARY TRACT,2,Moderate,Minor,Surgical,Private Health Insurance,,,,,false,40090.52,7909.82
New York City,Kings,7001021,001306,New York - Presbyterian Brooklyn Methodist Hospital,70 or Older,112,F,White,Not Span/Hispanic,15,Elective,Inpatient Rehabilitation Facility,2018,NEO045,URINARY SYSTEM CANCERS - KIDNEY,URN008,NEPHRECTOMY AND URETERECTOMY,442,KIDNEY & URINARY TRACT PROCEDURES FOR MALIGNANCY,11,DISEASES AND DISORDERS OF THE KIDNEY AND URINARY TRACT,3,Major,Extreme,Surgical,Medicare,Blue Cross/Blue Shield,Self-Pay,,,false,229477.21,78721.38
New York City,Manhattan,7002054,001458,New York-Presbyterian Hospital - New York Weill Cornell Center,70 or Older,103,F,White,Not Span/Hispanic,1,Elective,Home or Self Care,2018,NEO045,URINARY SYSTEM CANCERS - KIDNEY,URN008,NEPHRECTOMY AND URETERECTOMY,442,KIDNEY & URINARY TRACT PROCEDURES FOR MALIGNANCY,11,DISEASES AND DISORDERS OF THE KIDNEY AND URINARY TRACT,2,Moderate,Minor,Surgical,Medicare,Medicare,Self-Pay,,,false,45519.06,13407.17
Long Island,Suffolk,5157003,000943,St Catherine of Siena Hospital,70 or Older,117,F,White,Not Span/Hispanic,11,Emergency,Home w/ Home Health Services,2018,NEO045,URINARY SYSTEM CANCERS - KIDNEY,URN008,NEPHRECTOMY AND URETERECTOMY,442,KIDNEY & URINARY TRACT PROCEDURES FOR MALIGNANCY,11,DISEASES AND DISORDERS OF THE KIDNEY AND URINARY TRACT,2,Moderate,Moderate,Surgical,Medicare,Private Health Insurance,,,,true,115256.56,21025.22
New York City,Kings,7001021,001306,New York - Presbyterian Brooklyn Methodist Hospital,70 or Older,112,F,White,Not Span/Hispanic,1,Elective,Home or Self Care,2018,NEO045,URINARY SYSTEM CANCERS - KIDNEY,URN008,NEPHRECTOMY AND URETERECTOMY,442,KIDNEY & URINARY TRACT PROCEDURES FOR MALIGNANCY,11,DISEASES AND DISORDERS OF THE KIDNEY AND URINARY TRACT,2,Moderate,Minor,Surgical,Private Health Insurance,Self-Pay,,,,false,19510.77,9996.13
Long Island,Nassau,2908000,000511,NYU Langone Hospital-Long Island,70 or Older,117,F,White,Not Span/Hispanic,3,Elective,Skilled Nursing Home,2018,NEO045,URINARY SYSTEM CANCERS - KIDNEY,URN008,NEPHRECTOMY AND URETERECTOMY,442,KIDNEY & URINARY TRACT PROCEDURES FOR MALIGNANCY,11,DISEASES AND DISORDERS OF THE KIDNEY AND URINARY TRACT,2,Moderate,Moderate,Surgical,Medicare,Medicare,,,,false,146391.21,23196.71
New York City,Manhattan,7002024,001456,Mount Sinai Hospital,30 to 49,112,M,Other Race,Not Span/Hispanic,1,Elective,Home or Self Care,2018,NEO045,URINARY SYSTEM CANCERS - KIDNEY,URN008,NEPHRECTOMY AND URETERECTOMY,442,KIDNEY & URINARY TRACT PROCEDURES FOR MALIGNANCY,11,DISEASES AND DISORDERS OF THE KIDNEY AND URINARY TRACT,2,Moderate,Minor,Surgical,Medicaid,Medicaid,Self-Pay,,,false,31018.55,11008.21
Capital/Adirond,Albany,0101004,000005,St. Peter's Hospital,70 or Older,121,F,White,Not Span/Hispanic,2,Elective,Home or Self Care,2018,NEO045,URINARY SYSTEM CANCERS - KIDNEY,URN008,NEPHRECTOMY AND URETERECTOMY,442,KIDNEY & URINARY TRACT PROCEDURES FOR MALIGNANCY,11,DISEASES AND DISORDERS OF THE KIDNEY AND URINARY TRACT,2,Moderate,Minor,Surgical,Medicare,Medicare,,,,false,33178.35,13274.69
Central NY,Onondaga,3301007,000635,University Hospital SUNY Health Science Center,70 or Older,138,M,White,Not Span/Hispanic,10,Elective,Home or Self Care,2018,NEO045,URINARY SYSTEM CANCERS - KIDNEY,URN008,NEPHRECTOMY AND URETERECTOMY,442,KIDNEY & URINARY TRACT PROCEDURES FOR MALIGNANCY,11,DISEASES AND DISORDERS OF THE KIDNEY AND URINARY TRACT,2,Moderate,Moderate,Surgical,Medicare,Private Health Insurance,,,,false,107271.24,31845.47
New York City,Manhattan,7002053,001463,NYU Langone Hospitals,30 to 49,OOS,M,Other Race,Not Span/Hispanic,1,Elective,Home or Self Care,2018,NEO045,URINARY SYSTEM CANCERS - KIDNEY,URN008,NEPHRECTOMY AND URETERECTOMY,442,KIDNEY & URINARY TRACT PROCEDURES FOR MALIGNANCY,11,DISEASES AND DISORDERS OF THE KIDNEY AND URINARY TRACT,1,Minor,Minor,Surgical,Private Health Insurance,,,,,false,107201.4,17773.44
New York City,Manhattan,7002054,001464,New York-Presbyterian Hospital - Columbia Presbyterian Center,70 or Older,OOS,M,White,Not Span/Hispanic,13,Emergency,Skilled Nursing Home,2018,NEO044,URINARY SYSTEM CANCERS - URETER AND RENAL PELVIS,URN001,CYSTOSCOPY AND URETEROSCOPY (INCLUDING BIOPSY),442,KIDNEY & URINARY TRACT PROCEDURES FOR MALIGNANCY,11,DISEASES AND DISORDERS OF THE KIDNEY AND URINARY TRACT,3,Major,Major,Surgical,Medicare,Blue Cross/Blue Shield,Self-Pay,,,true,231441.94,57023.56
Hudson Valley,Orange,3522000,000694,St Luke's Cornwall Hospital/Newburgh,50 to 69,109,F,Multi-racial,Unknown,2,Elective,Home or Self Care,2018,NEO045,URINARY SYSTEM CANCERS - KIDNEY,URN008,NEPHRECTOMY AND URETERECTOMY,442,KIDNEY & URINARY TRACT PROCEDURES FOR MALIGNANCY,11,DISEASES AND DISORDERS OF THE KIDNEY AND URINARY TRACT,2,Moderate,Minor,Surgical,Private Health Insurance,,,,,false,46059.97,15478.86
Capital/Adirond,Albany,0101004,000005,St. Peter's Hospital,70 or Older,124,F,White,Not Span/Hispanic,2,Elective,Home or Self Care,2018,NEO045,URINARY SYSTEM CANCERS - KIDNEY,URN008,NEPHRECTOMY AND URETERECTOMY,442,KIDNEY & URINARY TRACT PROCEDURES FOR MALIGNANCY,11,DISEASES AND DISORDERS OF THE KIDNEY AND URINARY TRACT,2,Moderate,Moderate,Surgical,Medicare,Medicare,,,,false,30735.25,12238.31
New York City,Manhattan,7002020,001453,Memorial Hospital for Cancer and Allied Diseases,50 to 69,OOS,F,White,Not Span/Hispanic,1,Elective,Home or Self Care,2018,NEO045,URINARY SYSTEM CANCERS - KIDNEY,URN008,NEPHRECTOMY AND URETERECTOMY,442,KIDNEY & URINARY TRACT PROCEDURES FOR MALIGNANCY,11,DISEASES AND DISORDERS OF THE KIDNEY AND URINARY TRACT,1,Minor,Minor,Surgical,Blue Cross/Blue Shield,,,,,false,32285.8,13996.77
New York City,Queens,7003004,001630,Long Island Jewish Medical Center,50 to 69,117,M,White,Not Span/Hispanic,3,Elective,Home or Self Care,2018,NEO045,URINARY SYSTEM CANCERS - KIDNEY,URN008,NEPHRECTOMY AND URETERECTOMY,442,KIDNEY & URINARY TRACT PROCEDURES FOR MALIGNANCY,11,DISEASES AND DISORDERS OF THE KIDNEY AND URINARY TRACT,2,Moderate,Minor,Surgical,Medicare,Blue Cross/Blue Shield,Self-Pay,,,false,64488.22,13742.08
Finger Lakes,Monroe,2701003,000411,Rochester General Hospital,50 to 69,146,M,White,Not Span/Hispanic,2,Elective,Home or Self Care,2018,NEO045,URINARY SYSTEM CANCERS - KIDNEY,URN008,NEPHRECTOMY AND URETERECTOMY,442,KIDNEY & URINARY TRACT PROCEDURES FOR MALIGNANCY,11,DISEASES AND DISORDERS OF THE KIDNEY AND URINARY TRACT,2,Moderate,Minor,Surgical,Blue Cross/Blue Shield,,,,,false,37397.49,13892.64
Capital/Adirond,Albany,0101000,000001,Albany Medical Center Hospital,50 to 69,121,M,Black/African American,Not Span/Hispanic,2,Elective,Home or Self Care,2018,NEO045,URINARY SYSTEM CANCERS - KIDNEY,URN008,NEPHRECTOMY AND URETERECTOMY,442,KIDNEY & URINARY TRACT PROCEDURES FOR MALIGNANCY,11,DISEASES AND DISORDERS OF THE KIDNEY AND URINARY TRACT,2,Moderate,Moderate,Surgical,"Managed Care, Unspecified",,,,,false,38354.99,13362.93
Western NY,Erie,1401010,000216,Roswell Park Cancer Institute,50 to 69,142,M,Black/African American,Not Span/Hispanic,2,Elective,Home or Self Care,2018,NEO045,URINARY SYSTEM CANCERS - KIDNEY,URN008,NEPHRECTOMY AND URETERECTOMY,442,KIDNEY & URINARY TRACT PROCEDURES FOR MALIGNANCY,11,DISEASES AND DISORDERS OF THE KIDNEY AND URINARY TRACT,2,Moderate,Minor,Surgical,"Managed Care, Unspecified",Medicaid,,,,false,28343.69,10806.4
Hudson Valley,Rockland,4329000,000779,Good Samaritan Hospital of Suffern,70 or Older,109,M,Other Race,Spanish/Hispanic,12,Emergency,Home or Self Care,2018,NEO045,URINARY SYSTEM CANCERS - KIDNEY,URN008,NEPHRECTOMY AND URETERECTOMY,442,KIDNEY & URINARY TRACT PROCEDURES FOR MALIGNANCY,11,DISEASES AND DISORDERS OF THE KIDNEY AND URINARY TRACT,4,Extreme,Major,Surgical,Medicare,,,,,true,229834.27,40586.79
Capital/Adirond,Albany,0101000,000001,Albany Medical Center Hospital,70 or Older,122,M,White,Not Span/Hispanic,1,Elective,Home or Self Care,2018,NEO045,URINARY SYSTEM CANCERS - KIDNEY,URN008,NEPHRECTOMY AND URETERECTOMY,442,KIDNEY & URINARY TRACT PROCEDURES FOR MALIGNANCY,11,DISEASES AND DISORDERS OF THE KIDNEY AND URINARY TRACT,2,Moderate,Moderate,Surgical,Medicare,,,,,false,46924.94,19250.07
Central NY,Onondaga,3301007,000635,University Hospital SUNY Health Science Center,50 to 69,148,M,White,Not Span/Hispanic,1,Elective,Home or Self Care,2018,NEO045,URINARY SYSTEM CANCERS - KIDNEY,URN008,NEPHRECTOMY AND URETERECTOMY,442,KIDNEY & URINARY TRACT PROCEDURES FOR MALIGNANCY,11,DISEASES AND DISORDERS OF THE KIDNEY AND URINARY TRACT,1,Minor,Minor,Surgical,Private Health Insurance,,,,,false,47860.8,14486.48
New York City,Manhattan,7002020,001453,Memorial Hospital for Cancer and Allied Diseases,30 to 49,OOS,M,White,Not Span/Hispanic,2,Elective,Home or Self Care,2018,NEO045,URINARY SYSTEM CANCERS - KIDNEY,URN008,NEPHRECTOMY AND URETERECTOMY,442,KIDNEY & URINARY TRACT PROCEDURES FOR MALIGNANCY,11,DISEASES AND DISORDERS OF THE KIDNEY AND URINARY TRACT,3,Major,Moderate,Surgical,Private Health Insurance,,,,,false,65141.4,27160.74
New York City,Kings,7001020,001305,Maimonides Medical Center,50 to 69,112,F,White,Not Span/Hispanic,1,Elective,Home or Self Care,2018,NEO045,URINARY SYSTEM CANCERS - KIDNEY,URN008,NEPHRECTOMY AND URETERECTOMY,442,KIDNEY & URINARY TRACT PROCEDURES FOR MALIGNANCY,11,DISEASES AND DISORDERS OF THE KIDNEY AND URINARY TRACT,2,Moderate,Minor,Surgical,Medicaid,Self-Pay,,,,false,44466.03,14160.82
New York City,Manhattan,7002054,001458,New York-Presbyterian Hospital - New York Weill Cornell Center,70 or Older,113,M,Other Race,Not Span/Hispanic,2,Elective,Home or Self Care,2018,NEO045,URINARY SYSTEM CANCERS - KIDNEY,URN008,NEPHRECTOMY AND URETERECTOMY,442,KIDNEY & URINARY TRACT PROCEDURES FOR MALIGNANCY,11,DISEASES AND DISORDERS OF THE KIDNEY AND URINARY TRACT,1,Minor,Minor,Surgical,Medicare,Private Health Insurance,Self-Pay,,,false,51143.24,14355.54
Western NY,Erie,1401014,003067,Millard Fillmore Suburban Hospital,50 to 69,140,M,White,Not Span/Hispanic,1,Elective,Home or Self Care,2018,NEO045,URINARY SYSTEM CANCERS - KIDNEY,URN008,NEPHRECTOMY AND URETERECTOMY,442,KIDNEY & URINARY TRACT PROCEDURES FOR MALIGNANCY,11,DISEASES AND DISORDERS OF THE KIDNEY AND URINARY TRACT,2,Moderate,Moderate,Surgical,Medicare,Private Health Insurance,Self-Pay,,,false,43698.9,13087.79
Finger Lakes,Wayne,5820000,001028,Newark-Wayne Community Hospital,50 to 69,145,M,Other Race,Spanish/Hispanic,3,Elective,Home or Self Care,2018,NEO045,URINARY SYSTEM CANCERS - KIDNEY,URN002,KIDNEY AND OTHER URINARY TRACT BIOPSY (NON-ENDOSCOPIC),442,KIDNEY & URINARY TRACT PROCEDURES FOR MALIGNANCY,11,DISEASES AND DISORDERS OF THE KIDNEY AND URINARY TRACT,1,Minor,Moderate,Surgical,Medicaid,,,,,false,23103.07,9401.61
New York City,Manhattan,7002020,001453,Memorial Hospital for Cancer and Allied Diseases,30 to 49,112,M,White,Not Span/Hispanic,2,Elective,Home or Self Care,2018,NEO045,URINARY SYSTEM CANCERS - KIDNEY,URN008,NEPHRECTOMY AND URETERECTOMY,442,KIDNEY & URINARY TRACT PROCEDURES FOR MALIGNANCY,11,DISEASES AND DISORDERS OF THE KIDNEY AND URINARY TRACT,2,Moderate,Moderate,Surgical,Blue Cross/Blue Shield,,,,,false,40289.37,16506.04
Capital/Adirond,Albany,0101004,000005,St. Peter's Hospital,50 to 69,128,M,White,Not Span/Hispanic,3,Elective,Home or Self Care,2018,NEO045,URINARY SYSTEM CANCERS - KIDNEY,URN008,NEPHRECTOMY AND URETERECTOMY,442,KIDNEY & URINARY TRACT PROCEDURES FOR MALIGNANCY,11,DISEASES AND DISORDERS OF THE KIDNEY AND URINARY TRACT,3,Major,Major,Surgical,Medicare,Private Health Insurance,,,,false,33534.1,14078.35
Western NY,Erie,1401014,003067,Millard Fillmore Suburban Hospital,50 to 69,140,M,White,Not Span/Hispanic,4,Elective,Home or Self Care,2018,NEO045,URINARY SYSTEM CANCERS - KIDNEY,URN008,NEPHRECTOMY AND URETERECTOMY,442,KIDNEY & URINARY TRACT PROCEDURES FOR MALIGNANCY,11,DISEASES AND DISORDERS OF THE KIDNEY AND URINARY TRACT,2,Moderate,Minor,Surgical,Blue Cross/Blue Shield,Self-Pay,,,,false,58368.78,18432.07
Central NY,Onondaga,3301007,000635,University Hospital SUNY Health Science Center,50 to 69,133,F,White,Not Span/Hispanic,1,Elective,Home or Self Care,2018,NEO045,URINARY SYSTEM CANCERS - KIDNEY,URN008,NEPHRECTOMY AND URETERECTOMY,442,KIDNEY & URINARY TRACT PROCEDURES FOR MALIGNANCY,11,DISEASES AND DISORDERS OF THE KIDNEY AND URINARY TRACT,2,Moderate,Minor,Surgical,Private Health Insurance,,,,,false,49542.5,14969.83
Western NY,Erie,1401014,003067,Millard Fillmore Suburban Hospital,30 to 49,142,M,White,Not Span/Hispanic,1,Elective,Home or Self Care,2018,NEO045,URINARY SYSTEM CANCERS - KIDNEY,URN008,NEPHRECTOMY AND URETERECTOMY,442,KIDNEY & URINARY TRACT PROCEDURES FOR MALIGNANCY,11,DISEASES AND DISORDERS OF THE KIDNEY AND URINARY TRACT,2,Moderate,Minor,Surgical,Blue Cross/Blue Shield,Self-Pay,,,,false,39038.54,11834
Hudson Valley,Orange,3523000,000699,Garnet Health Medical Center,50 to 69,109,M,White,Not Span/Hispanic,21,Elective,Home w/ Home Health Services,2018,NEO045,URINARY SYSTEM CANCERS - KIDNEY,URN008,NEPHRECTOMY AND URETERECTOMY,442,KIDNEY & URINARY TRACT PROCEDURES FOR MALIGNANCY,11,DISEASES AND DISORDERS OF THE KIDNEY AND URINARY TRACT,4,Extreme,Extreme,Surgical,Blue Cross/Blue Shield,Blue Cross/Blue Shield,,,,false,192137.04,56288.61
Western NY,Erie,1401010,000216,Roswell Park Cancer Institute,50 to 69,140,F,White,Not Span/Hispanic,4,Elective,Home or Self Care,2018,NEO044,URINARY SYSTEM CANCERS - URETER AND RENAL PELVIS,URN008,NEPHRECTOMY AND URETERECTOMY,442,KIDNEY & URINARY TRACT PROCEDURES FOR MALIGNANCY,11,DISEASES AND DISORDERS OF THE KIDNEY AND URINARY TRACT,1,Minor,Minor,Surgical,"Managed Care, Unspecified",,,,,false,59821.89,20868.58
Western NY,Erie,1401010,000216,Roswell Park Cancer Institute,30 to 49,140,M,White,Not Span/Hispanic,1,Urgent,Home or Self Care,2018,NEO045,URINARY SYSTEM CANCERS - KIDNEY,URN008,NEPHRECTOMY AND URETERECTOMY,442,KIDNEY & URINARY TRACT PROCEDURES FOR MALIGNANCY,11,DISEASES AND DISORDERS OF THE KIDNEY AND URINARY TRACT,1,Minor,Minor,Surgical,Private Health Insurance,Medicaid,,,,false,36356.36,12446.7
New York City,Kings,7001020,001305,Maimonides Medical Center,50 to 69,112,M,Black/African American,Not Span/Hispanic,1,Elective,Home or Self Care,2018,NEO045,URINARY SYSTEM CANCERS - KIDNEY,URN008,NEPHRECTOMY AND URETERECTOMY,442,KIDNEY & URINARY TRACT PROCEDURES FOR MALIGNANCY,11,DISEASES AND DISORDERS OF THE KIDNEY AND URINARY TRACT,1,Minor,Minor,Surgical,Blue Cross/Blue Shield,Self-Pay,,,,false,41789.01,14665.88