Hospital Service Area,Hospital County,Operating Certificate Number,Permanent Facility Id,Facility Name,Age Group,Zip Code - 3 digits,Gender,Race,Ethnicity,Length of Stay,Type of Admission,Patient Disposition,Discharge Year,CCS Diagnosis Code,CCS Diagnosis Description,CCS Procedure Code,CCS Procedure Description,APR DRG Code,APR DRG Description,APR MDC Code,APR MDC Description,APR Severity of Illness Code,APR Severity of Illness Description,APR Risk of Mortality,APR Medical Surgical Description,Payment Typology 1,Payment Typology 2,Payment Typology 3,Birth Weight,Abortion Edit Indicator,Emergency Department Indicator,Total Charges,Total Costs
New York City,Kings,7002053,001304,NYU Langone Hospital-Brooklyn,30 to 49,112,F,Other Race,Not Span/Hispanic,5,Elective,Home or Self Care,2019,NEO045,URINARY SYSTEM CANCERS - KIDNEY,URN008,NEPHRECTOMY AND URETERECTOMY,442,KIDNEY & URINARY TRACT PROCEDURES FOR MALIGNANCY,11,DISEASES AND DISORDERS OF THE KIDNEY AND URINARY TRACT,1,Minor,Minor,Surgical,Medicaid,,,,,false,145454.68,43284.57
New York City,Kings,7002053,001304,NYU Langone Hospital-Brooklyn,30 to 49,103,M,Other Race,Spanish/Hispanic,5,Elective,Home or Self Care,2019,NEO045,URINARY SYSTEM CANCERS - KIDNEY,URN008,NEPHRECTOMY AND URETERECTOMY,442,KIDNEY & URINARY TRACT PROCEDURES FOR MALIGNANCY,11,DISEASES AND DISORDERS OF THE KIDNEY AND URINARY TRACT,2,Moderate,Moderate,Surgical,Medicaid,,,,,false,142406.64,43042.26
New York City,Kings,7002053,001304,NYU Langone Hospital-Brooklyn,70 or Older,112,M,White,Not Span/Hispanic,4,Elective,Home w/ Home Health Services,2019,NEO045,URINARY SYSTEM CANCERS - KIDNEY,URN008,NEPHRECTOMY AND URETERECTOMY,442,KIDNEY & URINARY TRACT PROCEDURES FOR MALIGNANCY,11,DISEASES AND DISORDERS OF THE KIDNEY AND URINARY TRACT,3,Major,Major,Surgical,Medicare,Medicare,,,,false,172516.63,31960.51
New York City,Kings,7002053,001304,NYU Langone Hospital-Brooklyn,50 to 69,112,M,Black/African American,Not Span/Hispanic,2,Elective,Home or Self Care,2019,NEO045,URINARY SYSTEM CANCERS - KIDNEY,URN005,NEPHROSTOMY AND URETEROSTOMY PROCEDURES (INCLUDING STENTS),442,KIDNEY & URINARY TRACT PROCEDURES FOR MALIGNANCY,11,DISEASES AND DISORDERS OF THE KIDNEY AND URINARY TRACT,1,Minor,Moderate,Surgical,Private Health Insurance,,,,,false,173438.55,28912.81
New York City,Kings,7002053,001304,NYU Langone Hospital-Brooklyn,70 or Older,112,M,Other Race,Spanish/Hispanic,2,Elective,Home or Self Care,2019,NEO045,URINARY SYSTEM CANCERS - KIDNEY,URN008,NEPHRECTOMY AND URETERECTOMY,442,KIDNEY & URINARY TRACT PROCEDURES FOR MALIGNANCY,11,DISEASES AND DISORDERS OF THE KIDNEY AND URINARY TRACT,2,Moderate,Minor,Surgical,Medicaid,,,,,false,163368.19,30996.66
New York City,Kings,7002053,001304,NYU Langone Hospital-Brooklyn,50 to 69,112,M,Black/African American,Not Span/Hispanic,2,Elective,Home or Self Care,2019,NEO045,URINARY SYSTEM CANCERS - KIDNEY,URN008,NEPHRECTOMY AND URETERECTOMY,442,KIDNEY & URINARY TRACT PROCEDURES FOR MALIGNANCY,11,DISEASES AND DISORDERS OF THE KIDNEY AND URINARY TRACT,1,Minor,Moderate,Surgical,Private Health Insurance,,,,,false,186311.82,34481.68
New York City,Kings,7002053,001304,NYU Langone Hospital-Brooklyn,30 to 49,112,M,Black/African American,Not Span/Hispanic,2,Elective,Home or Self Care,2019,NEO045,URINARY SYSTEM CANCERS - KIDNEY,URN008,NEPHRECTOMY AND URETERECTOMY,442,KIDNEY & URINARY TRACT PROCEDURES FOR MALIGNANCY,11,DISEASES AND DISORDERS OF THE KIDNEY AND URINARY TRACT,1,Minor,Minor,Surgical,Blue Cross/Blue Shield,,,,,false,151165.3,25388.07
New York City,Kings,7002053,001304,NYU Langone Hospital-Brooklyn,50 to 69,112,F,Black/African American,Not Span/Hispanic,2,Elective,Home or Self Care,2019,NEO045,URINARY SYSTEM CANCERS - KIDNEY,OTR001,ROBOTIC-ASSISTED PROCEDURES,442,KIDNEY & URINARY TRACT PROCEDURES FOR MALIGNANCY,11,DISEASES AND DISORDERS OF THE KIDNEY AND URINARY TRACT,2,Moderate,Minor,Surgical,Private Health Insurance,,,,,false,185200.42,34004.64
New York City,Kings,7002053,001304,NYU Langone Hospital-Brooklyn,70 or Older,113,M,Other Race,Not Span/Hispanic,2,Elective,Home w/ Home Health Services,2019,NEO045,URINARY SYSTEM CANCERS - KIDNEY,URN008,NEPHRECTOMY AND URETERECTOMY,442,KIDNEY & URINARY TRACT PROCEDURES FOR MALIGNANCY,11,DISEASES AND DISORDERS OF THE KIDNEY AND URINARY TRACT,3,Major,Moderate,Surgical,Medicaid,,,,,false,185998.3,34607.25
New York City,Kings,7002053,001304,NYU Langone Hospital-Brooklyn,70 or Older,112,M,Other Race,Spanish/Hispanic,5,Emergency,Home or Self Care,2019,NEO045,URINARY SYSTEM CANCERS - KIDNEY,URN008,NEPHRECTOMY AND URETERECTOMY,442,KIDNEY & URINARY TRACT PROCEDURES FOR MALIGNANCY,11,DISEASES AND DISORDERS OF THE KIDNEY AND URINARY TRACT,3,Major,Moderate,Surgical,Medicare,,,,,true,184825.37,36505.32
New York City,Kings,7002053,001304,NYU Langone Hospital-Brooklyn,30 to 49,112,F,Other Race,Spanish/Hispanic,2,Elective,Home or Self Care,2019,NEO045,URINARY SYSTEM CANCERS - KIDNEY,URN008,NEPHRECTOMY AND URETERECTOMY,442,KIDNEY & URINARY TRACT PROCEDURES FOR MALIGNANCY,11,DISEASES AND DISORDERS OF THE KIDNEY AND URINARY TRACT,2,Moderate,Minor,Surgical,Medicare,Medicaid,,,,false,144733.1,24566.75
New York City,Kings,7002053,001304,NYU Langone Hospital-Brooklyn,30 to 49,113,M,Other Race,Not Span/Hispanic,4,Elective,Home or Self Care,2019,NEO045,URINARY SYSTEM CANCERS - KIDNEY,URN008,NEPHRECTOMY AND URETERECTOMY,442,KIDNEY & URINARY TRACT PROCEDURES FOR MALIGNANCY,11,DISEASES AND DISORDERS OF THE KIDNEY AND URINARY TRACT,1,Minor,Minor,Surgical,Medicaid,,,,,false,104239.09,23285.22
