Hospital Service Area,Hospital County,Operating Certificate Number,Permanent Facility Id,Facility Name,Age Group,Zip Code - 3 digits,Gender,Race,Ethnicity,Length of Stay,Type of Admission,Patient Disposition,Discharge Year,CCS Diagnosis Code,CCS Diagnosis Description,CCS Procedure Code,CCS Procedure Description,APR DRG Code,APR DRG Description,APR MDC Code,APR MDC Description,APR Severity of Illness Code,APR Severity of Illness Description,APR Risk of Mortality,APR Medical Surgical Description,Payment Typology 1,Payment Typology 2,Payment Typology 3,Birth Weight,Abortion Edit Indicator,Emergency Department Indicator,Total Charges,Total Costs
New York City,Kings,7002053,001304,NYU Langone Hospital-Brooklyn,30 to 49,113,M,Other Race,Not Span/Hispanic,1,Elective,Home or Self Care,2020,GEN006,OTHER SPECIFIED AND UNSPECIFIED DISEASES OF KIDNEY AND URETERS,URN004,REMOVAL OF CALCULI AND OTHER MATTER FROM URINARY TRACT,443,KIDNEY & URINARY TRACT PROCEDURES FOR NONMALIGNANCY,11,DISEASES AND DISORDERS OF THE KIDNEY AND URINARY TRACT,1,Minor,Minor,Surgical,Medicaid,,,,,N,139970.89,21143.56
New York City,Kings,7002053,001304,NYU Langone Hospital-Brooklyn,50 to 69,112,M,White,Not Span/Hispanic,14,Emergency,Home or Self Care,2020,INJ037,"COMPLICATION OF OTHER SURGICAL OR MEDICAL CARE, INJURY, INITIAL ENCOUNTER",URN008,NEPHRECTOMY AND URETERECTOMY,443,KIDNEY & URINARY TRACT PROCEDURES FOR NONMALIGNANCY,11,DISEASES AND DISORDERS OF THE KIDNEY AND URINARY TRACT,3,Major,Moderate,Surgical,Blue Cross/Blue Shield,,,,,Y,400811.66,94424.05
New York City,Kings,7002053,001304,NYU Langone Hospital-Brooklyn,50 to 69,112,M,Black/African American,Not Span/Hispanic,42,Emergency,Skilled Nursing Home,2020,GEN006,OTHER SPECIFIED AND UNSPECIFIED DISEASES OF KIDNEY AND URETERS,URN012,"URINARY SYSTEM PROCEDURES, NEC",443,KIDNEY & URINARY TRACT PROCEDURES FOR NONMALIGNANCY,11,DISEASES AND DISORDERS OF THE KIDNEY AND URINARY TRACT,2,Moderate,Moderate,Surgical,Medicaid,,,,,Y,730480.52,196671.16
New York City,Kings,7002053,001304,NYU Langone Hospital-Brooklyn,30 to 49,112,M,White,Spanish/Hispanic,2,Elective,Home or Self Care,2020,GEN006,OTHER SPECIFIED AND UNSPECIFIED DISEASES OF KIDNEY AND URETERS,URN007,URINARY TRACT REPAIR,443,KIDNEY & URINARY TRACT PROCEDURES FOR NONMALIGNANCY,11,DISEASES AND DISORDERS OF THE KIDNEY AND URINARY TRACT,3,Major,Moderate,Surgical,Medicaid,,,,,N,211625.91,38115.71
New York City,Kings,7002053,001304,NYU Langone Hospital-Brooklyn,50 to 69,112,M,Other Race,Not Span/Hispanic,1,Emergency,Home or Self Care,2020,GEN006,OTHER SPECIFIED AND UNSPECIFIED DISEASES OF KIDNEY AND URETERS,URN004,REMOVAL OF CALCULI AND OTHER MATTER FROM URINARY TRACT,443,KIDNEY & URINARY TRACT PROCEDURES FOR NONMALIGNANCY,11,DISEASES AND DISORDERS OF THE KIDNEY AND URINARY TRACT,1,Minor,Minor,Surgical,Medicaid,,,,,Y,75091.03,12464.25
New York City,Kings,7002053,001304,NYU Langone Hospital-Brooklyn,50 to 69,112,F,Other Race,Not Span/Hispanic,5,Emergency,Home or Self Care,2020,CIR029,AORTIC; PERIPHERAL; AND VISCERAL ARTERY ANEURYSMS,URN008,NEPHRECTOMY AND URETERECTOMY,443,KIDNEY & URINARY TRACT PROCEDURES FOR NONMALIGNANCY,11,DISEASES AND DISORDERS OF THE KIDNEY AND URINARY TRACT,2,Moderate,Minor,Surgical,Medicare,,,,,Y,269619.38,45383.9
New York City,Kings,7002053,001304,NYU Langone Hospital-Brooklyn,70 or Older,112,F,White,Not Span/Hispanic,1,Elective,Skilled Nursing Home,2020,INJ034,"COMPLICATION OF GENITOURINARY DEVICE, IMPLANT OR GRAFT, INITIAL ENCOUNTER",URN004,REMOVAL OF CALCULI AND OTHER MATTER FROM URINARY TRACT,443,KIDNEY & URINARY TRACT PROCEDURES FOR NONMALIGNANCY,11,DISEASES AND DISORDERS OF THE KIDNEY AND URINARY TRACT,2,Moderate,Moderate,Surgical,Medicare,Medicaid,,,,N,96283.12,15198.24
New York City,Kings,7002053,001304,NYU Langone Hospital-Brooklyn,50 to 69,103,F,White,Spanish/Hispanic,8,Emergency,Home or Self Care,2020,INJ034,"COMPLICATION OF GENITOURINARY DEVICE, IMPLANT OR GRAFT, INITIAL ENCOUNTER",URN003,URETER AND OTHER URINARY TRACT DILATION,443,KIDNEY & URINARY TRACT PROCEDURES FOR NONMALIGNANCY,11,DISEASES AND DISORDERS OF THE KIDNEY AND URINARY TRACT,3,Major,Major,Surgical,Private Health Insurance,,,,,Y,156027.39,35340.33
New York City,Kings,7002053,001304,NYU Langone Hospital-Brooklyn,50 to 69,112,M,Black/African American,Not Span/Hispanic,2,Emergency,Home or Self Care,2020,GEN006,OTHER SPECIFIED AND UNSPECIFIED DISEASES OF KIDNEY AND URETERS,URN004,REMOVAL OF CALCULI AND OTHER MATTER FROM URINARY TRACT,443,KIDNEY & URINARY TRACT PROCEDURES FOR NONMALIGNANCY,11,DISEASES AND DISORDERS OF THE KIDNEY AND URINARY TRACT,2,Moderate,Major,Surgical,Private Health Insurance,,,,,Y,74815.43,15849
New York City,Kings,7002053,001304,NYU Langone Hospital-Brooklyn,30 to 49,112,F,Other Race,Spanish/Hispanic,1,Elective,Home or Self Care,2020,GEN006,OTHER SPECIFIED AND UNSPECIFIED DISEASES OF KIDNEY AND URETERS,URN012,"URINARY SYSTEM PROCEDURES, NEC",443,KIDNEY & URINARY TRACT PROCEDURES FOR NONMALIGNANCY,11,DISEASES AND DISORDERS OF THE KIDNEY AND URINARY TRACT,1,Minor,Minor,Surgical,Medicaid,,,,,N,124709.12,18587.19
New York City,Kings,7002053,001304,NYU Langone Hospital-Brooklyn,50 to 69,112,F,Other Race,Spanish/Hispanic,18,Emergency,Home or Self Care,2020,INJ034,"COMPLICATION OF GENITOURINARY DEVICE, IMPLANT OR GRAFT, INITIAL ENCOUNTER",URN003,URETER AND OTHER URINARY TRACT DILATION,443,KIDNEY & URINARY TRACT PROCEDURES FOR NONMALIGNANCY,11,DISEASES AND DISORDERS OF THE KIDNEY AND URINARY TRACT,3,Major,Moderate,Surgical,Private Health Insurance,,,,,Y,345950.15,100781.27
New York City,Kings,7002053,001304,NYU Langone Hospital-Brooklyn,50 to 69,112,M,Other Race,Not Span/Hispanic,8,Elective,Skilled Nursing Home,2020,GEN007,OTHER SPECIFIED AND UNSPECIFIED DISEASES OF BLADDER AND URETHRA,URN010,URINARY DIVERSION WITH ANASTOMOSIS OR OSTOMY,443,KIDNEY & URINARY TRACT PROCEDURES FOR NONMALIGNANCY,11,DISEASES AND DISORDERS OF THE KIDNEY AND URINARY TRACT,3,Major,Moderate,Surgical,Medicare,Medicaid,,,,N,204807.58,50381.36
New York City,Kings,7002053,001304,NYU Langone Hospital-Brooklyn,50 to 69,112,F,Other Race,Not Span/Hispanic,2,Elective,Home or Self Care,2020,GEN006,OTHER SPECIFIED AND UNSPECIFIED DISEASES OF KIDNEY AND URETERS,URN008,NEPHRECTOMY AND URETERECTOMY,443,KIDNEY & URINARY TRACT PROCEDURES FOR NONMALIGNANCY,11,DISEASES AND DISORDERS OF THE KIDNEY AND URINARY TRACT,2,Moderate,Moderate,Surgical,Private Health Insurance,,,,,N,145505.88,24823.74
New York City,Kings,7002053,001304,NYU Langone Hospital-Brooklyn,18 to 29,112,M,White,Not Span/Hispanic,1,Elective,Home or Self Care,2020,GEN006,OTHER SPECIFIED AND UNSPECIFIED DISEASES OF KIDNEY AND URETERS,URN007,URINARY TRACT REPAIR,443,KIDNEY & URINARY TRACT PROCEDURES FOR NONMALIGNANCY,11,DISEASES AND DISORDERS OF THE KIDNEY AND URINARY TRACT,1,Minor,Minor,Surgical,Private Health Insurance,,,,,N,144266.89,22921.01
New York City,Kings,7002053,001304,NYU Langone Hospital-Brooklyn,18 to 29,112,M,White,Not Span/Hispanic,7,Elective,Home w/ Home Health Services,2020,GEN005,CALCULUS OF URINARY TRACT,URN004,REMOVAL OF CALCULI AND OTHER MATTER FROM URINARY TRACT,443,KIDNEY & URINARY TRACT PROCEDURES FOR NONMALIGNANCY,11,DISEASES AND DISORDERS OF THE KIDNEY AND URINARY TRACT,3,Major,Moderate,Surgical,Medicaid,,,,,N,252080.36,56258.2
New York City,Kings,7002053,001304,NYU Langone Hospital-Brooklyn,18 to 29,,F,Black/African American,Not Span/Hispanic,2,Elective,Home or Self Care,2020,GEN004,URINARY TRACT INFECTIONS,URN004,REMOVAL OF CALCULI AND OTHER MATTER FROM URINARY TRACT,443,KIDNEY & URINARY TRACT PROCEDURES FOR NONMALIGNANCY,11,DISEASES AND DISORDERS OF THE KIDNEY AND URINARY TRACT,1,Minor,Minor,Surgical,Medicaid,,,,,N,153084.81,33355.29
New York City,Kings,7002053,001304,NYU Langone Hospital-Brooklyn,70 or Older,112,F,White,Not Span/Hispanic,1,Elective,Home w/ Home Health Services,2020,GEN005,CALCULUS OF URINARY TRACT,URN004,REMOVAL OF CALCULI AND OTHER MATTER FROM URINARY TRACT,443,KIDNEY & URINARY TRACT PROCEDURES FOR NONMALIGNANCY,11,DISEASES AND DISORDERS OF THE KIDNEY AND URINARY TRACT,1,Minor,Minor,Surgical,Medicare,Medicare,,,,N,117174.88,19281.52
New York City,Kings,7002053,001304,NYU Langone Hospital-Brooklyn,50 to 69,112,F,Black/African American,Not Span/Hispanic,2,Elective,Home or Self Care,2020,GEN005,CALCULUS OF URINARY TRACT,URN003,URETER AND OTHER URINARY TRACT DILATION,443,KIDNEY & URINARY TRACT PROCEDURES FOR NONMALIGNANCY,11,DISEASES AND DISORDERS OF THE KIDNEY AND URINARY TRACT,2,Moderate,Moderate,Surgical,Self-Pay,,,,,N,152994.12,27014.97
New York City,Kings,7002053,001304,NYU Langone Hospital-Brooklyn,70 or Older,112,M,White,Not Span/Hispanic,7,Elective,Skilled Nursing Home,2020,GEN005,CALCULUS OF URINARY TRACT,URN010,URINARY DIVERSION WITH ANASTOMOSIS OR OSTOMY,443,KIDNEY & URINARY TRACT PROCEDURES FOR NONMALIGNANCY,11,DISEASES AND DISORDERS OF THE KIDNEY AND URINARY TRACT,3,Major,Moderate,Surgical,Medicare,,,,,N,195799.7,45738.84
