Hospital Service Area,Hospital County,Operating Certificate Number,Permanent Facility Id,Facility Name,Age Group,Zip Code - 3 digits,Gender,Race,Ethnicity,Length of Stay,Type of Admission,Patient Disposition,Discharge Year,CCS Diagnosis Code,CCS Diagnosis Description,CCS Procedure Code,CCS Procedure Description,APR DRG Code,APR DRG Description,APR MDC Code,APR MDC Description,APR Severity of Illness Code,APR Severity of Illness Description,APR Risk of Mortality,APR Medical Surgical Description,Payment Typology 1,Payment Typology 2,Payment Typology 3,Birth Weight,Abortion Edit Indicator,Emergency Department Indicator,Total Charges,Total Costs
Long Island,Suffolk,5151001,000245,Stony Brook University Hospital,50 to 69,117,M,Other Race,Not Span/Hispanic,8,Emergency,Home or Self Care,2019,GEN002,ACUTE AND UNSPECIFIED RENAL FAILURE,CAR015,PERIPHERAL ARTERIOVENOUS FISTULA AND SHUNT PROCEDURES,444,RENAL DIALYSIS ACCESS DEVICE AND VESSEL REPAIR,11,DISEASES AND DISORDERS OF THE KIDNEY AND URINARY TRACT,3,Major,Moderate,Surgical,Medicaid,Medicaid,,,,true,108625.71,38230.78
Long Island,Nassau,2908000,000511,NYU Langone Hospital-Long Island,70 or Older,115,M,Other Race,Not Span/Hispanic,10,Urgent,Home w/ Home Health Services,2019,GEN002,ACUTE AND UNSPECIFIED RENAL FAILURE,CAR015,PERIPHERAL ARTERIOVENOUS FISTULA AND SHUNT PROCEDURES,444,RENAL DIALYSIS ACCESS DEVICE AND VESSEL REPAIR,11,DISEASES AND DISORDERS OF THE KIDNEY AND URINARY TRACT,3,Major,Moderate,Surgical,Medicare,Medicare,Medicaid,,,true,172501.63,30886.61
Long Island,Suffolk,5154001,000925,Good Samaritan Hospital Medical Center,70 or Older,117,F,Other Race,Spanish/Hispanic,6,Emergency,Home w/ Home Health Services,2019,INJ033,"COMPLICATION OF CARDIOVASCULAR DEVICE, IMPLANT OR GRAFT, INITIAL ENCOUNTER",CAR015,PERIPHERAL ARTERIOVENOUS FISTULA AND SHUNT PROCEDURES,444,RENAL DIALYSIS ACCESS DEVICE AND VESSEL REPAIR,11,DISEASES AND DISORDERS OF THE KIDNEY AND URINARY TRACT,2,Moderate,Moderate,Surgical,Medicare,Medicaid,,,,true,108274.84,21305.11
Long Island,Nassau,2951001,000541,North Shore University Hospital,70 or Older,110,M,White,Not Span/Hispanic,48,Emergency,Skilled Nursing Home,2019,GEN003,CHRONIC KIDNEY DISEASE,CAR015,PERIPHERAL ARTERIOVENOUS FISTULA AND SHUNT PROCEDURES,444,RENAL DIALYSIS ACCESS DEVICE AND VESSEL REPAIR,11,DISEASES AND DISORDERS OF THE KIDNEY AND URINARY TRACT,4,Extreme,Extreme,Surgical,Private Health Insurance,Medicare,,,,true,644785.8,141959.33
Long Island,Nassau,2953000,000563,St. Francis Hospital & Heart Center,30 to 49,113,M,Other Race,Not Span/Hispanic,1,Emergency,Home or Self Care,2019,GEN003,CHRONIC KIDNEY DISEASE,CAR015,PERIPHERAL ARTERIOVENOUS FISTULA AND SHUNT PROCEDURES,444,RENAL DIALYSIS ACCESS DEVICE AND VESSEL REPAIR,11,DISEASES AND DISORDERS OF THE KIDNEY AND URINARY TRACT,3,Major,Minor,Surgical,Private Health Insurance,,,,,true,43221.68,7191.57
Capital/Adirond,Schenectady,4601001,000829,Ellis Hospital,70 or Older,123,F,Black/African American,Not Span/Hispanic,12,Emergency,Skilled Nursing Home,2019,GEN002,ACUTE AND UNSPECIFIED RENAL FAILURE,CAR008,ANGIOPLASTY AND RELATED VESSEL PROCEDURES (ENDOVASCULAR; EXCLUDING CAROTID),444,RENAL DIALYSIS ACCESS DEVICE AND VESSEL REPAIR,11,DISEASES AND DISORDERS OF THE KIDNEY AND URINARY TRACT,3,Major,Major,Surgical,Medicare,Medicare,Federal/State/Local/VA,,,true,65263.9,21093.64
New York City,Kings,7002053,001304,NYU Langone Hospital-Brooklyn,50 to 69,112,M,White,Not Span/Hispanic,6,Emergency,Home w/ Home Health Services,2019,GEN003,CHRONIC KIDNEY DISEASE,CAR015,PERIPHERAL ARTERIOVENOUS FISTULA AND SHUNT PROCEDURES,444,RENAL DIALYSIS ACCESS DEVICE AND VESSEL REPAIR,11,DISEASES AND DISORDERS OF THE KIDNEY AND URINARY TRACT,2,Moderate,Minor,Surgical,Medicare,Medicare,,,,true,133316.22,33622.26
New York City,Kings,7001021,001306,New York - Presbyterian Brooklyn Methodist Hospital,50 to 69,112,F,Black/African American,Not Span/Hispanic,1,Emergency,Home or Self Care,2019,INJ033,"COMPLICATION OF CARDIOVASCULAR DEVICE, IMPLANT OR GRAFT, INITIAL ENCOUNTER",CAR012,VESSEL REPAIR AND REPLACEMENT,444,RENAL DIALYSIS ACCESS DEVICE AND VESSEL REPAIR,11,DISEASES AND DISORDERS OF THE KIDNEY AND URINARY TRACT,2,Moderate,Moderate,Surgical,Private Health Insurance,Self-Pay,,,,true,28619.33,14439.33
New York City,Kings,7001021,001306,New York - Presbyterian Brooklyn Methodist Hospital,30 to 49,112,M,Black/African American,Not Span/Hispanic,7,Emergency,Home or Self Care,2019,GEN003,CHRONIC KIDNEY DISEASE,CAR015,PERIPHERAL ARTERIOVENOUS FISTULA AND SHUNT PROCEDURES,444,RENAL DIALYSIS ACCESS DEVICE AND VESSEL REPAIR,11,DISEASES AND DISORDERS OF THE KIDNEY AND URINARY TRACT,3,Major,Major,Surgical,Medicaid,Self-Pay,,,,true,95156.78,33955.1
Long Island,Nassau,2951001,000541,North Shore University Hospital,70 or Older,113,M,White,Not Span/Hispanic,7,Emergency,Home or Self Care,2019,GEN003,CHRONIC KIDNEY DISEASE,CAR015,PERIPHERAL ARTERIOVENOUS FISTULA AND SHUNT PROCEDURES,444,RENAL DIALYSIS ACCESS DEVICE AND VESSEL REPAIR,11,DISEASES AND DISORDERS OF THE KIDNEY AND URINARY TRACT,2,Moderate,Moderate,Surgical,Medicare,Private Health Insurance,,,,true,109200.36,26553.53
New York City,Kings,7001021,001306,New York - Presbyterian Brooklyn Methodist Hospital,50 to 69,112,F,Black/African American,Not Span/Hispanic,18,Emergency,Home or Self Care,2019,GEN002,ACUTE AND UNSPECIFIED RENAL FAILURE,CAR015,PERIPHERAL ARTERIOVENOUS FISTULA AND SHUNT PROCEDURES,444,RENAL DIALYSIS ACCESS DEVICE AND VESSEL REPAIR,11,DISEASES AND DISORDERS OF THE KIDNEY AND URINARY TRACT,3,Major,Major,Surgical,"Managed Care, Unspecified",Medicaid,Self-Pay,,,true,182075.65,60188.83
New York City,Kings,7001021,001306,New York - Presbyterian Brooklyn Methodist Hospital,50 to 69,112,F,Black/African American,Not Span/Hispanic,18,Emergency,Home w/ Home Health Services,2019,END003,DIABETES MELLITUS WITH COMPLICATION,CAR015,PERIPHERAL ARTERIOVENOUS FISTULA AND SHUNT PROCEDURES,444,RENAL DIALYSIS ACCESS DEVICE AND VESSEL REPAIR,11,DISEASES AND DISORDERS OF THE KIDNEY AND URINARY TRACT,3,Major,Major,Surgical,"Managed Care, Unspecified",Medicaid,Self-Pay,,,true,160399.62,51389.83
New York City,Kings,7001021,001306,New York - Presbyterian Brooklyn Methodist Hospital,50 to 69,112,F,Black/African American,Spanish/Hispanic,9,Emergency,Home w/ Home Health Services,2019,GEN002,ACUTE AND UNSPECIFIED RENAL FAILURE,CAR015,PERIPHERAL ARTERIOVENOUS FISTULA AND SHUNT PROCEDURES,444,RENAL DIALYSIS ACCESS DEVICE AND VESSEL REPAIR,11,DISEASES AND DISORDERS OF THE KIDNEY AND URINARY TRACT,3,Major,Major,Surgical,Medicare,Medicare,Self-Pay,,,true,90027.45,27622.24
New York City,Kings,7001021,001306,New York - Presbyterian Brooklyn Methodist Hospital,50 to 69,112,M,Black/African American,Spanish/Hispanic,3,Emergency,Home or Self Care,2019,GEN003,CHRONIC KIDNEY DISEASE,CAR015,PERIPHERAL ARTERIOVENOUS FISTULA AND SHUNT PROCEDURES,444,RENAL DIALYSIS ACCESS DEVICE AND VESSEL REPAIR,11,DISEASES AND DISORDERS OF THE KIDNEY AND URINARY TRACT,3,Major,Moderate,Surgical,Blue Cross/Blue Shield,Self-Pay,,,,true,44007.35,15819.32
New York City,Manhattan,7002024,001456,Mount Sinai Hospital,50 to 69,112,F,Other Race,Spanish/Hispanic,9,Emergency,Home w/ Home Health Services,2019,GEN002,ACUTE AND UNSPECIFIED RENAL FAILURE,CAR015,PERIPHERAL ARTERIOVENOUS FISTULA AND SHUNT PROCEDURES,444,RENAL DIALYSIS ACCESS DEVICE AND VESSEL REPAIR,11,DISEASES AND DISORDERS OF THE KIDNEY AND URINARY TRACT,3,Major,Major,Surgical,Medicaid,Medicaid,Self-Pay,,,true,122121.73,38720.26
Long Island,Nassau,2908000,000511,NYU Langone Hospital-Long Island,50 to 69,114,M,Black/African American,Not Span/Hispanic,11,Emergency,Home or Self Care,2019,INJ036,"COMPLICATION OF TRANSPLANTED ORGANS OR TISSUE, INITIAL ENCOUNTER",CAR008,ANGIOPLASTY AND RELATED VESSEL PROCEDURES (ENDOVASCULAR; EXCLUDING CAROTID),444,RENAL DIALYSIS ACCESS DEVICE AND VESSEL REPAIR,11,DISEASES AND DISORDERS OF THE KIDNEY AND URINARY TRACT,3,Major,Extreme,Surgical,Federal/State/Local/VA,,,,,true,255913.18,42961.41
Hudson Valley,Westchester,5907001,001097,SJRH - St Johns Division,70 or Older,105,F,Black/African American,Not Span/Hispanic,12,Emergency,Skilled Nursing Home,2019,GEN003,CHRONIC KIDNEY DISEASE,CAR008,ANGIOPLASTY AND RELATED VESSEL PROCEDURES (ENDOVASCULAR; EXCLUDING CAROTID),444,RENAL DIALYSIS ACCESS DEVICE AND VESSEL REPAIR,11,DISEASES AND DISORDERS OF THE KIDNEY AND URINARY TRACT,3,Major,Major,Surgical,Medicare,Medicaid,,,,true,78144.54,41124.12
Finger Lakes,Monroe,2701005,000413,Strong Memorial Hospital,70 or Older,146,F,Black/African American,Not Span/Hispanic,11,Emergency,Home w/ Home Health Services,2019,GEN003,CHRONIC KIDNEY DISEASE,CAR015,PERIPHERAL ARTERIOVENOUS FISTULA AND SHUNT PROCEDURES,444,RENAL DIALYSIS ACCESS DEVICE AND VESSEL REPAIR,11,DISEASES AND DISORDERS OF THE KIDNEY AND URINARY TRACT,4,Extreme,Extreme,Surgical,Medicare,,,,,true,76225.37,28559.81
New York City,Kings,7001021,001306,New York - Presbyterian Brooklyn Methodist Hospital,70 or Older,112,F,White,Not Span/Hispanic,11,Emergency,Home w/ Home Health Services,2019,GEN004,URINARY TRACT INFECTIONS,CAR015,PERIPHERAL ARTERIOVENOUS FISTULA AND SHUNT PROCEDURES,444,RENAL DIALYSIS ACCESS DEVICE AND VESSEL REPAIR,11,DISEASES AND DISORDERS OF THE KIDNEY AND URINARY TRACT,4,Extreme,Major,Surgical,Medicare,Self-Pay,,,,true,102544.93,29398.17
Capital/Adirond,Schenectady,4601001,000829,Ellis Hospital,70 or Older,123,M,White,Not Span/Hispanic,17,Emergency,Home or Self Care,2019,GEN003,CHRONIC KIDNEY DISEASE,CAR015,PERIPHERAL ARTERIOVENOUS FISTULA AND SHUNT PROCEDURES,444,RENAL DIALYSIS ACCESS DEVICE AND VESSEL REPAIR,11,DISEASES AND DISORDERS OF THE KIDNEY AND URINARY TRACT,4,Extreme,Extreme,Surgical,Medicare,Medicare,Federal/State/Local/VA,,,false,117932.84,37585.74
New York City,Queens,7003010,001637,New York - Presbyterian/Queens,50 to 69,113,F,Other Race,Not Span/Hispanic,9,Emergency,Home w/ Home Health Services,2019,GEN003,CHRONIC KIDNEY DISEASE,CAR015,PERIPHERAL ARTERIOVENOUS FISTULA AND SHUNT PROCEDURES,444,RENAL DIALYSIS ACCESS DEVICE AND VESSEL REPAIR,11,DISEASES AND DISORDERS OF THE KIDNEY AND URINARY TRACT,3,Major,Moderate,Surgical,Private Health Insurance,Medicaid,Self-Pay,,,true,98679.58,29728.55
New York City,Kings,7002053,001304,NYU Langone Hospital-Brooklyn,70 or Older,112,F,Other Race,Spanish/Hispanic,8,Emergency,Home or Self Care,2019,GEN003,CHRONIC KIDNEY DISEASE,CAR015,PERIPHERAL ARTERIOVENOUS FISTULA AND SHUNT PROCEDURES,444,RENAL DIALYSIS ACCESS DEVICE AND VESSEL REPAIR,11,DISEASES AND DISORDERS OF THE KIDNEY AND URINARY TRACT,3,Major,Major,Surgical,Medicare,Private Health Insurance,,,,true,215578.04,48744.61
New York City,Kings,7001021,001306,New York - Presbyterian Brooklyn Methodist Hospital,70 or Older,112,M,Other Race,Spanish/Hispanic,5,Emergency,Home or Self Care,2019,GEN002,ACUTE AND UNSPECIFIED RENAL FAILURE,CAR015,PERIPHERAL ARTERIOVENOUS FISTULA AND SHUNT PROCEDURES,444,RENAL DIALYSIS ACCESS DEVICE AND VESSEL REPAIR,11,DISEASES AND DISORDERS OF THE KIDNEY AND URINARY TRACT,3,Major,Major,Surgical,Medicare,Medicare,Medicaid,,,true,49300.38,16628.21
New York City,Kings,7001021,001306,New York - Presbyterian Brooklyn Methodist Hospital,50 to 69,112,F,Other Race,Not Span/Hispanic,7,Emergency,Home w/ Home Health Services,2019,END003,DIABETES MELLITUS WITH COMPLICATION,CAR015,PERIPHERAL ARTERIOVENOUS FISTULA AND SHUNT PROCEDURES,444,RENAL DIALYSIS ACCESS DEVICE AND VESSEL REPAIR,11,DISEASES AND DISORDERS OF THE KIDNEY AND URINARY TRACT,3,Major,Major,Surgical,"Managed Care, Unspecified",Medicaid,Self-Pay,,,true,81283.58,30081.24
New York City,Kings,7001021,001306,New York - Presbyterian Brooklyn Methodist Hospital,70 or Older,112,F,White,Not Span/Hispanic,10,Emergency,Home w/ Home Health Services,2019,GEN003,CHRONIC KIDNEY DISEASE,CAR015,PERIPHERAL ARTERIOVENOUS FISTULA AND SHUNT PROCEDURES,444,RENAL DIALYSIS ACCESS DEVICE AND VESSEL REPAIR,11,DISEASES AND DISORDERS OF THE KIDNEY AND URINARY TRACT,3,Major,Major,Surgical,Medicare,Private Health Insurance,Medicaid,,,false,98703.81,36827.89
New York City,Manhattan,7002002,001439,Mount Sinai Beth Israel,30 to 49,104,M,Other Race,Unknown,22,Emergency,Home or Self Care,2019,END003,DIABETES MELLITUS WITH COMPLICATION,CAR025,PLACEMENT OF TUNNELED OR IMPLANTABLE PORTION OF A VASCULAR ACCESS DEVICE,444,RENAL DIALYSIS ACCESS DEVICE AND VESSEL REPAIR,11,DISEASES AND DISORDERS OF THE KIDNEY AND URINARY TRACT,4,Extreme,Major,Surgical,Medicaid,Self-Pay,,,,true,266278.72,66486.89
New York City,Manhattan,7002002,001439,Mount Sinai Beth Israel,50 to 69,100,M,White,Not Span/Hispanic,14,Emergency,Skilled Nursing Home,2019,END003,DIABETES MELLITUS WITH COMPLICATION,CAR015,PERIPHERAL ARTERIOVENOUS FISTULA AND SHUNT PROCEDURES,444,RENAL DIALYSIS ACCESS DEVICE AND VESSEL REPAIR,11,DISEASES AND DISORDERS OF THE KIDNEY AND URINARY TRACT,3,Major,Major,Surgical,Blue Cross/Blue Shield,Self-Pay,,,,true,175910.08,44179.67
New York City,Queens,7003010,001637,New York - Presbyterian/Queens,50 to 69,113,F,Other Race,Not Span/Hispanic,9,Emergency,Home w/ Home Health Services,2019,GEN003,CHRONIC KIDNEY DISEASE,CAR015,PERIPHERAL ARTERIOVENOUS FISTULA AND SHUNT PROCEDURES,444,RENAL DIALYSIS ACCESS DEVICE AND VESSEL REPAIR,11,DISEASES AND DISORDERS OF THE KIDNEY AND URINARY TRACT,3,Major,Major,Surgical,Medicare,Medicare,Self-Pay,,,true,90807.79,26229.2
Central NY,Oneida,3202003,000599,Faxton-St Lukes Healthcare St Lukes Division,70 or Older,135,M,White,Not Span/Hispanic,18,Urgent,Home or Self Care,2019,GEN002,ACUTE AND UNSPECIFIED RENAL FAILURE,CAR015,PERIPHERAL ARTERIOVENOUS FISTULA AND SHUNT PROCEDURES,444,RENAL DIALYSIS ACCESS DEVICE AND VESSEL REPAIR,11,DISEASES AND DISORDERS OF THE KIDNEY AND URINARY TRACT,3,Major,Major,Surgical,Medicare,,,,,false,113985.78,31886.16
New York City,Bronx,7000002,001165,Jacobi Medical Center,50 to 69,104,F,Other Race,Spanish/Hispanic,14,Emergency,Home or Self Care,2019,INJ033,"COMPLICATION OF CARDIOVASCULAR DEVICE, IMPLANT OR GRAFT, INITIAL ENCOUNTER",CAR015,PERIPHERAL ARTERIOVENOUS FISTULA AND SHUNT PROCEDURES,444,RENAL DIALYSIS ACCESS DEVICE AND VESSEL REPAIR,11,DISEASES AND DISORDERS OF THE KIDNEY AND URINARY TRACT,2,Moderate,Major,Surgical,Medicare,Medicare,Medicaid,,,true,78358.75,46360.95
New York City,Manhattan,7002054,003975,New York Presbyterian Hospital - Allen Hospital,30 to 49,104,F,Multi-racial,Multi-ethnic,6,Emergency,Left Against Medical Advice,2019,INJ033,"COMPLICATION OF CARDIOVASCULAR DEVICE, IMPLANT OR GRAFT, INITIAL ENCOUNTER",CAR015,PERIPHERAL ARTERIOVENOUS FISTULA AND SHUNT PROCEDURES,444,RENAL DIALYSIS ACCESS DEVICE AND VESSEL REPAIR,11,DISEASES AND DISORDERS OF THE KIDNEY AND URINARY TRACT,3,Major,Major,Surgical,Medicaid,Medicaid,Self-Pay,,,true,108735.54,33852.12
New York City,Manhattan,7002024,001456,Mount Sinai Hospital,70 or Older,111,F,Black/African American,Not Span/Hispanic,64,Urgent,Skilled Nursing Home,2019,GEN002,ACUTE AND UNSPECIFIED RENAL FAILURE,CAR015,PERIPHERAL ARTERIOVENOUS FISTULA AND SHUNT PROCEDURES,444,RENAL DIALYSIS ACCESS DEVICE AND VESSEL REPAIR,11,DISEASES AND DISORDERS OF THE KIDNEY AND URINARY TRACT,4,Extreme,Extreme,Surgical,Medicare,Medicare,Medicaid,,,false,922762.14,268290.53
Hudson Valley,Westchester,5922000,001122,New York - Presbyterian Hospital,70 or Older,107,M,Black/African American,Not Span/Hispanic,12,Emergency,Home w/ Home Health Services,2019,GEN002,ACUTE AND UNSPECIFIED RENAL FAILURE,CAR015,PERIPHERAL ARTERIOVENOUS FISTULA AND SHUNT PROCEDURES,444,RENAL DIALYSIS ACCESS DEVICE AND VESSEL REPAIR,11,DISEASES AND DISORDERS OF THE KIDNEY AND URINARY TRACT,3,Major,Major,Surgical,Medicare,,,,,true,169782.92,69383.82
New York City,Bronx,7000006,003058,Montefiore Med Center - Jack D Weiler Hosp of A Einstein College Div,50 to 69,104,F,Black/African American,Not Span/Hispanic,6,Emergency,Home w/ Home Health Services,2019,GEN003,CHRONIC KIDNEY DISEASE,CAR015,PERIPHERAL ARTERIOVENOUS FISTULA AND SHUNT PROCEDURES,444,RENAL DIALYSIS ACCESS DEVICE AND VESSEL REPAIR,11,DISEASES AND DISORDERS OF THE KIDNEY AND URINARY TRACT,3,Major,Moderate,Surgical,Private Health Insurance,,,,,false,101604.03,21451.77
Finger Lakes,Monroe,2701005,000413,Strong Memorial Hospital,50 to 69,144,M,White,Not Span/Hispanic,10,Urgent,Home or Self Care,2019,INJ036,"COMPLICATION OF TRANSPLANTED ORGANS OR TISSUE, INITIAL ENCOUNTER",CAR025,PLACEMENT OF TUNNELED OR IMPLANTABLE PORTION OF A VASCULAR ACCESS DEVICE,444,RENAL DIALYSIS ACCESS DEVICE AND VESSEL REPAIR,11,DISEASES AND DISORDERS OF THE KIDNEY AND URINARY TRACT,3,Major,Moderate,Surgical,Medicare,Private Health Insurance,,,,false,63146.18,22691.4
New York City,Queens,7003010,001637,New York - Presbyterian/Queens,50 to 69,113,M,Other Race,Spanish/Hispanic,6,Emergency,Home or Self Care,2019,GEN002,ACUTE AND UNSPECIFIED RENAL FAILURE,CAR015,PERIPHERAL ARTERIOVENOUS FISTULA AND SHUNT PROCEDURES,444,RENAL DIALYSIS ACCESS DEVICE AND VESSEL REPAIR,11,DISEASES AND DISORDERS OF THE KIDNEY AND URINARY TRACT,3,Major,Major,Surgical,Blue Cross/Blue Shield,Self-Pay,,,,true,75369.48,21561.03
Western NY,Erie,1401014,000207,Buffalo General Medical Center,30 to 49,143,M,Black/African American,Not Span/Hispanic,2,Elective,Home or Self Care,2019,INJ033,"COMPLICATION OF CARDIOVASCULAR DEVICE, IMPLANT OR GRAFT, INITIAL ENCOUNTER",CAR015,PERIPHERAL ARTERIOVENOUS FISTULA AND SHUNT PROCEDURES,444,RENAL DIALYSIS ACCESS DEVICE AND VESSEL REPAIR,11,DISEASES AND DISORDERS OF THE KIDNEY AND URINARY TRACT,3,Major,Extreme,Surgical,Medicare,Medicaid,Self-Pay,,,false,38237.12,12504.97
New York City,Queens,7003010,001637,New York - Presbyterian/Queens,50 to 69,113,M,Other Race,Not Span/Hispanic,10,Emergency,Home or Self Care,2019,END003,DIABETES MELLITUS WITH COMPLICATION,CAR015,PERIPHERAL ARTERIOVENOUS FISTULA AND SHUNT PROCEDURES,444,RENAL DIALYSIS ACCESS DEVICE AND VESSEL REPAIR,11,DISEASES AND DISORDERS OF THE KIDNEY AND URINARY TRACT,4,Extreme,Major,Surgical,"Managed Care, Unspecified",Medicaid,Self-Pay,,,true,111905.36,30119.07
New York City,Kings,7001020,001305,Maimonides Medical Center,70 or Older,112,M,White,Not Span/Hispanic,7,Emergency,Home or Self Care,2019,GEN003,CHRONIC KIDNEY DISEASE,CAR015,PERIPHERAL ARTERIOVENOUS FISTULA AND SHUNT PROCEDURES,444,RENAL DIALYSIS ACCESS DEVICE AND VESSEL REPAIR,11,DISEASES AND DISORDERS OF THE KIDNEY AND URINARY TRACT,1,Minor,Moderate,Surgical,Medicare,Blue Cross/Blue Shield,Self-Pay,,,true,82923.07,26410.97
Finger Lakes,Monroe,2701005,000413,Strong Memorial Hospital,18 to 29,146,M,Black/African American,Not Span/Hispanic,21,Emergency,Home or Self Care,2019,GEN003,CHRONIC KIDNEY DISEASE,CAR015,PERIPHERAL ARTERIOVENOUS FISTULA AND SHUNT PROCEDURES,444,RENAL DIALYSIS ACCESS DEVICE AND VESSEL REPAIR,11,DISEASES AND DISORDERS OF THE KIDNEY AND URINARY TRACT,2,Moderate,Minor,Surgical,Medicaid,,,,,true,94130.76,35877.14
New York City,Manhattan,7002054,001458,New York-Presbyterian Hospital - New York Weill Cornell Center,50 to 69,100,M,Other Race,Not Span/Hispanic,18,Emergency,Home w/ Home Health Services,2019,GEN002,ACUTE AND UNSPECIFIED RENAL FAILURE,CAR015,PERIPHERAL ARTERIOVENOUS FISTULA AND SHUNT PROCEDURES,444,RENAL DIALYSIS ACCESS DEVICE AND VESSEL REPAIR,11,DISEASES AND DISORDERS OF THE KIDNEY AND URINARY TRACT,4,Extreme,Major,Surgical,"Managed Care, Unspecified",Medicaid,Self-Pay,,,true,286665.89,70756.35
New York City,Kings,7001035,001318,Wyckoff Heights Medical Center,50 to 69,112,F,Other Race,Not Span/Hispanic,4,Emergency,Home or Self Care,2019,GEN003,CHRONIC KIDNEY DISEASE,CAR015,PERIPHERAL ARTERIOVENOUS FISTULA AND SHUNT PROCEDURES,444,RENAL DIALYSIS ACCESS DEVICE AND VESSEL REPAIR,11,DISEASES AND DISORDERS OF THE KIDNEY AND URINARY TRACT,1,Minor,Minor,Surgical,Medicare,Miscellaneous/Other,Medicaid,,,true,42834.69,19815.98
Long Island,Suffolk,5154000,000924,South Shore University Hospital,30 to 49,117,M,Other Race,Spanish/Hispanic,19,Emergency,Short-term Hospital,2019,MAL003,GENITOURINARY CONGENITAL ANOMALIES,CAR015,PERIPHERAL ARTERIOVENOUS FISTULA AND SHUNT PROCEDURES,444,RENAL DIALYSIS ACCESS DEVICE AND VESSEL REPAIR,11,DISEASES AND DISORDERS OF THE KIDNEY AND URINARY TRACT,3,Major,Major,Surgical,Medicaid,,,,,true,219668.01,49813.84
Capital/Adirond,Albany,0101000,000001,Albany Medical Center Hospital,30 to 49,129,M,Black/African American,Not Span/Hispanic,20,Emergency,Court/Law Enforcement,2019,GEN004,URINARY TRACT INFECTIONS,CAR015,PERIPHERAL ARTERIOVENOUS FISTULA AND SHUNT PROCEDURES,444,RENAL DIALYSIS ACCESS DEVICE AND VESSEL REPAIR,11,DISEASES AND DISORDERS OF THE KIDNEY AND URINARY TRACT,3,Major,Moderate,Surgical,Department of Corrections,,,,,true,131862.97,42258.7
Long Island,Suffolk,5154000,000924,South Shore University Hospital,70 or Older,117,F,White,Not Span/Hispanic,21,Emergency,Skilled Nursing Home,2019,GEN002,ACUTE AND UNSPECIFIED RENAL FAILURE,CAR015,PERIPHERAL ARTERIOVENOUS FISTULA AND SHUNT PROCEDURES,444,RENAL DIALYSIS ACCESS DEVICE AND VESSEL REPAIR,11,DISEASES AND DISORDERS OF THE KIDNEY AND URINARY TRACT,4,Extreme,Extreme,Surgical,Medicare,Medicare,,,,true,235653.85,54705.06
Long Island,Nassau,2951001,000541,North Shore University Hospital,30 to 49,114,M,Black/African American,Not Span/Hispanic,18,Emergency,Home or Self Care,2019,INJ033,"COMPLICATION OF CARDIOVASCULAR DEVICE, IMPLANT OR GRAFT, INITIAL ENCOUNTER",CAR015,PERIPHERAL ARTERIOVENOUS FISTULA AND SHUNT PROCEDURES,444,RENAL DIALYSIS ACCESS DEVICE AND VESSEL REPAIR,11,DISEASES AND DISORDERS OF THE KIDNEY AND URINARY TRACT,2,Moderate,Moderate,Surgical,Medicaid,,,,,true,241017.19,51921.71
Long Island,Suffolk,5154000,000924,South Shore University Hospital,70 or Older,117,M,Other Race,Not Span/Hispanic,4,Emergency,Home or Self Care,2019,INJ033,"COMPLICATION OF CARDIOVASCULAR DEVICE, IMPLANT OR GRAFT, INITIAL ENCOUNTER",CAR015,PERIPHERAL ARTERIOVENOUS FISTULA AND SHUNT PROCEDURES,444,RENAL DIALYSIS ACCESS DEVICE AND VESSEL REPAIR,11,DISEASES AND DISORDERS OF THE KIDNEY AND URINARY TRACT,2,Moderate,Moderate,Surgical,Medicare,Private Health Insurance,,,,true,78455.77,19524.67
New York City,Kings,7001021,001306,New York - Presbyterian Brooklyn Methodist Hospital,30 to 49,116,M,Black/African American,Not Span/Hispanic,21,Emergency,Inpatient Rehabilitation Facility,2019,END003,DIABETES MELLITUS WITH COMPLICATION,CAR015,PERIPHERAL ARTERIOVENOUS FISTULA AND SHUNT PROCEDURES,444,RENAL DIALYSIS ACCESS DEVICE AND VESSEL REPAIR,11,DISEASES AND DISORDERS OF THE KIDNEY AND URINARY TRACT,3,Major,Major,Surgical,Medicaid,Self-Pay,,,,true,181162.27,56478.82
New York City,Queens,7003010,001637,New York - Presbyterian/Queens,50 to 69,113,M,White,Spanish/Hispanic,17,Emergency,Home or Self Care,2019,GEN002,ACUTE AND UNSPECIFIED RENAL FAILURE,CAR015,PERIPHERAL ARTERIOVENOUS FISTULA AND SHUNT PROCEDURES,444,RENAL DIALYSIS ACCESS DEVICE AND VESSEL REPAIR,11,DISEASES AND DISORDERS OF THE KIDNEY AND URINARY TRACT,3,Major,Major,Surgical,Medicare,Medicare,Medicaid,,,true,200781.56,61741.07
New York City,Kings,7001021,001306,New York - Presbyterian Brooklyn Methodist Hospital,30 to 49,112,M,White,Not Span/Hispanic,5,Emergency,Home or Self Care,2019,GEN002,ACUTE AND UNSPECIFIED RENAL FAILURE,CAR015,PERIPHERAL ARTERIOVENOUS FISTULA AND SHUNT PROCEDURES,444,RENAL DIALYSIS ACCESS DEVICE AND VESSEL REPAIR,11,DISEASES AND DISORDERS OF THE KIDNEY AND URINARY TRACT,3,Major,Moderate,Surgical,Private Health Insurance,Self-Pay,,,,true,64709.75,27323.26
Hudson Valley,Westchester,5904001,001072,Montefiore New Rochelle Hospital,50 to 69,107,F,Black/African American,Multi-ethnic,18,Emergency,Skilled Nursing Home,2019,GEN002,ACUTE AND UNSPECIFIED RENAL FAILURE,CAR015,PERIPHERAL ARTERIOVENOUS FISTULA AND SHUNT PROCEDURES,444,RENAL DIALYSIS ACCESS DEVICE AND VESSEL REPAIR,11,DISEASES AND DISORDERS OF THE KIDNEY AND URINARY TRACT,3,Major,Major,Surgical,Medicare,Medicare,Medicaid,,,true,144587.45,57905.25