Hospital Service Area,Hospital County,Operating Certificate Number,Permanent Facility Id,Facility Name,Age Group,Zip Code - 3 digits,Gender,Race,Ethnicity,Length of Stay,Type of Admission,Patient Disposition,Discharge Year,CCS Diagnosis Code,CCS Diagnosis Description,CCS Procedure Code,CCS Procedure Description,APR DRG Code,APR DRG Description,APR MDC Code,APR MDC Description,APR Severity of Illness Code,APR Severity of Illness Description,APR Risk of Mortality,APR Medical Surgical Description,Payment Typology 1,Payment Typology 2,Payment Typology 3,Birth Weight,Abortion Edit Indicator,Emergency Department Indicator,Total Charges,Total Costs
Long Island,Nassau,2908000,000511,NYU Winthrop Hospital,70 or Older,115,M,White,Not Span/Hispanic,1,Elective,Home w/ Home Health Services,2017,237,Complication of device; implant or graft,099,OT OR GI THER PRCS,447,"Other kidney, urinary tract & related procedures",11,Diseases and Disorders of the Kidney and Urinary Tract,2,Moderate,Moderate,Surgical,Medicare,Medicare,Blue Cross/Blue Shield,,N,N,34989.10,9873.78
Long Island,Nassau,2908000,000511,NYU Winthrop Hospital,70 or Older,115,M,White,Not Span/Hispanic,22,Urgent,Skilled Nursing Home,2017,161,Other diseases of kidney and ureters,061,OT OR PRCS VES NOT HEAD,447,"Other kidney, urinary tract & related procedures",11,Diseases and Disorders of the Kidney and Urinary Tract,3,Major,Major,Surgical,Medicare,Medicare,Private Health Insurance,,N,Y,381666.15,93291.99
Long Island,Nassau,2908000,000511,NYU Winthrop Hospital,50 to 69,115,F,Black/African American,Not Span/Hispanic,9,Emergency,Home w/ Home Health Services,2017,157,Acute and unspecified renal failure,061,OT OR PRCS VES NOT HEAD,447,"Other kidney, urinary tract & related procedures",11,Diseases and Disorders of the Kidney and Urinary Tract,3,Major,Major,Surgical,Medicare,Medicare,Medicaid,,N,Y,119707.37,29264.80
Long Island,Nassau,2908000,000511,NYU Winthrop Hospital,50 to 69,115,M,White,Not Span/Hispanic,6,Emergency,Home or Self Care,2017,161,Other diseases of kidney and ureters,061,OT OR PRCS VES NOT HEAD,447,"Other kidney, urinary tract & related procedures",11,Diseases and Disorders of the Kidney and Urinary Tract,2,Moderate,Minor,Surgical,Self-Pay,,,,N,Y,68423.23,16458.16
Long Island,Nassau,2908000,000511,NYU Winthrop Hospital,50 to 69,117,F,Black/African American,Not Span/Hispanic,9,Emergency,Home w/ Home Health Services,2017,157,Acute and unspecified renal failure,097,OTHER GI DX PRCS,447,"Other kidney, urinary tract & related procedures",11,Diseases and Disorders of the Kidney and Urinary Tract,3,Major,Major,Surgical,Private Health Insurance,,,,N,Y,175939.30,46735.16
Long Island,Nassau,2908000,000511,NYU Winthrop Hospital,70 or Older,115,M,Black/African American,Not Span/Hispanic,10,Emergency,Home or Self Care,2017,099,Hypertension with complications and secondary hypertension,055,PERIPH VASCULAR BYPASS,447,"Other kidney, urinary tract & related procedures",11,Diseases and Disorders of the Kidney and Urinary Tract,3,Major,Moderate,Surgical,Medicare,Medicare,,,N,Y,359117.55,77527.04
Long Island,Nassau,2908000,000511,NYU Winthrop Hospital,30 to 49,115,M,Black/African American,Spanish/Hispanic,6,Emergency,Home or Self Care,2017,115,Aortic; peripheral; and visceral artery aneurysms,061,OT OR PRCS VES NOT HEAD,447,"Other kidney, urinary tract & related procedures",11,Diseases and Disorders of the Kidney and Urinary Tract,4,Extreme,Major,Surgical,Blue Cross/Blue Shield,,,,N,Y,248835.34,55188.85
Long Island,Nassau,2908000,000511,NYU Winthrop Hospital,50 to 69,115,M,White,Spanish/Hispanic,7,Emergency,Home or Self Care,2017,099,Hypertension with complications and secondary hypertension,099,OT OR GI THER PRCS,447,"Other kidney, urinary tract & related procedures",11,Diseases and Disorders of the Kidney and Urinary Tract,2,Moderate,Moderate,Surgical,Medicaid,Medicaid,,,N,Y,114268.75,30509.65
Long Island,Nassau,2908000,000511,NYU Winthrop Hospital,50 to 69,117,M,White,Not Span/Hispanic,3,Elective,Home w/ Home Health Services,2017,162,Other diseases of bladder and urethra,099,OT OR GI THER PRCS,447,"Other kidney, urinary tract & related procedures",11,Diseases and Disorders of the Kidney and Urinary Tract,2,Moderate,Minor,Surgical,Private Health Insurance,,,,N,N,161887.85,49534.54
Long Island,Nassau,2908000,000511,NYU Winthrop Hospital,50 to 69,115,M,Other Race,Not Span/Hispanic,10,Emergency,Home or Self Care,2017,157,Acute and unspecified renal failure,055,PERIPH VASCULAR BYPASS,447,"Other kidney, urinary tract & related procedures",11,Diseases and Disorders of the Kidney and Urinary Tract,3,Major,Moderate,Surgical,Medicaid,,,,N,Y,175405.28,40643.64
Long Island,Nassau,2908000,000511,NYU Winthrop Hospital,50 to 69,115,M,White,Not Span/Hispanic,7,Emergency,Home or Self Care,2017,158,Chronic kidney disease,061,OT OR PRCS VES NOT HEAD,447,"Other kidney, urinary tract & related procedures",11,Diseases and Disorders of the Kidney and Urinary Tract,2,Moderate,Moderate,Surgical,Federal/State/Local/VA,,,,N,Y,165081.04,44290.39
Long Island,Nassau,2908000,000511,NYU Winthrop Hospital,70 or Older,115,M,White,Not Span/Hispanic,10,Emergency,Home w/ Home Health Services,2017,099,Hypertension with complications and secondary hypertension,061,OT OR PRCS VES NOT HEAD,447,"Other kidney, urinary tract & related procedures",11,Diseases and Disorders of the Kidney and Urinary Tract,3,Major,Major,Surgical,Medicare,Medicaid,Medicare,,N,Y,261024.32,70323.42
Long Island,Nassau,2908000,000511,NYU Winthrop Hospital,50 to 69,100,M,Black/African American,Not Span/Hispanic,20,Emergency,Skilled Nursing Home,2017,099,Hypertension with complications and secondary hypertension,055,PERIPH VASCULAR BYPASS,447,"Other kidney, urinary tract & related procedures",11,Diseases and Disorders of the Kidney and Urinary Tract,3,Major,Moderate,Surgical,Medicaid,Medicare,,,N,Y,263491.44,63866.59
Long Island,Nassau,2908000,000511,NYU Winthrop Hospital,70 or Older,115,F,White,Not Span/Hispanic,11,Emergency,Home or Self Care,2017,099,Hypertension with complications and secondary hypertension,061,OT OR PRCS VES NOT HEAD,447,"Other kidney, urinary tract & related procedures",11,Diseases and Disorders of the Kidney and Urinary Tract,3,Major,Major,Surgical,Medicare,Medicare,Private Health Insurance,,N,Y,197886.33,47412.32
Long Island,Nassau,2908000,000511,NYU Winthrop Hospital,18 to 29,110,F,Black/African American,Not Span/Hispanic,1,Elective,Home or Self Care,2017,161,Other diseases of kidney and ureters,012,OT THER ENDOCRINE PRCS,447,"Other kidney, urinary tract & related procedures",11,Diseases and Disorders of the Kidney and Urinary Tract,2,Moderate,Minor,Surgical,Medicare,Medicaid,Medicare,,N,N,75958.86,21017.83
Long Island,Nassau,2908000,000511,NYU Winthrop Hospital,50 to 69,115,F,Other Race,Spanish/Hispanic,42,Emergency,Inpatient Rehabilitation Facility,2017,157,Acute and unspecified renal failure,054,OT VASC CATH; NOT HEART,447,"Other kidney, urinary tract & related procedures",11,Diseases and Disorders of the Kidney and Urinary Tract,4,Extreme,Extreme,Surgical,Medicaid,Medicaid,,,N,Y,913750.09,164608.04
Long Island,Nassau,2908000,000511,NYU Winthrop Hospital,30 to 49,117,M,White,Not Span/Hispanic,4,Emergency,Home or Self Care,2017,238,Complications of surgical procedures or medical care,061,OT OR PRCS VES NOT HEAD,447,"Other kidney, urinary tract & related procedures",11,Diseases and Disorders of the Kidney and Urinary Tract,2,Moderate,Moderate,Surgical,Private Health Insurance,,,,N,Y,131639.78,34848.24
Long Island,Nassau,2908000,000511,NYU Winthrop Hospital,70 or Older,110,M,White,Not Span/Hispanic,16,Emergency,Skilled Nursing Home,2017,157,Acute and unspecified renal failure,097,OTHER GI DX PRCS,447,"Other kidney, urinary tract & related procedures",11,Diseases and Disorders of the Kidney and Urinary Tract,3,Major,Major,Surgical,Medicare,Medicare,Blue Cross/Blue Shield,,N,Y,352716.64,86854.76
Long Island,Nassau,2908000,000511,NYU Winthrop Hospital,30 to 49,115,F,Black/African American,Not Span/Hispanic,44,Emergency,Medicare Cert Long Term Care Hospital,2017,157,Acute and unspecified renal failure,055,PERIPH VASCULAR BYPASS,447,"Other kidney, urinary tract & related procedures",11,Diseases and Disorders of the Kidney and Urinary Tract,4,Extreme,Major,Surgical,Medicaid,Medicaid,,,N,Y,745175.83,160977.77
