Hospital Service Area,Hospital County,Operating Certificate Number,Permanent Facility Id,Facility Name,Age Group,Zip Code - 3 digits,Gender,Race,Ethnicity,Length of Stay,Type of Admission,Patient Disposition,Discharge Year,CCS Diagnosis Code,CCS Diagnosis Description,CCS Procedure Code,CCS Procedure Description,APR DRG Code,APR DRG Description,APR MDC Code,APR MDC Description,APR Severity of Illness Code,APR Severity of Illness Description,APR Risk of Mortality,APR Medical Surgical Description,Payment Typology 1,Payment Typology 2,Payment Typology 3,Birth Weight,Abortion Edit Indicator,Emergency Department Indicator,Total Charges,Total Costs
New York City,Manhattan,7002001,001438,Bellevue Hospital Center,30 to 49,100,M,Other Race,Not Span/Hispanic,13,Emergency,Skilled Nursing Home,2019,INJ010,"INTERNAL ORGAN INJURY, INITIAL ENCOUNTER",CAR011,ANEURYSM REPAIR PROCEDURES,447,"OTHER KIDNEY, URINARY TRACT & RELATED PROCEDURES",11,DISEASES AND DISORDERS OF THE KIDNEY AND URINARY TRACT,3,Major,Moderate,Surgical,Medicaid,Medicaid,,,,false,95520.11,63482.67
Finger Lakes,Monroe,2701003,000411,Rochester General Hospital,50 to 69,146,F,White,Not Span/Hispanic,7,Elective,Home or Self Care,2019,GEN006,OTHER SPECIFIED AND UNSPECIFIED DISEASES OF KIDNEY AND URETERS,ENP003,PARATHYROIDECTOMY,447,"OTHER KIDNEY, URINARY TRACT & RELATED PROCEDURES",11,DISEASES AND DISORDERS OF THE KIDNEY AND URINARY TRACT,2,Moderate,Moderate,Surgical,Medicare,Medicaid,,,,false,34464.23,15722.9
New York City,Kings,7001021,001306,New York - Presbyterian Brooklyn Methodist Hospital,50 to 69,112,F,Other Race,Spanish/Hispanic,12,Emergency,Home w/ Home Health Services,2019,INJ033,"COMPLICATION OF CARDIOVASCULAR DEVICE, IMPLANT OR GRAFT, INITIAL ENCOUNTER",CAR029,"CARDIOVASCULAR DEVICE PROCEDURES, NEC",447,"OTHER KIDNEY, URINARY TRACT & RELATED PROCEDURES",11,DISEASES AND DISORDERS OF THE KIDNEY AND URINARY TRACT,4,Extreme,Extreme,Surgical,Medicare,Medicare,Medicaid,,,true,121684.11,40591.16
Finger Lakes,Monroe,2754001,000471,The Unity Hospital of Rochester,70 or Older,144,M,White,Not Span/Hispanic,6,Elective,Home w/ Home Health Services,2019,GEN004,URINARY TRACT INFECTIONS,HEP006,CHOLECYSTECTOMY,447,"OTHER KIDNEY, URINARY TRACT & RELATED PROCEDURES",11,DISEASES AND DISORDERS OF THE KIDNEY AND URINARY TRACT,3,Major,Major,Surgical,Medicare,,,,,false,34058.49,20926.47
New York City,Kings,7001021,001306,New York - Presbyterian Brooklyn Methodist Hospital,70 or Older,112,F,Black/African American,Not Span/Hispanic,1,Elective,Home or Self Care,2019,NEO045,URINARY SYSTEM CANCERS - KIDNEY,CAR010,LIGATION AND EMBOLIZATION OF VESSELS,447,"OTHER KIDNEY, URINARY TRACT & RELATED PROCEDURES",11,DISEASES AND DISORDERS OF THE KIDNEY AND URINARY TRACT,3,Major,Minor,Surgical,Medicare,Medicare,Self-Pay,,,false,28827.43,13654.58
Long Island,Suffolk,5154001,000925,Good Samaritan Hospital Medical Center,30 to 49,117,M,White,Not Span/Hispanic,6,Emergency,Home w/ Home Health Services,2019,INJ037,"COMPLICATION OF OTHER SURGICAL OR MEDICAL CARE, INJURY, INITIAL ENCOUNTER",GIS024,OTHER PERITONEAL CAVITY PROCEDURES,447,"OTHER KIDNEY, URINARY TRACT & RELATED PROCEDURES",11,DISEASES AND DISORDERS OF THE KIDNEY AND URINARY TRACT,3,Major,Moderate,Surgical,Medicare,,,,,true,64473.95,13007.49
New York City,Kings,7002053,001304,NYU Langone Hospital-Brooklyn,18 to 29,112,F,Other Race,Spanish/Hispanic,2,Emergency,Home or Self Care,2019,GEN004,URINARY TRACT INFECTIONS,GIS005,EXPLORATION OF PERITONEAL CAVITY,447,"OTHER KIDNEY, URINARY TRACT & RELATED PROCEDURES",11,DISEASES AND DISORDERS OF THE KIDNEY AND URINARY TRACT,2,Moderate,Minor,Surgical,Medicaid,,,,,true,80730.61,18899.01
New York City,Kings,7002002,001324,Mount Sinai Brooklyn,50 to 69,112,F,Other Race,Not Span/Hispanic,17,Emergency,Expired,2019,NEO045,URINARY SYSTEM CANCERS - KIDNEY,GNR009,"RETROPERITONEAL PROCEDURES, NEC",447,"OTHER KIDNEY, URINARY TRACT & RELATED PROCEDURES",11,DISEASES AND DISORDERS OF THE KIDNEY AND URINARY TRACT,4,Extreme,Extreme,Surgical,Medicare,Miscellaneous/Other,Self-Pay,,,true,209042.39,37284.75
Central NY,Onondaga,3301007,000635,University Hospital SUNY Health Science Center,18 to 29,132,F,White,Not Span/Hispanic,3,Elective,Home or Self Care,2019,GEN006,OTHER SPECIFIED AND UNSPECIFIED DISEASES OF KIDNEY AND URETERS,ENP003,PARATHYROIDECTOMY,447,"OTHER KIDNEY, URINARY TRACT & RELATED PROCEDURES",11,DISEASES AND DISORDERS OF THE KIDNEY AND URINARY TRACT,3,Major,Moderate,Surgical,Medicare,Medicaid,,,,false,64925.1,15715.97
New York City,Manhattan,7002054,001464,New York-Presbyterian Hospital - Columbia Presbyterian Center,50 to 69,112,F,Other Race,Not Span/Hispanic,1,Urgent,Home or Self Care,2019,INJ036,"COMPLICATION OF TRANSPLANTED ORGANS OR TISSUE, INITIAL ENCOUNTER",CAR010,LIGATION AND EMBOLIZATION OF VESSELS,447,"OTHER KIDNEY, URINARY TRACT & RELATED PROCEDURES",11,DISEASES AND DISORDERS OF THE KIDNEY AND URINARY TRACT,2,Moderate,Major,Surgical,Medicare,Medicaid,Self-Pay,,,false,34220.59,13371.31
New York City,Manhattan,7002054,001464,New York-Presbyterian Hospital - Columbia Presbyterian Center,50 to 69,107,F,White,Not Span/Hispanic,6,Urgent,Home or Self Care,2019,CIR026,PERIPHERAL AND VISCERAL VASCULAR DISEASE,CAR010,LIGATION AND EMBOLIZATION OF VESSELS,447,"OTHER KIDNEY, URINARY TRACT & RELATED PROCEDURES",11,DISEASES AND DISORDERS OF THE KIDNEY AND URINARY TRACT,1,Minor,Minor,Surgical,Private Health Insurance,Self-Pay,,,,false,106587.12,32922.13
New York City,Manhattan,7002054,001458,New York-Presbyterian Hospital - New York Weill Cornell Center,70 or Older,107,F,White,Not Span/Hispanic,1,Emergency,Home or Self Care,2019,GEN003,CHRONIC KIDNEY DISEASE,GIS024,OTHER PERITONEAL CAVITY PROCEDURES,447,"OTHER KIDNEY, URINARY TRACT & RELATED PROCEDURES",11,DISEASES AND DISORDERS OF THE KIDNEY AND URINARY TRACT,2,Moderate,Minor,Surgical,Medicare,Self-Pay,,,,false,33339.29,9493.1
Hudson Valley,Westchester,5907001,001097,SJRH - St Johns Division,70 or Older,107,M,Other Race,Not Span/Hispanic,18,Emergency,Home or Self Care,2019,INJ037,"COMPLICATION OF OTHER SURGICAL OR MEDICAL CARE, INJURY, INITIAL ENCOUNTER",GIS022,GI SYSTEM LYSIS OF ADHESIONS,447,"OTHER KIDNEY, URINARY TRACT & RELATED PROCEDURES",11,DISEASES AND DISORDERS OF THE KIDNEY AND URINARY TRACT,4,Extreme,Extreme,Surgical,Medicare,Medicaid,Self-Pay,,,true,171601.64,70398.75
New York City,Manhattan,7002054,001464,New York-Presbyterian Hospital - Columbia Presbyterian Center,30 to 49,OOS,M,Other Race,Spanish/Hispanic,21,Emergency,Home w/ Home Health Services,2019,INJ037,"COMPLICATION OF OTHER SURGICAL OR MEDICAL CARE, INJURY, INITIAL ENCOUNTER",GNR002,ABDOMINAL WALL REPAIR (INCLUDING HERNIA),447,"OTHER KIDNEY, URINARY TRACT & RELATED PROCEDURES",11,DISEASES AND DISORDERS OF THE KIDNEY AND URINARY TRACT,4,Extreme,Major,Surgical,Medicare,Private Health Insurance,Self-Pay,,,true,349292.83,88631.77
New York City,Bronx,7000006,001169,Montefiore Medical Center - Henry & Lucy Moses Div,30 to 49,114,F,Black/African American,Not Span/Hispanic,3,Elective,Left Against Medical Advice,2019,GEN006,OTHER SPECIFIED AND UNSPECIFIED DISEASES OF KIDNEY AND URETERS,ENP003,PARATHYROIDECTOMY,447,"OTHER KIDNEY, URINARY TRACT & RELATED PROCEDURES",11,DISEASES AND DISORDERS OF THE KIDNEY AND URINARY TRACT,2,Moderate,Moderate,Surgical,Medicare,Blue Cross/Blue Shield,,,,true,98718.74,16356.87
Long Island,Nassau,2950001,000527,Mount Sinai South Nassau,50 to 69,115,F,Black/African American,Not Span/Hispanic,3,Emergency,Home w/ Home Health Services,2019,INJ033,"COMPLICATION OF CARDIOVASCULAR DEVICE, IMPLANT OR GRAFT, INITIAL ENCOUNTER",CAR029,"CARDIOVASCULAR DEVICE PROCEDURES, NEC",447,"OTHER KIDNEY, URINARY TRACT & RELATED PROCEDURES",11,DISEASES AND DISORDERS OF THE KIDNEY AND URINARY TRACT,2,Moderate,Moderate,Surgical,Medicare,Blue Cross/Blue Shield,,,,true,41998.22,8488.77
Central NY,Onondaga,3301007,000635,University Hospital SUNY Health Science Center,50 to 69,132,M,White,Not Span/Hispanic,20,Emergency,Skilled Nursing Home,2019,INJ034,"COMPLICATION OF GENITOURINARY DEVICE, IMPLANT OR GRAFT, INITIAL ENCOUNTER",GNR008,"ABDOMINAL WALL PROCEDURES, NEC",447,"OTHER KIDNEY, URINARY TRACT & RELATED PROCEDURES",11,DISEASES AND DISORDERS OF THE KIDNEY AND URINARY TRACT,3,Major,Major,Surgical,Medicare,,,,,true,181675.14,54868.44
Central NY,Onondaga,3301007,000635,University Hospital SUNY Health Science Center,70 or Older,130,M,White,Not Span/Hispanic,1,Emergency,Home or Self Care,2019,GEN003,CHRONIC KIDNEY DISEASE,GIS024,OTHER PERITONEAL CAVITY PROCEDURES,447,"OTHER KIDNEY, URINARY TRACT & RELATED PROCEDURES",11,DISEASES AND DISORDERS OF THE KIDNEY AND URINARY TRACT,2,Moderate,Moderate,Surgical,Medicare,Private Health Insurance,,,,false,26074.9,7076.51
Capital/Adirond,Albany,0101000,000001,Albany Medical Center Hospital,50 to 69,121,M,White,Not Span/Hispanic,16,Elective,Home or Self Care,2019,GEN006,OTHER SPECIFIED AND UNSPECIFIED DISEASES OF KIDNEY AND URETERS,ENP003,PARATHYROIDECTOMY,447,"OTHER KIDNEY, URINARY TRACT & RELATED PROCEDURES",11,DISEASES AND DISORDERS OF THE KIDNEY AND URINARY TRACT,2,Moderate,Moderate,Surgical,Medicare,Medicaid,,,,false,134583.74,40551.63
Finger Lakes,Monroe,2701005,000413,Strong Memorial Hospital,50 to 69,140,M,White,Not Span/Hispanic,14,Elective,Home or Self Care,2019,GEN006,OTHER SPECIFIED AND UNSPECIFIED DISEASES OF KIDNEY AND URETERS,ENP003,PARATHYROIDECTOMY,447,"OTHER KIDNEY, URINARY TRACT & RELATED PROCEDURES",11,DISEASES AND DISORDERS OF THE KIDNEY AND URINARY TRACT,2,Moderate,Moderate,Surgical,Medicare,Blue Cross/Blue Shield,,,,false,90564.16,33212.67
New York City,Manhattan,7002017,001450,Lenox Hill Hospital,30 to 49,104,F,Other Race,Unknown,6,Emergency,Home or Self Care,2019,GEN026,POSTPROCEDURAL OR POSTOPERATIVE GENITOURINARY SYSTEM COMPLICATION,URN003,URETER AND OTHER URINARY TRACT DILATION,447,"OTHER KIDNEY, URINARY TRACT & RELATED PROCEDURES",11,DISEASES AND DISORDERS OF THE KIDNEY AND URINARY TRACT,2,Moderate,Minor,Surgical,Blue Cross/Blue Shield,,,,,true,108636.35,22993.02
Central NY,Onondaga,3301007,000635,University Hospital SUNY Health Science Center,30 to 49,130,M,White,Not Span/Hispanic,2,Elective,Home or Self Care,2019,GEN007,OTHER SPECIFIED AND UNSPECIFIED DISEASES OF BLADDER AND URETHRA,GIS009,COLECTOMY,447,"OTHER KIDNEY, URINARY TRACT & RELATED PROCEDURES",11,DISEASES AND DISORDERS OF THE KIDNEY AND URINARY TRACT,2,Moderate,Minor,Surgical,Blue Cross/Blue Shield,,,,,false,90695.83,26838.11
Long Island,Nassau,2951001,000541,North Shore University Hospital,70 or Older,114,M,White,Not Span/Hispanic,5,Urgent,Home or Self Care,2019,GEN003,CHRONIC KIDNEY DISEASE,CAR008,ANGIOPLASTY AND RELATED VESSEL PROCEDURES (ENDOVASCULAR; EXCLUDING CAROTID),447,"OTHER KIDNEY, URINARY TRACT & RELATED PROCEDURES",11,DISEASES AND DISORDERS OF THE KIDNEY AND URINARY TRACT,3,Major,Major,Surgical,Medicare,Blue Cross/Blue Shield,Medicaid,,,false,125879,31541.96
New York City,Queens,7003004,001630,Long Island Jewish Medical Center,50 to 69,114,F,Black/African American,Not Span/Hispanic,16,Emergency,Inpatient Rehabilitation Facility,2019,INJ033,"COMPLICATION OF CARDIOVASCULAR DEVICE, IMPLANT OR GRAFT, INITIAL ENCOUNTER",CAR029,"CARDIOVASCULAR DEVICE PROCEDURES, NEC",447,"OTHER KIDNEY, URINARY TRACT & RELATED PROCEDURES",11,DISEASES AND DISORDERS OF THE KIDNEY AND URINARY TRACT,4,Extreme,Major,Surgical,Medicare,Medicare,Self-Pay,,,false,238242.28,50750.35
Long Island,Nassau,2951001,000541,North Shore University Hospital,18 to 29,110,M,Other Race,Spanish/Hispanic,30,Emergency,Home or Self Care,2019,INJ037,"COMPLICATION OF OTHER SURGICAL OR MEDICAL CARE, INJURY, INITIAL ENCOUNTER",GIS005,EXPLORATION OF PERITONEAL CAVITY,447,"OTHER KIDNEY, URINARY TRACT & RELATED PROCEDURES",11,DISEASES AND DISORDERS OF THE KIDNEY AND URINARY TRACT,4,Extreme,Major,Surgical,Medicaid,Medicaid,,,,true,386078.67,81780.08
Central NY,Oneida,3202002,000598,St Elizabeth Medical Center,50 to 69,134,M,White,Not Span/Hispanic,11,Emergency,Home or Self Care,2019,GEN002,ACUTE AND UNSPECIFIED RENAL FAILURE,GIS006,PARACENTESIS,447,"OTHER KIDNEY, URINARY TRACT & RELATED PROCEDURES",11,DISEASES AND DISORDERS OF THE KIDNEY AND URINARY TRACT,3,Major,Moderate,Surgical,Medicare,Medicaid,,,,true,39831.4,14598.26
New York City,Manhattan,7002053,001463,NYU Langone Hospitals,70 or Older,100,M,White,Not Span/Hispanic,5,Emergency,Home or Self Care,2019,GEN026,POSTPROCEDURAL OR POSTOPERATIVE GENITOURINARY SYSTEM COMPLICATION,URN006,BLADDER CATHETERIZATION AND DRAINAGE,447,"OTHER KIDNEY, URINARY TRACT & RELATED PROCEDURES",11,DISEASES AND DISORDERS OF THE KIDNEY AND URINARY TRACT,2,Moderate,Moderate,Surgical,Blue Cross/Blue Shield,Medicare,,,,false,114956.08,24986
Long Island,Nassau,2951001,000541,North Shore University Hospital,50 to 69,115,M,Other Race,Not Span/Hispanic,1,Elective,Home or Self Care,2019,GEN002,ACUTE AND UNSPECIFIED RENAL FAILURE,GNR009,"RETROPERITONEAL PROCEDURES, NEC",447,"OTHER KIDNEY, URINARY TRACT & RELATED PROCEDURES",11,DISEASES AND DISORDERS OF THE KIDNEY AND URINARY TRACT,3,Major,Major,Surgical,Medicare,Private Health Insurance,,,,false,28254.05,7314.8
Hudson Valley,Rockland,4324000,000776,Montefiore Nyack,70 or Older,109,M,White,Not Span/Hispanic,23,Emergency,Expired,2019,INJ034,"COMPLICATION OF GENITOURINARY DEVICE, IMPLANT OR GRAFT, INITIAL ENCOUNTER",GIS005,EXPLORATION OF PERITONEAL CAVITY,447,"OTHER KIDNEY, URINARY TRACT & RELATED PROCEDURES",11,DISEASES AND DISORDERS OF THE KIDNEY AND URINARY TRACT,4,Extreme,Extreme,Surgical,Medicare,Private Health Insurance,Self-Pay,,,false,385246.74,78343.47
New York City,Manhattan,7002024,001456,Mount Sinai Hospital,70 or Older,112,F,White,Not Span/Hispanic,3,Elective,Home w/ Home Health Services,2019,INJ036,"COMPLICATION OF TRANSPLANTED ORGANS OR TISSUE, INITIAL ENCOUNTER",CAR008,ANGIOPLASTY AND RELATED VESSEL PROCEDURES (ENDOVASCULAR; EXCLUDING CAROTID),447,"OTHER KIDNEY, URINARY TRACT & RELATED PROCEDURES",11,DISEASES AND DISORDERS OF THE KIDNEY AND URINARY TRACT,2,Moderate,Moderate,Surgical,Medicare,Medicare,Self-Pay,,,false,57086.18,19115.12
Central NY,Oneida,3202002,000598,St Elizabeth Medical Center,18 to 29,,F,White,Not Span/Hispanic,19,Emergency,Home or Self Care,2019,INJ034,"COMPLICATION OF GENITOURINARY DEVICE, IMPLANT OR GRAFT, INITIAL ENCOUNTER",GIS003,GI SYSTEM BIOPSY (NON-ENDOSCOPIC),447,"OTHER KIDNEY, URINARY TRACT & RELATED PROCEDURES",11,DISEASES AND DISORDERS OF THE KIDNEY AND URINARY TRACT,3,Major,Major,Surgical,Blue Cross/Blue Shield,,,,,true,104501.17,36809.16
New York City,Manhattan,7002054,001464,New York-Presbyterian Hospital - Columbia Presbyterian Center,18 to 29,OOS,F,Other Race,Not Span/Hispanic,1,Elective,Home or Self Care,2019,MAL003,GENITOURINARY CONGENITAL ANOMALIES,GNR008,"ABDOMINAL WALL PROCEDURES, NEC",447,"OTHER KIDNEY, URINARY TRACT & RELATED PROCEDURES",11,DISEASES AND DISORDERS OF THE KIDNEY AND URINARY TRACT,1,Minor,Minor,Surgical,Private Health Insurance,Self-Pay,,,,false,43091.58,12867.91
Long Island,Suffolk,5154001,000925,Good Samaritan Hospital Medical Center,70 or Older,117,M,White,Not Span/Hispanic,7,Emergency,Home or Self Care,2019,INJ034,"COMPLICATION OF GENITOURINARY DEVICE, IMPLANT OR GRAFT, INITIAL ENCOUNTER",URN005,NEPHROSTOMY AND URETEROSTOMY PROCEDURES (INCLUDING STENTS),447,"OTHER KIDNEY, URINARY TRACT & RELATED PROCEDURES",11,DISEASES AND DISORDERS OF THE KIDNEY AND URINARY TRACT,3,Major,Major,Surgical,Medicare,Private Health Insurance,,,,true,84805.27,15897.75
New York City,Manhattan,7002054,001464,New York-Presbyterian Hospital - Columbia Presbyterian Center,70 or Older,100,F,Multi-racial,Spanish/Hispanic,15,Emergency,Skilled Nursing Home,2019,GEN003,CHRONIC KIDNEY DISEASE,CAR010,LIGATION AND EMBOLIZATION OF VESSELS,447,"OTHER KIDNEY, URINARY TRACT & RELATED PROCEDURES",11,DISEASES AND DISORDERS OF THE KIDNEY AND URINARY TRACT,3,Major,Major,Surgical,Medicare,Blue Cross/Blue Shield,Self-Pay,,,true,189745.45,46855.05
New York City,Manhattan,7002054,001464,New York-Presbyterian Hospital - Columbia Presbyterian Center,50 to 69,100,M,Other Race,Spanish/Hispanic,1,Urgent,Home or Self Care,2019,INJ036,"COMPLICATION OF TRANSPLANTED ORGANS OR TISSUE, INITIAL ENCOUNTER",CAR008,ANGIOPLASTY AND RELATED VESSEL PROCEDURES (ENDOVASCULAR; EXCLUDING CAROTID),447,"OTHER KIDNEY, URINARY TRACT & RELATED PROCEDURES",11,DISEASES AND DISORDERS OF THE KIDNEY AND URINARY TRACT,1,Minor,Minor,Surgical,Medicare,Private Health Insurance,Self-Pay,,,false,27884.1,8894.57
Long Island,Suffolk,5151001,000245,Stony Brook University Hospital,50 to 69,117,M,Black/African American,Not Span/Hispanic,6,Emergency,Home w/ Home Health Services,2019,INJ036,"COMPLICATION OF TRANSPLANTED ORGANS OR TISSUE, INITIAL ENCOUNTER",CAR008,ANGIOPLASTY AND RELATED VESSEL PROCEDURES (ENDOVASCULAR; EXCLUDING CAROTID),447,"OTHER KIDNEY, URINARY TRACT & RELATED PROCEDURES",11,DISEASES AND DISORDERS OF THE KIDNEY AND URINARY TRACT,3,Major,Moderate,Surgical,Self-Pay,,,,,true,88033.72,28470.91
Hudson Valley,Orange,3522000,000694,St Luke's Cornwall Hospital/Newburgh,30 to 49,125,M,Black/African American,Not Span/Hispanic,1,Emergency,Expired,2019,INJ010,"INTERNAL ORGAN INJURY, INITIAL ENCOUNTER",MRS002,PENIS PROCEDURES (EXCLUDING CIRCUMCISION),447,"OTHER KIDNEY, URINARY TRACT & RELATED PROCEDURES",11,DISEASES AND DISORDERS OF THE KIDNEY AND URINARY TRACT,2,Moderate,Minor,Surgical,Medicaid,,,,,true,42632.12,12249
Hudson Valley,Dutchess,1302001,000181,Vassar Brothers Medical Center,70 or Older,125,M,White,Not Span/Hispanic,7,Emergency,Home or Self Care,2019,INJ037,"COMPLICATION OF OTHER SURGICAL OR MEDICAL CARE, INJURY, INITIAL ENCOUNTER",GIS022,GI SYSTEM LYSIS OF ADHESIONS,447,"OTHER KIDNEY, URINARY TRACT & RELATED PROCEDURES",11,DISEASES AND DISORDERS OF THE KIDNEY AND URINARY TRACT,2,Moderate,Moderate,Surgical,Medicare,,,,,true,58388.19,18467
Finger Lakes,Monroe,2701003,000411,Rochester General Hospital,70 or Older,144,F,White,Not Span/Hispanic,18,Elective,Home w/ Home Health Services,2019,INJ033,"COMPLICATION OF CARDIOVASCULAR DEVICE, IMPLANT OR GRAFT, INITIAL ENCOUNTER",CAR006,CAROTID ENDARTERECTOMY AND STENTING,447,"OTHER KIDNEY, URINARY TRACT & RELATED PROCEDURES",11,DISEASES AND DISORDERS OF THE KIDNEY AND URINARY TRACT,3,Major,Minor,Surgical,Medicare,,,,,false,61855.11,29198.7
Hudson Valley,Westchester,5907002,001098,St. Joseph's Medical Center,50 to 69,107,M,Other Race,Not Span/Hispanic,2,Emergency,Home or Self Care,2019,GEN002,ACUTE AND UNSPECIFIED RENAL FAILURE,CAR008,ANGIOPLASTY AND RELATED VESSEL PROCEDURES (ENDOVASCULAR; EXCLUDING CAROTID),447,"OTHER KIDNEY, URINARY TRACT & RELATED PROCEDURES",11,DISEASES AND DISORDERS OF THE KIDNEY AND URINARY TRACT,3,Major,Moderate,Surgical,Medicare,Medicare,Medicaid,,,true,36681.21,26840.29
New York City,Manhattan,7002054,001464,New York-Presbyterian Hospital - Columbia Presbyterian Center,50 to 69,100,F,Other Race,Spanish/Hispanic,9,Emergency,Home w/ Home Health Services,2019,GEN003,CHRONIC KIDNEY DISEASE,IMG002,FLUOROSCOPIC ANGIOGRAPHY (EXCLUDING CORONARY),447,"OTHER KIDNEY, URINARY TRACT & RELATED PROCEDURES",11,DISEASES AND DISORDERS OF THE KIDNEY AND URINARY TRACT,3,Major,Moderate,Surgical,Medicare,Medicare,Medicaid,,,true,126895.38,32234.74
Long Island,Suffolk,5151001,000245,Stony Brook University Hospital,70 or Older,117,F,White,Not Span/Hispanic,2,Emergency,Home w/ Home Health Services,2019,CIR029,AORTIC; PERIPHERAL; AND VISCERAL ARTERY ANEURYSMS,IMG002,FLUOROSCOPIC ANGIOGRAPHY (EXCLUDING CORONARY),447,"OTHER KIDNEY, URINARY TRACT & RELATED PROCEDURES",11,DISEASES AND DISORDERS OF THE KIDNEY AND URINARY TRACT,2,Moderate,Moderate,Surgical,Blue Cross/Blue Shield,,,,,true,41879.46,13283.62
Long Island,Suffolk,5151001,000245,Stony Brook University Hospital,50 to 69,117,M,Black/African American,Not Span/Hispanic,6,Emergency,Home or Self Care,2019,GEN003,CHRONIC KIDNEY DISEASE,GIS024,OTHER PERITONEAL CAVITY PROCEDURES,447,"OTHER KIDNEY, URINARY TRACT & RELATED PROCEDURES",11,DISEASES AND DISORDERS OF THE KIDNEY AND URINARY TRACT,3,Major,Moderate,Surgical,Medicare,Medicaid,Self-Pay,,,true,71828.54,25123.35
New York City,Queens,7003004,001630,Long Island Jewish Medical Center,70 or Older,114,M,Black/African American,Not Span/Hispanic,6,Emergency,Home w/ Home Health Services,2019,INJ033,"COMPLICATION OF CARDIOVASCULAR DEVICE, IMPLANT OR GRAFT, INITIAL ENCOUNTER",CAR029,"CARDIOVASCULAR DEVICE PROCEDURES, NEC",447,"OTHER KIDNEY, URINARY TRACT & RELATED PROCEDURES",11,DISEASES AND DISORDERS OF THE KIDNEY AND URINARY TRACT,3,Major,Moderate,Surgical,Medicare,Medicaid,Self-Pay,,,false,85663.78,18158.4
New York City,Queens,7002024,001639,Mount Sinai Hospital - Mount Sinai Hospital of Queens,70 or Older,111,F,White,Not Span/Hispanic,4,Emergency,Home w/ Home Health Services,2019,GEN006,OTHER SPECIFIED AND UNSPECIFIED DISEASES OF KIDNEY AND URETERS,ADM021,"ADMINISTRATION OF THERAPEUTIC SUBSTANCES, NEC",447,"OTHER KIDNEY, URINARY TRACT & RELATED PROCEDURES",11,DISEASES AND DISORDERS OF THE KIDNEY AND URINARY TRACT,2,Moderate,Major,Surgical,Medicare,Medicaid,,,,true,90681.84,32589.19
Hudson Valley,Ulster,5501001,000990,HealthAlliance Hospital Broadway Campus,70 or Older,124,M,White,Not Span/Hispanic,8,Emergency,Home or Self Care,2019,GEN009,HEMATURIA,URN004,REMOVAL OF CALCULI AND OTHER MATTER FROM URINARY TRACT,447,"OTHER KIDNEY, URINARY TRACT & RELATED PROCEDURES",11,DISEASES AND DISORDERS OF THE KIDNEY AND URINARY TRACT,1,Minor,Major,Surgical,Medicare,Private Health Insurance,,,,true,93840.87,16478.22
New York City,Bronx,7000006,001169,Montefiore Medical Center - Henry & Lucy Moses Div,50 to 69,104,M,Other Race,Spanish/Hispanic,23,Emergency,Home w/ Home Health Services,2019,GEN007,OTHER SPECIFIED AND UNSPECIFIED DISEASES OF BLADDER AND URETHRA,GIS022,GI SYSTEM LYSIS OF ADHESIONS,447,"OTHER KIDNEY, URINARY TRACT & RELATED PROCEDURES",11,DISEASES AND DISORDERS OF THE KIDNEY AND URINARY TRACT,3,Major,Major,Surgical,Medicare,,,,,true,293506.95,59015.67
New York City,Bronx,7000006,001169,Montefiore Medical Center - Henry & Lucy Moses Div,70 or Older,104,F,Black/African American,Not Span/Hispanic,13,Emergency,Skilled Nursing Home,2019,INJ010,"INTERNAL ORGAN INJURY, INITIAL ENCOUNTER",CAR011,ANEURYSM REPAIR PROCEDURES,447,"OTHER KIDNEY, URINARY TRACT & RELATED PROCEDURES",11,DISEASES AND DISORDERS OF THE KIDNEY AND URINARY TRACT,3,Major,Major,Surgical,Medicare,Medicaid,,,,true,247321.24,47666.24
New York City,Manhattan,7002053,001463,NYU Langone Hospitals,18 to 29,112,M,Other Race,Not Span/Hispanic,2,Emergency,Home or Self Care,2019,MAL003,GENITOURINARY CONGENITAL ANOMALIES,GNR008,"ABDOMINAL WALL PROCEDURES, NEC",447,"OTHER KIDNEY, URINARY TRACT & RELATED PROCEDURES",11,DISEASES AND DISORDERS OF THE KIDNEY AND URINARY TRACT,1,Minor,Minor,Surgical,Private Health Insurance,,,,,true,151878.71,26493.64
New York City,Manhattan,7002020,001453,Memorial Hospital for Cancer and Allied Diseases,70 or Older,100,F,White,Not Span/Hispanic,26,Emergency,Home w/ Home Health Services,2019,GEN007,OTHER SPECIFIED AND UNSPECIFIED DISEASES OF BLADDER AND URETHRA,GIS008,APPENDECTOMY,447,"OTHER KIDNEY, URINARY TRACT & RELATED PROCEDURES",11,DISEASES AND DISORDERS OF THE KIDNEY AND URINARY TRACT,4,Extreme,Major,Surgical,Medicare,Private Health Insurance,,,,false,241377.55,95391.46
Long Island,Suffolk,5151001,000245,Stony Brook University Hospital,50 to 69,117,F,Other Race,Spanish/Hispanic,3,Emergency,Home or Self Care,2019,INJ036,"COMPLICATION OF TRANSPLANTED ORGANS OR TISSUE, INITIAL ENCOUNTER",CAR008,ANGIOPLASTY AND RELATED VESSEL PROCEDURES (ENDOVASCULAR; EXCLUDING CAROTID),447,"OTHER KIDNEY, URINARY TRACT & RELATED PROCEDURES",11,DISEASES AND DISORDERS OF THE KIDNEY AND URINARY TRACT,3,Major,Minor,Surgical,Medicare,Medicaid,,,,true,48813.47,18310.27