Hospital Service Area,Hospital County,Operating Certificate Number,Permanent Facility Id,Facility Name,Age Group,Zip Code - 3 digits,Gender,Race,Ethnicity,Length of Stay,Type of Admission,Patient Disposition,Discharge Year,CCS Diagnosis Code,CCS Diagnosis Description,CCS Procedure Code,CCS Procedure Description,APR DRG Code,APR DRG Description,APR MDC Code,APR MDC Description,APR Severity of Illness Code,APR Severity of Illness Description,APR Risk of Mortality,APR Medical Surgical Description,Payment Typology 1,Payment Typology 2,Payment Typology 3,Birth Weight,Abortion Edit Indicator,Emergency Department Indicator,Total Charges,Total Costs
New York City,Kings,7002053,001304,NYU Langone Hospital-Brooklyn,70 or Older,112,F,Other Race,Not Span/Hispanic,2,Emergency,Inpatient Rehabilitation Facility,2019,CIR020,CEREBRAL INFARCTION,,,045,CVA & PRECEREBRAL OCCLUSION W INFARCT,01,DISEASES AND DISORDERS OF THE NERVOUS SYSTEM,3,Major,Major,Medical,Medicare,Medicaid,,,,true,69301.82,19796.54
New York City,Kings,7002053,001304,NYU Langone Hospital-Brooklyn,70 or Older,112,F,White,Not Span/Hispanic,3,Emergency,Inpatient Rehabilitation Facility,2019,CIR020,CEREBRAL INFARCTION,,,045,CVA & PRECEREBRAL OCCLUSION W INFARCT,01,DISEASES AND DISORDERS OF THE NERVOUS SYSTEM,2,Moderate,Moderate,Medical,Medicare,Blue Cross/Blue Shield,,,,true,58538.01,14946.08
New York City,Kings,7002053,001304,NYU Langone Hospital-Brooklyn,70 or Older,112,F,White,Not Span/Hispanic,4,Emergency,Skilled Nursing Home,2019,CIR020,CEREBRAL INFARCTION,,,045,CVA & PRECEREBRAL OCCLUSION W INFARCT,01,DISEASES AND DISORDERS OF THE NERVOUS SYSTEM,3,Major,Moderate,Medical,Medicare,,,,,true,98447.13,32599.77
New York City,Kings,7002053,001304,NYU Langone Hospital-Brooklyn,70 or Older,112,F,White,Unknown,2,Emergency,Home w/ Home Health Services,2019,CIR020,CEREBRAL INFARCTION,,,045,CVA & PRECEREBRAL OCCLUSION W INFARCT,01,DISEASES AND DISORDERS OF THE NERVOUS SYSTEM,2,Moderate,Moderate,Medical,Medicare,Medicare,,,,true,68608.05,19987.24
New York City,Kings,7002053,001304,NYU Langone Hospital-Brooklyn,50 to 69,112,F,White,Unknown,2,Emergency,Home or Self Care,2019,CIR020,CEREBRAL INFARCTION,ADM005,ADMINISTRATION OF THROMBOLYTICS AND PLATELET INHIBITORS,045,CVA & PRECEREBRAL OCCLUSION W INFARCT,01,DISEASES AND DISORDERS OF THE NERVOUS SYSTEM,2,Moderate,Minor,Medical,Medicare,Private Health Insurance,,,,true,152239.02,22221.66
New York City,Kings,7002053,001304,NYU Langone Hospital-Brooklyn,50 to 69,112,M,White,Not Span/Hispanic,3,Emergency,Home or Self Care,2019,CIR020,CEREBRAL INFARCTION,,,045,CVA & PRECEREBRAL OCCLUSION W INFARCT,01,DISEASES AND DISORDERS OF THE NERVOUS SYSTEM,2,Moderate,Minor,Medical,Private Health Insurance,,,,,true,95088.77,28980.37
New York City,Kings,7002053,001304,NYU Langone Hospital-Brooklyn,30 to 49,112,M,White,Not Span/Hispanic,1,Emergency,Home or Self Care,2019,CIR020,CEREBRAL INFARCTION,,,045,CVA & PRECEREBRAL OCCLUSION W INFARCT,01,DISEASES AND DISORDERS OF THE NERVOUS SYSTEM,3,Major,Moderate,Medical,Private Health Insurance,,,,,true,71561.56,13640.62
New York City,Kings,7002053,001304,NYU Langone Hospital-Brooklyn,50 to 69,112,F,Other Race,Spanish/Hispanic,6,Emergency,Inpatient Rehabilitation Facility,2019,CIR020,CEREBRAL INFARCTION,IMG008,ULTRASONOGRAPHY,045,CVA & PRECEREBRAL OCCLUSION W INFARCT,01,DISEASES AND DISORDERS OF THE NERVOUS SYSTEM,2,Moderate,Minor,Medical,Private Health Insurance,,,,,true,116778.41,35409.33
New York City,Kings,7002053,001304,NYU Langone Hospital-Brooklyn,70 or Older,112,F,Other Race,Not Span/Hispanic,11,Emergency,Expired,2019,CIR020,CEREBRAL INFARCTION,,,045,CVA & PRECEREBRAL OCCLUSION W INFARCT,01,DISEASES AND DISORDERS OF THE NERVOUS SYSTEM,4,Extreme,Extreme,Medical,Medicare,,,,,true,173538.14,72201.36
New York City,Kings,7002053,001304,NYU Langone Hospital-Brooklyn,70 or Older,112,F,White,Not Span/Hispanic,6,Emergency,Home w/ Home Health Services,2019,CIR020,CEREBRAL INFARCTION,,,045,CVA & PRECEREBRAL OCCLUSION W INFARCT,01,DISEASES AND DISORDERS OF THE NERVOUS SYSTEM,3,Major,Major,Medical,Medicare,Medicaid,,,,true,97700.95,24090.64
New York City,Kings,7002053,001304,NYU Langone Hospital-Brooklyn,70 or Older,112,F,White,Not Span/Hispanic,6,Emergency,Inpatient Rehabilitation Facility,2019,CIR020,CEREBRAL INFARCTION,IMG004,FLUOROSCOPY OF NON-CIRCULATORY ORGANS,045,CVA & PRECEREBRAL OCCLUSION W INFARCT,01,DISEASES AND DISORDERS OF THE NERVOUS SYSTEM,3,Major,Moderate,Medical,Medicare,Medicaid,,,,true,121330.71,42575.44
New York City,Kings,7002053,001304,NYU Langone Hospital-Brooklyn,70 or Older,112,F,White,Not Span/Hispanic,3,Emergency,Home w/ Home Health Services,2019,CIR020,CEREBRAL INFARCTION,,,045,CVA & PRECEREBRAL OCCLUSION W INFARCT,01,DISEASES AND DISORDERS OF THE NERVOUS SYSTEM,2,Moderate,Moderate,Medical,Medicare,Medicaid,,,,true,62922.66,16734
New York City,Kings,7002053,001304,NYU Langone Hospital-Brooklyn,70 or Older,112,M,Other Race,Not Span/Hispanic,5,Emergency,Home w/ Home Health Services,2019,CIR020,CEREBRAL INFARCTION,MAM011,ELECTROENCEPHALOGRAM (EEG),045,CVA & PRECEREBRAL OCCLUSION W INFARCT,01,DISEASES AND DISORDERS OF THE NERVOUS SYSTEM,3,Major,Moderate,Medical,Medicare,Medicaid,,,,true,137820.75,29555.38
New York City,Kings,7002053,001304,NYU Langone Hospital-Brooklyn,70 or Older,112,F,White,Not Span/Hispanic,5,Emergency,Inpatient Rehabilitation Facility,2019,CIR020,CEREBRAL INFARCTION,,,045,CVA & PRECEREBRAL OCCLUSION W INFARCT,01,DISEASES AND DISORDERS OF THE NERVOUS SYSTEM,4,Extreme,Extreme,Medical,Medicare,Medicare,,,,true,112103.77,38996.33
New York City,Kings,7002053,001304,NYU Langone Hospital-Brooklyn,50 to 69,112,M,White,Not Span/Hispanic,4,Emergency,Skilled Nursing Home,2019,CIR020,CEREBRAL INFARCTION,,,045,CVA & PRECEREBRAL OCCLUSION W INFARCT,01,DISEASES AND DISORDERS OF THE NERVOUS SYSTEM,3,Major,Major,Medical,Medicare,Medicare,,,,true,83882.05,19084.24
New York City,Kings,7002053,001304,NYU Langone Hospital-Brooklyn,30 to 49,112,M,White,Spanish/Hispanic,1,Emergency,Home or Self Care,2019,CIR020,CEREBRAL INFARCTION,,,045,CVA & PRECEREBRAL OCCLUSION W INFARCT,01,DISEASES AND DISORDERS OF THE NERVOUS SYSTEM,4,Extreme,Extreme,Medical,Medicaid,,,,,true,67293.86,14527.2
New York City,Kings,7002053,001304,NYU Langone Hospital-Brooklyn,70 or Older,112,M,Other Race,Not Span/Hispanic,3,Emergency,Home w/ Home Health Services,2019,CIR020,CEREBRAL INFARCTION,,,045,CVA & PRECEREBRAL OCCLUSION W INFARCT,01,DISEASES AND DISORDERS OF THE NERVOUS SYSTEM,3,Major,Major,Medical,Medicare,,,,,true,120179.66,34726.42
New York City,Kings,7002053,001304,NYU Langone Hospital-Brooklyn,70 or Older,112,F,White,Not Span/Hispanic,4,Emergency,Home w/ Home Health Services,2019,CIR020,CEREBRAL INFARCTION,IMG007,COMPUTERIZED TOMOGRAPHY (CT) WITHOUT CONTRAST,045,CVA & PRECEREBRAL OCCLUSION W INFARCT,01,DISEASES AND DISORDERS OF THE NERVOUS SYSTEM,3,Major,Major,Medical,Medicare,Medicare,,,,true,97272.54,35150.92
New York City,Kings,7002053,001304,NYU Langone Hospital-Brooklyn,70 or Older,112,F,White,Not Span/Hispanic,11,Emergency,Skilled Nursing Home,2019,CIR020,CEREBRAL INFARCTION,GIS017,GASTROSTOMY,045,CVA & PRECEREBRAL OCCLUSION W INFARCT,01,DISEASES AND DISORDERS OF THE NERVOUS SYSTEM,3,Major,Moderate,Medical,Private Health Insurance,Medicaid,,,,true,230772.42,85407.76
New York City,Kings,7002053,001304,NYU Langone Hospital-Brooklyn,50 to 69,112,F,Other Race,Not Span/Hispanic,6,Emergency,Home or Self Care,2019,CIR020,CEREBRAL INFARCTION,ADM005,ADMINISTRATION OF THROMBOLYTICS AND PLATELET INHIBITORS,045,CVA & PRECEREBRAL OCCLUSION W INFARCT,01,DISEASES AND DISORDERS OF THE NERVOUS SYSTEM,2,Moderate,Moderate,Medical,Medicare,Medicaid,,,,true,159638.95,28609.33
New York City,Kings,7002053,001304,NYU Langone Hospital-Brooklyn,50 to 69,114,M,Other Race,Not Span/Hispanic,7,Emergency,Inpatient Rehabilitation Facility,2019,CIR020,CEREBRAL INFARCTION,ADM021,"ADMINISTRATION OF THERAPEUTIC SUBSTANCES, NEC",045,CVA & PRECEREBRAL OCCLUSION W INFARCT,01,DISEASES AND DISORDERS OF THE NERVOUS SYSTEM,2,Moderate,Moderate,Medical,Private Health Insurance,,,,,true,128087.75,47693.12
New York City,Kings,7002053,001304,NYU Langone Hospital-Brooklyn,50 to 69,112,M,White,Not Span/Hispanic,2,Emergency,Home or Self Care,2019,CIR020,CEREBRAL INFARCTION,,,045,CVA & PRECEREBRAL OCCLUSION W INFARCT,01,DISEASES AND DISORDERS OF THE NERVOUS SYSTEM,2,Moderate,Minor,Medical,Blue Cross/Blue Shield,,,,,true,66235.42,19692.35
New York City,Kings,7002053,001304,NYU Langone Hospital-Brooklyn,18 to 29,103,F,Other Race,Not Span/Hispanic,7,Emergency,Home or Self Care,2019,CIR020,CEREBRAL INFARCTION,,,045,CVA & PRECEREBRAL OCCLUSION W INFARCT,01,DISEASES AND DISORDERS OF THE NERVOUS SYSTEM,3,Major,Major,Medical,Medicaid,,,,,false,131770.74,49542.37
New York City,Kings,7002053,001304,NYU Langone Hospital-Brooklyn,50 to 69,112,M,White,Not Span/Hispanic,7,Emergency,Inpatient Rehabilitation Facility,2019,CIR020,CEREBRAL INFARCTION,,,045,CVA & PRECEREBRAL OCCLUSION W INFARCT,01,DISEASES AND DISORDERS OF THE NERVOUS SYSTEM,3,Major,Moderate,Medical,Medicaid,,,,,true,114478.51,29990.35
New York City,Kings,7002053,001304,NYU Langone Hospital-Brooklyn,70 or Older,112,M,Other Race,Not Span/Hispanic,2,Emergency,Home or Self Care,2019,CIR020,CEREBRAL INFARCTION,,,045,CVA & PRECEREBRAL OCCLUSION W INFARCT,01,DISEASES AND DISORDERS OF THE NERVOUS SYSTEM,3,Major,Major,Medical,Medicare,Medicaid,,,,true,64033.82,19124.6
New York City,Kings,7002053,001304,NYU Langone Hospital-Brooklyn,50 to 69,112,F,White,Spanish/Hispanic,3,Emergency,Home or Self Care,2019,CIR020,CEREBRAL INFARCTION,,,045,CVA & PRECEREBRAL OCCLUSION W INFARCT,01,DISEASES AND DISORDERS OF THE NERVOUS SYSTEM,1,Minor,Minor,Medical,Blue Cross/Blue Shield,Private Health Insurance,,,,true,56990.48,14862.28
New York City,Kings,7002053,001304,NYU Langone Hospital-Brooklyn,50 to 69,103,F,Other Race,Not Span/Hispanic,3,Emergency,Home or Self Care,2019,CIR020,CEREBRAL INFARCTION,ADM005,ADMINISTRATION OF THROMBOLYTICS AND PLATELET INHIBITORS,045,CVA & PRECEREBRAL OCCLUSION W INFARCT,01,DISEASES AND DISORDERS OF THE NERVOUS SYSTEM,2,Moderate,Minor,Medical,Medicaid,,,,,true,157180.77,29119.35
New York City,Kings,7002053,001304,NYU Langone Hospital-Brooklyn,50 to 69,112,M,Other Race,Not Span/Hispanic,4,Emergency,Inpatient Rehabilitation Facility,2019,CIR020,CEREBRAL INFARCTION,,,045,CVA & PRECEREBRAL OCCLUSION W INFARCT,01,DISEASES AND DISORDERS OF THE NERVOUS SYSTEM,2,Moderate,Minor,Medical,Blue Cross/Blue Shield,Medicare,,,,true,86240.37,26462.66
New York City,Kings,7002053,001304,NYU Langone Hospital-Brooklyn,70 or Older,112,F,White,Not Span/Hispanic,7,Emergency,Inpatient Rehabilitation Facility,2019,CIR020,CEREBRAL INFARCTION,MAM011,ELECTROENCEPHALOGRAM (EEG),045,CVA & PRECEREBRAL OCCLUSION W INFARCT,01,DISEASES AND DISORDERS OF THE NERVOUS SYSTEM,4,Extreme,Extreme,Medical,Medicare,Private Health Insurance,,,,true,159009.33,46035.7
New York City,Kings,7002053,001304,NYU Langone Hospital-Brooklyn,70 or Older,112,M,White,Not Span/Hispanic,24,Emergency,Skilled Nursing Home,2019,CIR020,CEREBRAL INFARCTION,ADM005,ADMINISTRATION OF THROMBOLYTICS AND PLATELET INHIBITORS,045,CVA & PRECEREBRAL OCCLUSION W INFARCT,01,DISEASES AND DISORDERS OF THE NERVOUS SYSTEM,4,Extreme,Extreme,Medical,Medicare,Medicaid,,,,true,513179.15,187840.78
New York City,Kings,7002053,001304,NYU Langone Hospital-Brooklyn,50 to 69,112,F,White,Not Span/Hispanic,1,Emergency,Home or Self Care,2019,CIR020,CEREBRAL INFARCTION,,,045,CVA & PRECEREBRAL OCCLUSION W INFARCT,01,DISEASES AND DISORDERS OF THE NERVOUS SYSTEM,1,Minor,Minor,Medical,Private Health Insurance,Medicare,,,,true,46662.22,11812.59
New York City,Kings,7002053,001304,NYU Langone Hospital-Brooklyn,50 to 69,112,M,Other Race,Not Span/Hispanic,6,Emergency,Inpatient Rehabilitation Facility,2019,CIR020,CEREBRAL INFARCTION,ADM005,ADMINISTRATION OF THROMBOLYTICS AND PLATELET INHIBITORS,045,CVA & PRECEREBRAL OCCLUSION W INFARCT,01,DISEASES AND DISORDERS OF THE NERVOUS SYSTEM,4,Extreme,Extreme,Medical,Private Health Insurance,,,,,true,203425.71,51760.09
New York City,Kings,7002053,001304,NYU Langone Hospital-Brooklyn,70 or Older,112,M,Other Race,Spanish/Hispanic,6,Emergency,Inpatient Rehabilitation Facility,2019,CIR020,CEREBRAL INFARCTION,IMG002,FLUOROSCOPIC ANGIOGRAPHY (EXCLUDING CORONARY),045,CVA & PRECEREBRAL OCCLUSION W INFARCT,01,DISEASES AND DISORDERS OF THE NERVOUS SYSTEM,3,Major,Major,Medical,Medicare,Blue Cross/Blue Shield,,,,true,153049.48,53038.76
New York City,Kings,7002053,001304,NYU Langone Hospital-Brooklyn,50 to 69,112,M,White,Not Span/Hispanic,11,Emergency,Skilled Nursing Home,2019,CIR020,CEREBRAL INFARCTION,,,045,CVA & PRECEREBRAL OCCLUSION W INFARCT,01,DISEASES AND DISORDERS OF THE NERVOUS SYSTEM,4,Extreme,Extreme,Medical,Private Health Insurance,,,,,false,218449.01,86753.58
New York City,Kings,7002053,001304,NYU Langone Hospital-Brooklyn,50 to 69,112,F,Black/African American,Not Span/Hispanic,3,Emergency,Home w/ Home Health Services,2019,CIR020,CEREBRAL INFARCTION,,,045,CVA & PRECEREBRAL OCCLUSION W INFARCT,01,DISEASES AND DISORDERS OF THE NERVOUS SYSTEM,2,Moderate,Moderate,Medical,Private Health Insurance,,,,,true,84240.02,23932.97
New York City,Kings,7002053,001304,NYU Langone Hospital-Brooklyn,50 to 69,112,M,Black/African American,Not Span/Hispanic,9,Emergency,Skilled Nursing Home,2019,CIR020,CEREBRAL INFARCTION,,,045,CVA & PRECEREBRAL OCCLUSION W INFARCT,01,DISEASES AND DISORDERS OF THE NERVOUS SYSTEM,3,Major,Major,Medical,Medicaid,,,,,true,94460.7,34596.5
New York City,Kings,7002053,001304,NYU Langone Hospital-Brooklyn,70 or Older,112,M,White,Not Span/Hispanic,1,Emergency,Home or Self Care,2019,CIR020,CEREBRAL INFARCTION,,,045,CVA & PRECEREBRAL OCCLUSION W INFARCT,01,DISEASES AND DISORDERS OF THE NERVOUS SYSTEM,2,Moderate,Moderate,Medical,Medicare,Blue Cross/Blue Shield,,,,true,42366.16,7816.63
New York City,Kings,7002053,001304,NYU Langone Hospital-Brooklyn,50 to 69,112,F,White,Unknown,2,Emergency,Home or Self Care,2019,CIR020,CEREBRAL INFARCTION,ADM021,"ADMINISTRATION OF THERAPEUTIC SUBSTANCES, NEC",045,CVA & PRECEREBRAL OCCLUSION W INFARCT,01,DISEASES AND DISORDERS OF THE NERVOUS SYSTEM,1,Minor,Minor,Medical,Blue Cross/Blue Shield,Medicare,,,,true,64278.14,17753.32
New York City,Kings,7002053,001304,NYU Langone Hospital-Brooklyn,70 or Older,112,F,White,Not Span/Hispanic,3,Emergency,Home w/ Home Health Services,2019,CIR020,CEREBRAL INFARCTION,IMG005,MAGNETIC RESONANCE IMAGING (MRI),045,CVA & PRECEREBRAL OCCLUSION W INFARCT,01,DISEASES AND DISORDERS OF THE NERVOUS SYSTEM,2,Moderate,Minor,Medical,Medicare,Blue Cross/Blue Shield,,,,true,77603.94,23043.09
New York City,Kings,7002053,001304,NYU Langone Hospital-Brooklyn,50 to 69,112,M,Other Race,Unknown,5,Emergency,Home or Self Care,2019,CIR020,CEREBRAL INFARCTION,IMG005,MAGNETIC RESONANCE IMAGING (MRI),045,CVA & PRECEREBRAL OCCLUSION W INFARCT,01,DISEASES AND DISORDERS OF THE NERVOUS SYSTEM,2,Moderate,Moderate,Medical,Medicaid,,,,,true,136103.78,35339.3
New York City,Kings,7002053,001304,NYU Langone Hospital-Brooklyn,70 or Older,112,F,Other Race,Unknown,2,Emergency,Home or Self Care,2019,CIR020,CEREBRAL INFARCTION,,,045,CVA & PRECEREBRAL OCCLUSION W INFARCT,01,DISEASES AND DISORDERS OF THE NERVOUS SYSTEM,2,Moderate,Minor,Medical,Medicare,Federal/State/Local/VA,,,,true,69453.68,14247.76
New York City,Kings,7002053,001304,NYU Langone Hospital-Brooklyn,70 or Older,112,F,Other Race,Not Span/Hispanic,4,Emergency,Home or Self Care,2019,CIR020,CEREBRAL INFARCTION,IMG007,COMPUTERIZED TOMOGRAPHY (CT) WITHOUT CONTRAST,045,CVA & PRECEREBRAL OCCLUSION W INFARCT,01,DISEASES AND DISORDERS OF THE NERVOUS SYSTEM,3,Major,Moderate,Medical,Medicaid,,,,,true,79064.42,18491.26
New York City,Kings,7002053,001304,NYU Langone Hospital-Brooklyn,50 to 69,112,M,Other Race,Not Span/Hispanic,2,Emergency,Home or Self Care,2019,CIR020,CEREBRAL INFARCTION,,,045,CVA & PRECEREBRAL OCCLUSION W INFARCT,01,DISEASES AND DISORDERS OF THE NERVOUS SYSTEM,2,Moderate,Minor,Medical,Medicaid,,,,,true,67196.91,19769.36
New York City,Kings,7002053,001304,NYU Langone Hospital-Brooklyn,50 to 69,112,M,White,Unknown,7,Emergency,Inpatient Rehabilitation Facility,2019,CIR020,CEREBRAL INFARCTION,,,045,CVA & PRECEREBRAL OCCLUSION W INFARCT,01,DISEASES AND DISORDERS OF THE NERVOUS SYSTEM,2,Moderate,Minor,Medical,Medicaid,,,,,true,115831.96,43390.61
New York City,Kings,7002053,001304,NYU Langone Hospital-Brooklyn,70 or Older,112,F,Other Race,Not Span/Hispanic,6,Emergency,Skilled Nursing Home,2019,CIR020,CEREBRAL INFARCTION,ESA004,NON-INVASIVE VENTILATION,045,CVA & PRECEREBRAL OCCLUSION W INFARCT,01,DISEASES AND DISORDERS OF THE NERVOUS SYSTEM,4,Extreme,Extreme,Medical,Medicare,Private Health Insurance,,,,true,132808.21,50679.88
New York City,Kings,7002053,001304,NYU Langone Hospital-Brooklyn,70 or Older,112,M,Other Race,Not Span/Hispanic,5,Emergency,Inpatient Rehabilitation Facility,2019,CIR020,CEREBRAL INFARCTION,IMG004,FLUOROSCOPY OF NON-CIRCULATORY ORGANS,045,CVA & PRECEREBRAL OCCLUSION W INFARCT,01,DISEASES AND DISORDERS OF THE NERVOUS SYSTEM,2,Moderate,Moderate,Medical,Medicare,,,,,true,114079.46,36256.06
New York City,Kings,7002053,001304,NYU Langone Hospital-Brooklyn,50 to 69,112,F,White,Not Span/Hispanic,1,Emergency,Home or Self Care,2019,CIR020,CEREBRAL INFARCTION,IMG008,ULTRASONOGRAPHY,045,CVA & PRECEREBRAL OCCLUSION W INFARCT,01,DISEASES AND DISORDERS OF THE NERVOUS SYSTEM,2,Moderate,Minor,Medical,Blue Cross/Blue Shield,,,,,true,49696.2,10542.37
New York City,Kings,7002053,001304,NYU Langone Hospital-Brooklyn,50 to 69,114,M,Black/African American,Unknown,1,Emergency,Home or Self Care,2019,CIR020,CEREBRAL INFARCTION,IMG008,ULTRASONOGRAPHY,045,CVA & PRECEREBRAL OCCLUSION W INFARCT,01,DISEASES AND DISORDERS OF THE NERVOUS SYSTEM,3,Major,Moderate,Medical,Medicaid,,,,,false,44432.98,11284.89
New York City,Kings,7002053,001304,NYU Langone Hospital-Brooklyn,70 or Older,112,M,White,Unknown,15,Emergency,Skilled Nursing Home,2019,CIR020,CEREBRAL INFARCTION,ADM017,ADMINISTRATION OF NUTRITIONAL AND ELECTROLYTIC SUBSTANCES,045,CVA & PRECEREBRAL OCCLUSION W INFARCT,01,DISEASES AND DISORDERS OF THE NERVOUS SYSTEM,3,Major,Major,Medical,Medicare,,,,,true,266986.96,115752.75
New York City,Kings,7002053,001304,NYU Langone Hospital-Brooklyn,70 or Older,114,F,White,Not Span/Hispanic,7,Emergency,Skilled Nursing Home,2019,CIR020,CEREBRAL INFARCTION,,,045,CVA & PRECEREBRAL OCCLUSION W INFARCT,01,DISEASES AND DISORDERS OF THE NERVOUS SYSTEM,3,Major,Moderate,Medical,Medicare,Medicaid,,,,true,144330.74,52631.46
New York City,Kings,7002053,001304,NYU Langone Hospital-Brooklyn,70 or Older,112,F,Other Race,Not Span/Hispanic,5,Emergency,Home w/ Home Health Services,2019,CIR020,CEREBRAL INFARCTION,CNS002,LUMBAR PUNCTURE,045,CVA & PRECEREBRAL OCCLUSION W INFARCT,01,DISEASES AND DISORDERS OF THE NERVOUS SYSTEM,3,Major,Major,Medical,Medicare,Medicaid,,,,true,93551.8,22394.9
New York City,Kings,7002053,001304,NYU Langone Hospital-Brooklyn,50 to 69,112,M,White,Not Span/Hispanic,13,Emergency,Skilled Nursing Home,2019,CIR020,CEREBRAL INFARCTION,MST028,"SUBCUTANEOUS TISSUE AND FASCIA PROCEDURES, NEC",045,CVA & PRECEREBRAL OCCLUSION W INFARCT,01,DISEASES AND DISORDERS OF THE NERVOUS SYSTEM,3,Major,Major,Medical,Private Health Insurance,Medicaid,,,,true,285690.89,60107.64
New York City,Kings,7002053,001304,NYU Langone Hospital-Brooklyn,70 or Older,112,F,White,Not Span/Hispanic,1,Emergency,Home w/ Home Health Services,2019,CIR020,CEREBRAL INFARCTION,IMG005,MAGNETIC RESONANCE IMAGING (MRI),045,CVA & PRECEREBRAL OCCLUSION W INFARCT,01,DISEASES AND DISORDERS OF THE NERVOUS SYSTEM,3,Major,Major,Medical,Medicare,Medicare,,,,true,48837.13,10376.81
New York City,Kings,7002053,001304,NYU Langone Hospital-Brooklyn,70 or Older,112,F,White,Not Span/Hispanic,3,Emergency,Skilled Nursing Home,2019,CIR020,CEREBRAL INFARCTION,ADM005,ADMINISTRATION OF THROMBOLYTICS AND PLATELET INHIBITORS,045,CVA & PRECEREBRAL OCCLUSION W INFARCT,01,DISEASES AND DISORDERS OF THE NERVOUS SYSTEM,2,Moderate,Moderate,Medical,Medicare,,,,,true,140137.43,29378.52
New York City,Kings,7002053,001304,NYU Langone Hospital-Brooklyn,50 to 69,113,M,Other Race,Not Span/Hispanic,17,Emergency,Skilled Nursing Home,2019,CIR020,CEREBRAL INFARCTION,IMG002,FLUOROSCOPIC ANGIOGRAPHY (EXCLUDING CORONARY),045,CVA & PRECEREBRAL OCCLUSION W INFARCT,01,DISEASES AND DISORDERS OF THE NERVOUS SYSTEM,3,Major,Moderate,Medical,Medicare,Medicaid,,,,true,284350.51,106640.55
New York City,Kings,7002053,001304,NYU Langone Hospital-Brooklyn,70 or Older,OOS,F,Other Race,Unknown,3,Emergency,Hospice - Home,2019,CIR020,CEREBRAL INFARCTION,,,045,CVA & PRECEREBRAL OCCLUSION W INFARCT,01,DISEASES AND DISORDERS OF THE NERVOUS SYSTEM,3,Major,Moderate,Medical,Medicare,,,,,true,47784.69,19579.5
New York City,Kings,7002053,001304,NYU Langone Hospital-Brooklyn,70 or Older,112,F,Other Race,Not Span/Hispanic,4,Emergency,Home w/ Home Health Services,2019,CIR020,CEREBRAL INFARCTION,IMG006,COMPUTERIZED TOMOGRAPHY (CT) WITH CONTRAST,045,CVA & PRECEREBRAL OCCLUSION W INFARCT,01,DISEASES AND DISORDERS OF THE NERVOUS SYSTEM,4,Extreme,Extreme,Medical,Medicare,Medicaid,,,,true,75434.77,28915.84
New York City,Kings,7002053,001304,NYU Langone Hospital-Brooklyn,30 to 49,OOS,M,Black/African American,Not Span/Hispanic,1,Emergency,Home or Self Care,2019,CIR020,CEREBRAL INFARCTION,,,045,CVA & PRECEREBRAL OCCLUSION W INFARCT,01,DISEASES AND DISORDERS OF THE NERVOUS SYSTEM,2,Moderate,Moderate,Medical,Blue Cross/Blue Shield,,,,,true,49999.61,12230.02
New York City,Kings,7002053,001304,NYU Langone Hospital-Brooklyn,70 or Older,112,F,White,Not Span/Hispanic,3,Emergency,Skilled Nursing Home,2019,CIR020,CEREBRAL INFARCTION,MAM011,ELECTROENCEPHALOGRAM (EEG),045,CVA & PRECEREBRAL OCCLUSION W INFARCT,01,DISEASES AND DISORDERS OF THE NERVOUS SYSTEM,2,Moderate,Major,Medical,Medicare,Medicaid,,,,true,112349.74,27902.28
New York City,Kings,7002053,001304,NYU Langone Hospital-Brooklyn,70 or Older,112,M,White,Not Span/Hispanic,2,Emergency,Home or Self Care,2019,CIR020,CEREBRAL INFARCTION,ADM005,ADMINISTRATION OF THROMBOLYTICS AND PLATELET INHIBITORS,045,CVA & PRECEREBRAL OCCLUSION W INFARCT,01,DISEASES AND DISORDERS OF THE NERVOUS SYSTEM,2,Moderate,Moderate,Medical,Medicare,Medicaid,,,,true,146695.55,22665.07
New York City,Kings,7002053,001304,NYU Langone Hospital-Brooklyn,50 to 69,112,F,Other Race,Unknown,2,Emergency,Home or Self Care,2019,CIR020,CEREBRAL INFARCTION,IMG007,COMPUTERIZED TOMOGRAPHY (CT) WITHOUT CONTRAST,045,CVA & PRECEREBRAL OCCLUSION W INFARCT,01,DISEASES AND DISORDERS OF THE NERVOUS SYSTEM,2,Moderate,Minor,Medical,Medicaid,,,,,true,68911.13,20061.45
New York City,Kings,7002053,001304,NYU Langone Hospital-Brooklyn,70 or Older,112,F,White,Not Span/Hispanic,7,Emergency,Inpatient Rehabilitation Facility,2019,CIR020,CEREBRAL INFARCTION,IMG002,FLUOROSCOPIC ANGIOGRAPHY (EXCLUDING CORONARY),045,CVA & PRECEREBRAL OCCLUSION W INFARCT,01,DISEASES AND DISORDERS OF THE NERVOUS SYSTEM,4,Extreme,Extreme,Medical,Medicare,,,,,true,209426.32,59468.04
New York City,Kings,7002053,001304,NYU Langone Hospital-Brooklyn,70 or Older,100,M,White,Not Span/Hispanic,1,Emergency,Home or Self Care,2019,CIR020,CEREBRAL INFARCTION,ADM005,ADMINISTRATION OF THROMBOLYTICS AND PLATELET INHIBITORS,045,CVA & PRECEREBRAL OCCLUSION W INFARCT,01,DISEASES AND DISORDERS OF THE NERVOUS SYSTEM,2,Moderate,Minor,Medical,Medicare,Blue Cross/Blue Shield,,,,true,124504.61,14865.72
New York City,Kings,7002053,001304,NYU Langone Hospital-Brooklyn,50 to 69,112,F,Other Race,Not Span/Hispanic,2,Emergency,Home or Self Care,2019,CIR020,CEREBRAL INFARCTION,IMG005,MAGNETIC RESONANCE IMAGING (MRI),045,CVA & PRECEREBRAL OCCLUSION W INFARCT,01,DISEASES AND DISORDERS OF THE NERVOUS SYSTEM,1,Minor,Minor,Medical,Private Health Insurance,,,,,true,67582.55,19688.86