Hospital Service Area,Hospital County,Operating Certificate Number,Permanent Facility Id,Facility Name,Age Group,Zip Code - 3 digits,Gender,Race,Ethnicity,Length of Stay,Type of Admission,Patient Disposition,Discharge Year,CCS Diagnosis Code,CCS Diagnosis Description,CCS Procedure Code,CCS Procedure Description,APR DRG Code,APR DRG Description,APR MDC Code,APR MDC Description,APR Severity of Illness Code,APR Severity of Illness Description,APR Risk of Mortality,APR Medical Surgical Description,Payment Typology 1,Payment Typology 2,Payment Typology 3,Birth Weight,Abortion Edit Indicator,Emergency Department Indicator,Total Charges,Total Costs
New York City,Kings,7002053,001304,NYU Langone Hospital-Brooklyn,50 to 69,112,M,Other Race,Spanish/Hispanic,1,Elective,Home w/ Home Health Services,2019,NEO043,URINARY SYSTEM CANCERS - BLADDER,URN001,CYSTOSCOPY AND URETEROSCOPY (INCLUDING BIOPSY),461,KIDNEY & URINARY TRACT MALIGNANCY,11,DISEASES AND DISORDERS OF THE KIDNEY AND URINARY TRACT,2,Moderate,Minor,Medical,Private Health Insurance,Medicaid,,,,false,71674.46,9765.47
New York City,Kings,7002053,001304,NYU Langone Hospital-Brooklyn,50 to 69,112,M,White,Not Span/Hispanic,1,Elective,Home or Self Care,2019,NEO043,URINARY SYSTEM CANCERS - BLADDER,URN001,CYSTOSCOPY AND URETEROSCOPY (INCLUDING BIOPSY),461,KIDNEY & URINARY TRACT MALIGNANCY,11,DISEASES AND DISORDERS OF THE KIDNEY AND URINARY TRACT,1,Minor,Minor,Medical,Blue Cross/Blue Shield,,,,,false,39851.95,7963.72
New York City,Kings,7002053,001304,NYU Langone Hospital-Brooklyn,70 or Older,112,F,Other Race,Not Span/Hispanic,26,Emergency,Hospice - Home,2019,NEO070,SECONDARY MALIGNANCIES,URN001,CYSTOSCOPY AND URETEROSCOPY (INCLUDING BIOPSY),461,KIDNEY & URINARY TRACT MALIGNANCY,11,DISEASES AND DISORDERS OF THE KIDNEY AND URINARY TRACT,3,Major,Major,Medical,Medicare,Medicaid,,,,true,381960.51,121890.96
New York City,Kings,7002053,001304,NYU Langone Hospital-Brooklyn,70 or Older,112,F,White,Not Span/Hispanic,13,Emergency,Skilled Nursing Home,2019,NEO043,URINARY SYSTEM CANCERS - BLADDER,URN001,CYSTOSCOPY AND URETEROSCOPY (INCLUDING BIOPSY),461,KIDNEY & URINARY TRACT MALIGNANCY,11,DISEASES AND DISORDERS OF THE KIDNEY AND URINARY TRACT,3,Major,Major,Medical,Medicare,Medicaid,,,,true,167528.21,52016.27
New York City,Kings,7002053,001304,NYU Langone Hospital-Brooklyn,70 or Older,100,F,Other Race,Not Span/Hispanic,4,Emergency,Hospice - Home,2019,NEO045,URINARY SYSTEM CANCERS - KIDNEY,,,461,KIDNEY & URINARY TRACT MALIGNANCY,11,DISEASES AND DISORDERS OF THE KIDNEY AND URINARY TRACT,4,Extreme,Major,Medical,Medicare,,,,,true,52682.14,14609.66
New York City,Kings,7002053,001304,NYU Langone Hospital-Brooklyn,50 to 69,112,M,White,Not Span/Hispanic,1,Emergency,Home or Self Care,2019,NEO045,URINARY SYSTEM CANCERS - KIDNEY,,,461,KIDNEY & URINARY TRACT MALIGNANCY,11,DISEASES AND DISORDERS OF THE KIDNEY AND URINARY TRACT,2,Moderate,Minor,Medical,Blue Cross/Blue Shield,,,,,true,59843.41,13265.19
New York City,Kings,7002053,001304,NYU Langone Hospital-Brooklyn,70 or Older,112,F,White,Not Span/Hispanic,2,Emergency,Home w/ Home Health Services,2019,NEO044,URINARY SYSTEM CANCERS - URETER AND RENAL PELVIS,,,461,KIDNEY & URINARY TRACT MALIGNANCY,11,DISEASES AND DISORDERS OF THE KIDNEY AND URINARY TRACT,2,Moderate,Moderate,Medical,Blue Cross/Blue Shield,,,,,true,37262.1,10307.91
New York City,Kings,7002053,001304,NYU Langone Hospital-Brooklyn,70 or Older,112,F,White,Not Span/Hispanic,5,Emergency,Home w/ Home Health Services,2019,NEO045,URINARY SYSTEM CANCERS - KIDNEY,ADM015,ADMINISTRATION OF ANTIBIOTICS,461,KIDNEY & URINARY TRACT MALIGNANCY,11,DISEASES AND DISORDERS OF THE KIDNEY AND URINARY TRACT,3,Major,Major,Medical,Medicare,Medicaid,,,,true,56905.61,19665.86
New York City,Kings,7002053,001304,NYU Langone Hospital-Brooklyn,70 or Older,112,M,Other Race,Spanish/Hispanic,2,Emergency,Home or Self Care,2019,NEO045,URINARY SYSTEM CANCERS - KIDNEY,,,461,KIDNEY & URINARY TRACT MALIGNANCY,11,DISEASES AND DISORDERS OF THE KIDNEY AND URINARY TRACT,3,Major,Major,Medical,Medicare,,,,,true,33417.22,9691.23
New York City,Kings,7002053,001304,NYU Langone Hospital-Brooklyn,50 to 69,112,F,White,Not Span/Hispanic,18,Emergency,Expired,2019,NEO045,URINARY SYSTEM CANCERS - KIDNEY,RES005,CHEST TUBE PLACEMENT AND THERAPEUTIC THORACENTESIS,461,KIDNEY & URINARY TRACT MALIGNANCY,11,DISEASES AND DISORDERS OF THE KIDNEY AND URINARY TRACT,4,Extreme,Extreme,Medical,Medicaid,,,,,true,226649.6,62478.48
