Hospital Service Area,Hospital County,Operating Certificate Number,Permanent Facility Id,Facility Name,Age Group,Zip Code - 3 digits,Gender,Race,Ethnicity,Length of Stay,Type of Admission,Patient Disposition,Discharge Year,CCS Diagnosis Code,CCS Diagnosis Description,CCS Procedure Code,CCS Procedure Description,APR DRG Code,APR DRG Description,APR MDC Code,APR MDC Description,APR Severity of Illness Code,APR Severity of Illness Description,APR Risk of Mortality,APR Medical Surgical Description,Payment Typology 1,Payment Typology 2,Payment Typology 3,Birth Weight,Abortion Edit Indicator,Emergency Department Indicator,Total Charges,Total Costs
Long Island,Nassau,2908000,000511,NYU Langone Hospital-Long Island,70 or Older,110,F,Other Race,Not Span/Hispanic,1,Emergency,Home or Self Care,2020,NEO043,URINARY SYSTEM CANCERS - BLADDER,,,461,KIDNEY & URINARY TRACT MALIGNANCY,11,DISEASES AND DISORDERS OF THE KIDNEY AND URINARY TRACT,2,Moderate,Major,Medical,Medicare,Medicaid,,,,Y,37738.23,11051
Long Island,Nassau,2908000,000511,NYU Langone Hospital-Long Island,50 to 69,110,M,White,Not Span/Hispanic,1,Elective,Home or Self Care,2020,NEO070,SECONDARY MALIGNANCIES,URN002,KIDNEY AND OTHER URINARY TRACT BIOPSY (NON-ENDOSCOPIC),461,KIDNEY & URINARY TRACT MALIGNANCY,11,DISEASES AND DISORDERS OF THE KIDNEY AND URINARY TRACT,1,Minor,Moderate,Medical,Blue Cross/Blue Shield,,,,,N,156915.96,23338.59
Long Island,Nassau,2908000,000511,NYU Langone Hospital-Long Island,70 or Older,117,M,White,Not Span/Hispanic,1,Elective,Home or Self Care,2020,NEO043,URINARY SYSTEM CANCERS - BLADDER,GIS003,GI SYSTEM BIOPSY (NON-ENDOSCOPIC),461,KIDNEY & URINARY TRACT MALIGNANCY,11,DISEASES AND DISORDERS OF THE KIDNEY AND URINARY TRACT,2,Moderate,Moderate,Medical,Medicare,,,,,N,96143.75,14939.59
Long Island,Nassau,2908000,000511,NYU Langone Hospital-Long Island,70 or Older,117,M,White,Not Span/Hispanic,2,Elective,Home or Self Care,2020,NEO045,URINARY SYSTEM CANCERS - KIDNEY,URN002,KIDNEY AND OTHER URINARY TRACT BIOPSY (NON-ENDOSCOPIC),461,KIDNEY & URINARY TRACT MALIGNANCY,11,DISEASES AND DISORDERS OF THE KIDNEY AND URINARY TRACT,1,Minor,Minor,Medical,Medicare,Medicare,,,,N,180182.49,28909.92
Long Island,Nassau,2908000,000511,NYU Langone Hospital-Long Island,50 to 69,115,F,Black/African American,Not Span/Hispanic,3,Emergency,Home or Self Care,2020,NEO043,URINARY SYSTEM CANCERS - BLADDER,ADM001,TRANSFUSION OF BLOOD AND BLOOD PRODUCTS,461,KIDNEY & URINARY TRACT MALIGNANCY,11,DISEASES AND DISORDERS OF THE KIDNEY AND URINARY TRACT,2,Moderate,Moderate,Medical,Medicare,,,,,Y,64309.38,13971.11
Long Island,Nassau,2908000,000511,NYU Langone Hospital-Long Island,70 or Older,115,M,White,Not Span/Hispanic,9,Emergency,Home w/ Home Health Services,2020,NEO043,URINARY SYSTEM CANCERS - BLADDER,,,461,KIDNEY & URINARY TRACT MALIGNANCY,11,DISEASES AND DISORDERS OF THE KIDNEY AND URINARY TRACT,3,Major,Major,Medical,Medicare,,,,,Y,126540.01,45033.9
Long Island,Nassau,2908000,000511,NYU Langone Hospital-Long Island,50 to 69,114,M,Black/African American,Not Span/Hispanic,4,Emergency,Home or Self Care,2020,NEO043,URINARY SYSTEM CANCERS - BLADDER,MST001,ARTHROCENTESIS,461,KIDNEY & URINARY TRACT MALIGNANCY,11,DISEASES AND DISORDERS OF THE KIDNEY AND URINARY TRACT,2,Moderate,Moderate,Medical,Private Health Insurance,Medicare,,,,Y,56767.07,20299.93
Long Island,Nassau,2908000,000511,NYU Langone Hospital-Long Island,0 to 17,115,M,Black/African American,Not Span/Hispanic,15,Emergency,Home or Self Care,2020,NEO045,URINARY SYSTEM CANCERS - KIDNEY,HEP001,LIVER BIOPSY,461,KIDNEY & URINARY TRACT MALIGNANCY,11,DISEASES AND DISORDERS OF THE KIDNEY AND URINARY TRACT,3,Major,Moderate,Medical,Medicare,,,,,Y,293881.03,72816.32
Long Island,Nassau,2908000,000511,NYU Langone Hospital-Long Island,50 to 69,117,F,Black/African American,Not Span/Hispanic,5,Emergency,Hospice - Medical Facility,2020,NEO043,URINARY SYSTEM CANCERS - BLADDER,GIS007,GI SYSTEM DRAINAGE (EXCLUDING PARACENTESIS),461,KIDNEY & URINARY TRACT MALIGNANCY,11,DISEASES AND DISORDERS OF THE KIDNEY AND URINARY TRACT,3,Major,Major,Medical,Medicare,Medicaid,,,,Y,73513.41,25110.44
Long Island,Nassau,2908000,000511,NYU Langone Hospital-Long Island,50 to 69,114,M,Black/African American,Not Span/Hispanic,3,Emergency,Home or Self Care,2020,NEO045,URINARY SYSTEM CANCERS - KIDNEY,,,461,KIDNEY & URINARY TRACT MALIGNANCY,11,DISEASES AND DISORDERS OF THE KIDNEY AND URINARY TRACT,2,Moderate,Moderate,Medical,Medicaid,,,,,Y,68887.78,17585.71
Long Island,Nassau,2908000,000511,NYU Langone Hospital-Long Island,70 or Older,115,F,White,Not Span/Hispanic,14,Emergency,Skilled Nursing Home,2020,NEO043,URINARY SYSTEM CANCERS - BLADDER,ADM001,TRANSFUSION OF BLOOD AND BLOOD PRODUCTS,461,KIDNEY & URINARY TRACT MALIGNANCY,11,DISEASES AND DISORDERS OF THE KIDNEY AND URINARY TRACT,2,Moderate,Moderate,Medical,Medicare,Blue Cross/Blue Shield,,,,Y,200601.66,82954.1
Long Island,Nassau,2908000,000511,NYU Langone Hospital-Long Island,50 to 69,114,M,Black/African American,Not Span/Hispanic,18,Emergency,Home w/ Home Health Services,2020,NEO045,URINARY SYSTEM CANCERS - KIDNEY,GIS025,OTHER GI SYSTEM DEVICE PROCEDURES,461,KIDNEY & URINARY TRACT MALIGNANCY,11,DISEASES AND DISORDERS OF THE KIDNEY AND URINARY TRACT,2,Moderate,Minor,Medical,Medicaid,,,,,Y,275943.15,88361.5
Long Island,Nassau,2908000,000511,NYU Langone Hospital-Long Island,50 to 69,115,M,White,Spanish/Hispanic,1,Elective,Home or Self Care,2020,NEO045,URINARY SYSTEM CANCERS - KIDNEY,OTR001,ROBOTIC-ASSISTED PROCEDURES,461,KIDNEY & URINARY TRACT MALIGNANCY,11,DISEASES AND DISORDERS OF THE KIDNEY AND URINARY TRACT,2,Moderate,Minor,Medical,Blue Cross/Blue Shield,,,,,N,122549.13,19638.53
Long Island,Nassau,2908000,000511,NYU Langone Hospital-Long Island,70 or Older,115,M,White,Not Span/Hispanic,7,Emergency,Skilled Nursing Home,2020,NEO045,URINARY SYSTEM CANCERS - KIDNEY,ESA001,HEMODIALYSIS,461,KIDNEY & URINARY TRACT MALIGNANCY,11,DISEASES AND DISORDERS OF THE KIDNEY AND URINARY TRACT,3,Major,Extreme,Medical,Medicare,Medicare,,,,Y,158297.83,51671.24
Long Island,Nassau,2908000,000511,NYU Langone Hospital-Long Island,50 to 69,113,M,White,Not Span/Hispanic,1,Elective,Home or Self Care,2020,NEO045,URINARY SYSTEM CANCERS - KIDNEY,URN002,KIDNEY AND OTHER URINARY TRACT BIOPSY (NON-ENDOSCOPIC),461,KIDNEY & URINARY TRACT MALIGNANCY,11,DISEASES AND DISORDERS OF THE KIDNEY AND URINARY TRACT,2,Moderate,Moderate,Medical,Medicare,Blue Cross/Blue Shield,,,,N,153355.81,23035.28
Long Island,Nassau,2908000,000511,NYU Langone Hospital-Long Island,50 to 69,115,M,White,Not Span/Hispanic,12,Emergency,Home or Self Care,2020,NEO045,URINARY SYSTEM CANCERS - KIDNEY,ADM001,TRANSFUSION OF BLOOD AND BLOOD PRODUCTS,461,KIDNEY & URINARY TRACT MALIGNANCY,11,DISEASES AND DISORDERS OF THE KIDNEY AND URINARY TRACT,4,Extreme,Extreme,Medical,Medicare,,,,,Y,197646.65,75559.22
Long Island,Nassau,2908000,000511,NYU Langone Hospital-Long Island,70 or Older,118,F,White,Not Span/Hispanic,26,Emergency,Skilled Nursing Home,2020,NEO043,URINARY SYSTEM CANCERS - BLADDER,URN001,CYSTOSCOPY AND URETEROSCOPY (INCLUDING BIOPSY),461,KIDNEY & URINARY TRACT MALIGNANCY,11,DISEASES AND DISORDERS OF THE KIDNEY AND URINARY TRACT,3,Major,Major,Medical,Medicare,Medicare,,,,Y,476913.8,137547.29
