Hospital Service Area,Hospital County,Operating Certificate Number,Permanent Facility Id,Facility Name,Age Group,Zip Code - 3 digits,Gender,Race,Ethnicity,Length of Stay,Type of Admission,Patient Disposition,Discharge Year,CCS Diagnosis Code,CCS Diagnosis Description,CCS Procedure Code,CCS Procedure Description,APR DRG Code,APR DRG Description,APR MDC Code,APR MDC Description,APR Severity of Illness Code,APR Severity of Illness Description,APR Risk of Mortality,APR Medical Surgical Description,Payment Typology 1,Payment Typology 2,Payment Typology 3,Birth Weight,Abortion Edit Indicator,Emergency Department Indicator,Total Charges,Total Costs
New York City,Bronx,7000006,001169,Montefiore Medical Center - Henry & Lucy Moses Div,0 to 17,104,M,Other Race,Spanish/Hispanic,5,Emergency,Home or Self Care,2017,156,Nephritis; nephrosis; renal sclerosis,000,NO PROC,462,Nephritis & nephrosis,11,Diseases and Disorders of the Kidney and Urinary Tract,2,Moderate,Minor,Medical,Medicaid,,,,N,Y,52473.48,13831.76
New York City,Bronx,7000006,001169,Montefiore Medical Center - Henry & Lucy Moses Div,0 to 17,104,M,Black/African American,Not Span/Hispanic,3,Emergency,Home or Self Care,2017,156,Nephritis; nephrosis; renal sclerosis,000,NO PROC,462,Nephritis & nephrosis,11,Diseases and Disorders of the Kidney and Urinary Tract,2,Moderate,Minor,Medical,Medicaid,,,,N,N,27764.45,8171.01
New York City,Manhattan,7002024,001456,Mount Sinai Hospital,0 to 17,114,M,Black/African American,Not Span/Hispanic,1,Emergency,Home or Self Care,2017,156,Nephritis; nephrosis; renal sclerosis,000,NO PROC,462,Nephritis & nephrosis,11,Diseases and Disorders of the Kidney and Urinary Tract,3,Major,Moderate,Medical,Blue Cross/Blue Shield,Self-Pay,,,N,Y,17372.34,6140.38
Hudson Valley,Rockland,4329000,000779,Good Samaritan Hospital of Suffern,30 to 49,109,M,Black/African American,Not Span/Hispanic,4,Emergency,Home or Self Care,2017,156,Nephritis; nephrosis; renal sclerosis,000,NO PROC,462,Nephritis & nephrosis,11,Diseases and Disorders of the Kidney and Urinary Tract,3,Major,Major,Medical,Private Health Insurance,,,,N,Y,35213.39,8715.60
New York City,Manhattan,7002002,001439,Mount Sinai Beth Israel,50 to 69,112,M,Other Race,Not Span/Hispanic,4,Emergency,Home or Self Care,2017,156,Nephritis; nephrosis; renal sclerosis,193,DX ULTRASOUND HEART,462,Nephritis & nephrosis,11,Diseases and Disorders of the Kidney and Urinary Tract,3,Major,Moderate,Medical,Private Health Insurance,Self-Pay,,,N,Y,32241.27,11009.75
New York City,Manhattan,7002024,001456,Mount Sinai Hospital,30 to 49,104,F,Black/African American,Not Span/Hispanic,3,Emergency,Home or Self Care,2017,156,Nephritis; nephrosis; renal sclerosis,216,RESP INTUB/MECH VENTIL,462,Nephritis & nephrosis,11,Diseases and Disorders of the Kidney and Urinary Tract,3,Major,Major,Medical,"Managed Care, Unspecified",Medicaid,Self-Pay,,N,Y,35727.05,10883.32
New York City,Kings,7001037,001320,University Hospital of Brooklyn,0 to 17,112,M,Black/African American,Not Span/Hispanic,12,Emergency,Home or Self Care,2017,156,Nephritis; nephrosis; renal sclerosis,222,BLOOD TRANSFUSION,462,Nephritis & nephrosis,11,Diseases and Disorders of the Kidney and Urinary Tract,3,Major,Moderate,Medical,Medicaid,Medicaid,Self-Pay,,N,Y,80063.00,81158.53
New York City,Kings,7001037,001320,University Hospital of Brooklyn,0 to 17,112,M,Other Race,Not Span/Hispanic,5,Urgent,Home or Self Care,2017,156,Nephritis; nephrosis; renal sclerosis,222,BLOOD TRANSFUSION,462,Nephritis & nephrosis,11,Diseases and Disorders of the Kidney and Urinary Tract,2,Moderate,Minor,Medical,Medicaid,Medicaid,Self-Pay,,N,N,21727.00,33229.14
New York City,Kings,7001021,001306,New York - Presbyterian Brooklyn Methodist Hospital,30 to 49,112,M,White,Spanish/Hispanic,6,Emergency,Home or Self Care,2017,156,Nephritis; nephrosis; renal sclerosis,000,NO PROC,462,Nephritis & nephrosis,11,Diseases and Disorders of the Kidney and Urinary Tract,1,Minor,Minor,Medical,Medicaid,Self-Pay,,,N,Y,36237.65,10743.04
New York City,Manhattan,7002002,001439,Mount Sinai Beth Israel,50 to 69,112,M,Other Race,Not Span/Hispanic,3,Emergency,Home or Self Care,2017,156,Nephritis; nephrosis; renal sclerosis,222,BLOOD TRANSFUSION,462,Nephritis & nephrosis,11,Diseases and Disorders of the Kidney and Urinary Tract,1,Minor,Moderate,Medical,Private Health Insurance,Self-Pay,,,N,Y,23756.42,7434.02
New York City,Manhattan,7002024,001456,Mount Sinai Hospital,50 to 69,115,M,Other Race,Not Span/Hispanic,2,Emergency,Home or Self Care,2017,156,Nephritis; nephrosis; renal sclerosis,000,NO PROC,462,Nephritis & nephrosis,11,Diseases and Disorders of the Kidney and Urinary Tract,3,Major,Minor,Medical,Blue Cross/Blue Shield,Self-Pay,,,N,Y,17807.91,5692.29
New York City,Manhattan,7002054,001458,New York Presbyterian Hospital - New York Weill Cornell Center,0 to 17,100,F,Multi-racial,Not Span/Hispanic,1,Emergency,Home or Self Care,2017,156,Nephritis; nephrosis; renal sclerosis,222,BLOOD TRANSFUSION,462,Nephritis & nephrosis,11,Diseases and Disorders of the Kidney and Urinary Tract,2,Moderate,Minor,Medical,Unknown,Private Health Insurance,Self-Pay,,N,N,10108.68,3684.96
New York City,Queens,7003010,001637,New York - Presbyterian/Queens,0 to 17,113,F,Other Race,Not Span/Hispanic,5,Emergency,Home or Self Care,2017,156,Nephritis; nephrosis; renal sclerosis,231,OTHER THERAPEUTIC PRCS,462,Nephritis & nephrosis,11,Diseases and Disorders of the Kidney and Urinary Tract,1,Minor,Minor,Medical,Medicaid,Medicaid,Self-Pay,,N,Y,29971.97,22534.28
New York City,Queens,7003010,001637,New York - Presbyterian/Queens,0 to 17,113,M,Other Race,Multi-ethnic,3,Emergency,Home or Self Care,2017,156,Nephritis; nephrosis; renal sclerosis,196,DX ULTRASOUND AB/RETRO,462,Nephritis & nephrosis,11,Diseases and Disorders of the Kidney and Urinary Tract,2,Moderate,Minor,Medical,Medicaid,Medicaid,Self-Pay,,N,Y,21081.20,14235.10
New York City,Manhattan,7002024,001456,Mount Sinai Hospital,0 to 17,103,M,White,Not Span/Hispanic,3,Elective,Home or Self Care,2017,156,Nephritis; nephrosis; renal sclerosis,000,NO PROC,462,Nephritis & nephrosis,11,Diseases and Disorders of the Kidney and Urinary Tract,3,Major,Minor,Medical,Private Health Insurance,Self-Pay,,,N,N,21298.58,16466.47
New York City,Manhattan,7002053,001463,NYU Langone Hospitals,50 to 69,112,M,White,Not Span/Hispanic,3,Emergency,Home or Self Care,2017,156,Nephritis; nephrosis; renal sclerosis,222,BLOOD TRANSFUSION,462,Nephritis & nephrosis,11,Diseases and Disorders of the Kidney and Urinary Tract,4,Extreme,Moderate,Medical,Private Health Insurance,,,,N,Y,49717.13,16704.24
Western NY,Erie,1401014,000207,Buffalo General Medical Center,70 or Older,140,M,White,Not Span/Hispanic,3,Emergency,Home w/ Home Health Services,2017,156,Nephritis; nephrosis; renal sclerosis,000,NO PROC,462,Nephritis & nephrosis,11,Diseases and Disorders of the Kidney and Urinary Tract,3,Major,Moderate,Medical,Medicare,Medicaid,Self-Pay,,N,Y,12937.96,5822.46
Capital/Adirond,Rensselaer,4102002,000756,Samaritan Hospital,70 or Older,120,F,White,Not Span/Hispanic,12,Emergency,Hospice - Home,2017,156,Nephritis; nephrosis; renal sclerosis,110,OT DX PRCS URINARY TRCT,462,Nephritis & nephrosis,11,Diseases and Disorders of the Kidney and Urinary Tract,4,Extreme,Extreme,Medical,Medicare,Self-Pay,Self-Pay,,N,Y,50333.88,16319.97
New York City,Bronx,7000006,001169,Montefiore Medical Center - Henry & Lucy Moses Div,50 to 69,104,M,Black/African American,Not Span/Hispanic,7,Emergency,Home or Self Care,2017,156,Nephritis; nephrosis; renal sclerosis,110,OT DX PRCS URINARY TRCT,462,Nephritis & nephrosis,11,Diseases and Disorders of the Kidney and Urinary Tract,3,Major,Moderate,Medical,Private Health Insurance,,,,N,N,81491.86,16136.32
New York City,Bronx,7000006,001169,Montefiore Medical Center - Henry & Lucy Moses Div,18 to 29,104,M,Other Race,Spanish/Hispanic,4,Emergency,Home w/ Home Health Services,2017,156,Nephritis; nephrosis; renal sclerosis,000,NO PROC,462,Nephritis & nephrosis,11,Diseases and Disorders of the Kidney and Urinary Tract,2,Moderate,Moderate,Medical,Medicaid,,,,N,Y,41979.65,8718.00
New York City,Bronx,7000006,001169,Montefiore Medical Center - Henry & Lucy Moses Div,0 to 17,104,M,Black/African American,Not Span/Hispanic,3,Emergency,Home or Self Care,2017,156,Nephritis; nephrosis; renal sclerosis,222,BLOOD TRANSFUSION,462,Nephritis & nephrosis,11,Diseases and Disorders of the Kidney and Urinary Tract,3,Major,Minor,Medical,Medicaid,,,,N,Y,35950.45,8847.37
New York City,Bronx,7000006,001169,Montefiore Medical Center - Henry & Lucy Moses Div,0 to 17,106,M,Other Race,Not Span/Hispanic,1,Emergency,Home or Self Care,2017,156,Nephritis; nephrosis; renal sclerosis,032,OT NON-OR THER PRC NOSE,462,Nephritis & nephrosis,11,Diseases and Disorders of the Kidney and Urinary Tract,1,Minor,Minor,Medical,Blue Cross/Blue Shield,,,,N,N,9205.65,2717.41
Long Island,Suffolk,5154001,000925,Good Samaritan Hospital Medical Center,0 to 17,117,F,White,Not Span/Hispanic,4,Emergency,Home or Self Care,2017,156,Nephritis; nephrosis; renal sclerosis,000,NO PROC,462,Nephritis & nephrosis,11,Diseases and Disorders of the Kidney and Urinary Tract,2,Moderate,Minor,Medical,Blue Cross/Blue Shield,,,,N,Y,26371.00,6379.34
Long Island,Suffolk,5154001,000925,Good Samaritan Hospital Medical Center,0 to 17,117,F,White,Not Span/Hispanic,2,Emergency,Home or Self Care,2017,156,Nephritis; nephrosis; renal sclerosis,000,NO PROC,462,Nephritis & nephrosis,11,Diseases and Disorders of the Kidney and Urinary Tract,1,Minor,Minor,Medical,Blue Cross/Blue Shield,,,,N,N,19050.00,3929.42
Long Island,Suffolk,5154001,000925,Good Samaritan Hospital Medical Center,0 to 17,117,M,Black/African American,Not Span/Hispanic,1,Emergency,Home or Self Care,2017,156,Nephritis; nephrosis; renal sclerosis,000,NO PROC,462,Nephritis & nephrosis,11,Diseases and Disorders of the Kidney and Urinary Tract,2,Moderate,Minor,Medical,Medicaid,Medicaid,,,N,Y,13533.00,3180.05
Hudson Valley,Westchester,5904001,001072,Montefiore New Rochelle Hospital,50 to 69,108,F,Black/African American,Not Span/Hispanic,6,Emergency,Home or Self Care,2017,156,Nephritis; nephrosis; renal sclerosis,000,NO PROC,462,Nephritis & nephrosis,11,Diseases and Disorders of the Kidney and Urinary Tract,2,Moderate,Moderate,Medical,Medicare,Medicare,Medicaid,,N,N,40077.00,21807.44
New York City,Kings,7001020,001305,Maimonides Medical Center,0 to 17,112,M,Other Race,Not Span/Hispanic,4,Emergency,Home or Self Care,2017,156,Nephritis; nephrosis; renal sclerosis,110,OT DX PRCS URINARY TRCT,462,Nephritis & nephrosis,11,Diseases and Disorders of the Kidney and Urinary Tract,3,Major,Moderate,Medical,Medicaid,,Self-Pay,,N,Y,25052.00,12137.15
New York City,Kings,7001021,001306,New York - Presbyterian Brooklyn Methodist Hospital,30 to 49,112,M,Black/African American,Spanish/Hispanic,16,Emergency,Home or Self Care,2017,156,Nephritis; nephrosis; renal sclerosis,000,NO PROC,462,Nephritis & nephrosis,11,Diseases and Disorders of the Kidney and Urinary Tract,3,Major,Moderate,Medical,Medicare,Medicaid,Self-Pay,,N,Y,95564.58,29270.24
New York City,Kings,7001021,001306,New York - Presbyterian Brooklyn Methodist Hospital,30 to 49,112,M,Other Race,Not Span/Hispanic,9,Emergency,Home or Self Care,2017,156,Nephritis; nephrosis; renal sclerosis,004,DIAGNOSTIC SPINAL TAP,462,Nephritis & nephrosis,11,Diseases and Disorders of the Kidney and Urinary Tract,3,Major,Minor,Medical,Private Health Insurance,Medicaid,Self-Pay,,N,Y,88923.11,19371.15
New York City,Kings,7001021,001306,New York - Presbyterian Brooklyn Methodist Hospital,18 to 29,112,M,Black/African American,Not Span/Hispanic,3,Emergency,Home or Self Care,2017,156,Nephritis; nephrosis; renal sclerosis,058,HEMODIALYSIS,462,Nephritis & nephrosis,11,Diseases and Disorders of the Kidney and Urinary Tract,3,Major,Moderate,Medical,Blue Cross/Blue Shield,Medicaid,Self-Pay,,N,Y,29355.41,13256.43
New York City,Manhattan,7002024,001456,Mount Sinai Hospital,0 to 17,103,M,White,Not Span/Hispanic,5,Emergency,Home or Self Care,2017,156,Nephritis; nephrosis; renal sclerosis,000,NO PROC,462,Nephritis & nephrosis,11,Diseases and Disorders of the Kidney and Urinary Tract,3,Major,Moderate,Medical,Private Health Insurance,Self-Pay,,,N,Y,41947.30,29610.83
New York City,Manhattan,7002054,001458,New York Presbyterian Hospital - New York Weill Cornell Center,0 to 17,100,F,White,Not Span/Hispanic,5,Emergency,Home or Self Care,2017,156,Nephritis; nephrosis; renal sclerosis,231,OTHER THERAPEUTIC PRCS,462,Nephritis & nephrosis,11,Diseases and Disorders of the Kidney and Urinary Tract,3,Major,Moderate,Medical,Private Health Insurance,,,,N,Y,52101.90,18717.15
New York City,Manhattan,7002054,001464,New York Presbyterian Hospital - Columbia Presbyterian Center,0 to 17,113,F,Other Race,Not Span/Hispanic,2,Elective,Home or Self Care,2017,156,Nephritis; nephrosis; renal sclerosis,000,NO PROC,462,Nephritis & nephrosis,11,Diseases and Disorders of the Kidney and Urinary Tract,2,Moderate,Minor,Medical,Blue Cross/Blue Shield,Self-Pay,,,N,N,28363.08,6791.66
New York City,Manhattan,7002054,001464,New York Presbyterian Hospital - Columbia Presbyterian Center,0 to 17,100,M,Black/African American,Not Span/Hispanic,1,Elective,Home or Self Care,2017,156,Nephritis; nephrosis; renal sclerosis,222,BLOOD TRANSFUSION,462,Nephritis & nephrosis,11,Diseases and Disorders of the Kidney and Urinary Tract,2,Moderate,Minor,Medical,Medicaid,Medicaid,Self-Pay,,N,N,10878.04,3074.41
New York City,Manhattan,7002054,001464,New York Presbyterian Hospital - Columbia Presbyterian Center,50 to 69,100,M,White,Multi-ethnic,4,Emergency,Home w/ Home Health Services,2017,156,Nephritis; nephrosis; renal sclerosis,000,NO PROC,462,Nephritis & nephrosis,11,Diseases and Disorders of the Kidney and Urinary Tract,3,Major,Moderate,Medical,Medicare,Medicare,Self-Pay,,N,Y,48281.19,12261.68
New York City,Manhattan,7002054,001464,New York Presbyterian Hospital - Columbia Presbyterian Center,0 to 17,100,M,White,Spanish/Hispanic,5,Emergency,Home or Self Care,2017,156,Nephritis; nephrosis; renal sclerosis,110,OT DX PRCS URINARY TRCT,462,Nephritis & nephrosis,11,Diseases and Disorders of the Kidney and Urinary Tract,2,Moderate,Minor,Medical,Medicaid,Self-Pay,,,N,Y,67115.77,17610.53
New York City,Manhattan,7002032,001466,Mount Sinai West,50 to 69,110,M,Black/African American,Not Span/Hispanic,9,Emergency,Home or Self Care,2017,156,Nephritis; nephrosis; renal sclerosis,088,ABDOMINAL PARACENTESIS,462,Nephritis & nephrosis,11,Diseases and Disorders of the Kidney and Urinary Tract,3,Major,Moderate,Medical,Blue Cross/Blue Shield,Self-Pay,,,N,Y,79485.50,22044.07
New York City,Queens,7003010,001637,New York - Presbyterian/Queens,50 to 69,113,F,Other Race,Not Span/Hispanic,11,Emergency,Home w/ Home Health Services,2017,156,Nephritis; nephrosis; renal sclerosis,110,OT DX PRCS URINARY TRCT,462,Nephritis & nephrosis,11,Diseases and Disorders of the Kidney and Urinary Tract,3,Major,Moderate,Medical,Medicaid,Medicaid,Self-Pay,,N,N,82176.43,24022.68
Central NY,Onondaga,3301003,000630,St Josephs Hospital Health Center,50 to 69,132,F,White,Not Span/Hispanic,7,Urgent,Home or Self Care,2017,156,Nephritis; nephrosis; renal sclerosis,058,HEMODIALYSIS,462,Nephritis & nephrosis,11,Diseases and Disorders of the Kidney and Urinary Tract,3,Major,Major,Medical,Medicare,Private Health Insurance,,,N,N,72014.65,27105.28
Capital/Adirond,Albany,0101004,000005,St Peters Hospital,70 or Older,124,M,White,Not Span/Hispanic,8,Emergency,Home or Self Care,2017,156,Nephritis; nephrosis; renal sclerosis,110,OT DX PRCS URINARY TRCT,462,Nephritis & nephrosis,11,Diseases and Disorders of the Kidney and Urinary Tract,2,Moderate,Moderate,Medical,Medicare,Medicare,,,N,Y,44393.35,13996.39
New York City,Bronx,7000006,001169,Montefiore Medical Center - Henry & Lucy Moses Div,50 to 69,104,F,White,Unknown,9,Emergency,Home or Self Care,2017,156,Nephritis; nephrosis; renal sclerosis,110,OT DX PRCS URINARY TRCT,462,Nephritis & nephrosis,11,Diseases and Disorders of the Kidney and Urinary Tract,2,Moderate,Minor,Medical,Medicare,Private Health Insurance,,,N,Y,129463.77,24131.08
New York City,Bronx,7000006,001169,Montefiore Medical Center - Henry & Lucy Moses Div,0 to 17,104,M,Other Race,Spanish/Hispanic,3,Emergency,Home or Self Care,2017,156,Nephritis; nephrosis; renal sclerosis,222,BLOOD TRANSFUSION,462,Nephritis & nephrosis,11,Diseases and Disorders of the Kidney and Urinary Tract,3,Major,Major,Medical,Medicaid,,,,N,N,26678.44,7505.56
New York City,Kings,7001045,001692,Woodhull Medical & Mental Health Center,50 to 69,112,M,Other Race,Not Span/Hispanic,23,Emergency,Home or Self Care,2017,156,Nephritis; nephrosis; renal sclerosis,037,DX BRONCHOSCOPY & BIOPS,462,Nephritis & nephrosis,11,Diseases and Disorders of the Kidney and Urinary Tract,3,Major,Moderate,Medical,Medicaid,Medicaid,,,N,Y,124914.46,82879.62
New York City,Manhattan,7002001,001438,Bellevue Hospital Center,70 or Older,100,M,Other Race,Spanish/Hispanic,6,Emergency,Home w/ Home Health Services,2017,156,Nephritis; nephrosis; renal sclerosis,110,OT DX PRCS URINARY TRCT,462,Nephritis & nephrosis,11,Diseases and Disorders of the Kidney and Urinary Tract,3,Major,Major,Medical,Medicare,Medicare,Medicaid,,N,Y,35545.65,22917.99
New York City,Manhattan,7002009,001445,Harlem Hospital Center,70 or Older,100,F,Black/African American,Not Span/Hispanic,5,Emergency,Home or Self Care,2017,156,Nephritis; nephrosis; renal sclerosis,110,OT DX PRCS URINARY TRCT,462,Nephritis & nephrosis,11,Diseases and Disorders of the Kidney and Urinary Tract,3,Major,Major,Medical,Medicare,Medicaid,,,N,N,34257.52,26638.48
New York City,Manhattan,7002017,001450,Lenox Hill Hospital,50 to 69,100,F,Other Race,Not Span/Hispanic,7,Urgent,Home or Self Care,2017,156,Nephritis; nephrosis; renal sclerosis,110,OT DX PRCS URINARY TRCT,462,Nephritis & nephrosis,11,Diseases and Disorders of the Kidney and Urinary Tract,3,Major,Moderate,Medical,Private Health Insurance,,,,N,N,84190.44,16138.57
New York City,Manhattan,7002017,001450,Lenox Hill Hospital,50 to 69,100,F,White,Not Span/Hispanic,8,Emergency,Home or Self Care,2017,156,Nephritis; nephrosis; renal sclerosis,000,NO PROC,462,Nephritis & nephrosis,11,Diseases and Disorders of the Kidney and Urinary Tract,3,Major,Moderate,Medical,Blue Cross/Blue Shield,,,,N,Y,82632.07,14031.24
New York City,Manhattan,7002053,001463,NYU Langone Hospitals,50 to 69,112,F,Other Race,Spanish/Hispanic,14,Emergency,Home or Self Care,2017,156,Nephritis; nephrosis; renal sclerosis,110,OT DX PRCS URINARY TRCT,462,Nephritis & nephrosis,11,Diseases and Disorders of the Kidney and Urinary Tract,4,Extreme,Major,Medical,Private Health Insurance,,,,N,Y,196219.76,63501.18
New York City,Manhattan,7002032,001466,Mount Sinai West,70 or Older,100,M,Other Race,Unknown,4,Emergency,Home or Self Care,2017,156,Nephritis; nephrosis; renal sclerosis,231,OTHER THERAPEUTIC PRCS,462,Nephritis & nephrosis,11,Diseases and Disorders of the Kidney and Urinary Tract,2,Moderate,Major,Medical,Medicare,Private Health Insurance,Self-Pay,,N,Y,38397.68,10458.29
New York City,Queens,7003000,001626,Elmhurst Hospital Center,50 to 69,113,M,Other Race,Not Span/Hispanic,2,Emergency,Home or Self Care,2017,156,Nephritis; nephrosis; renal sclerosis,000,NO PROC,462,Nephritis & nephrosis,11,Diseases and Disorders of the Kidney and Urinary Tract,2,Moderate,Minor,Medical,Medicaid,Medicaid,,,N,Y,15160.26,7598.20
Long Island,Suffolk,5151001,000245,University Hospital,0 to 17,119,M,Other Race,Spanish/Hispanic,4,Emergency,Home or Self Care,2017,156,Nephritis; nephrosis; renal sclerosis,000,NO PROC,462,Nephritis & nephrosis,11,Diseases and Disorders of the Kidney and Urinary Tract,4,Extreme,Moderate,Medical,Medicaid,Medicaid,,,N,N,37168.13,10634.06
Long Island,Nassau,2951001,000541,North Shore University Hospital,70 or Older,117,F,White,Not Span/Hispanic,6,Emergency,Home w/ Home Health Services,2017,161,Other diseases of kidney and ureters,000,NO PROC,462,Nephritis & nephrosis,11,Diseases and Disorders of the Kidney and Urinary Tract,2,Moderate,Moderate,Medical,Medicare,Private Health Insurance,,,N,Y,61810.57,11706.45
Long Island,Nassau,2951001,000541,North Shore University Hospital,50 to 69,114,M,Other Race,Spanish/Hispanic,4,Emergency,Home or Self Care,2017,156,Nephritis; nephrosis; renal sclerosis,222,BLOOD TRANSFUSION,462,Nephritis & nephrosis,11,Diseases and Disorders of the Kidney and Urinary Tract,3,Major,Moderate,Medical,Blue Cross/Blue Shield,,,,N,Y,49491.21,9472.64
Long Island,Nassau,2951001,000541,North Shore University Hospital,50 to 69,114,F,Black/African American,Not Span/Hispanic,9,Emergency,Home or Self Care,2017,156,Nephritis; nephrosis; renal sclerosis,000,NO PROC,462,Nephritis & nephrosis,11,Diseases and Disorders of the Kidney and Urinary Tract,2,Moderate,Minor,Medical,Medicare,Medicaid,,,N,Y,88033.06,15576.24
Long Island,Suffolk,5123000,000885,Brookhaven Memorial Hospital Medical Center Inc,50 to 69,117,F,Black/African American,Not Span/Hispanic,8,Emergency,Home w/ Home Health Services,2017,156,Nephritis; nephrosis; renal sclerosis,000,NO PROC,462,Nephritis & nephrosis,11,Diseases and Disorders of the Kidney and Urinary Tract,3,Major,Moderate,Medical,Private Health Insurance,,,,N,Y,77569.60,12649.96
Long Island,Suffolk,5154000,000924,Southside Hospital,30 to 49,117,F,Black/African American,Not Span/Hispanic,8,Emergency,Home or Self Care,2017,156,Nephritis; nephrosis; renal sclerosis,110,OT DX PRCS URINARY TRCT,462,Nephritis & nephrosis,11,Diseases and Disorders of the Kidney and Urinary Tract,3,Major,Moderate,Medical,Blue Cross/Blue Shield,,,,N,Y,69213.58,17938.88
Long Island,Suffolk,5155000,000938,Peconic Bay Medical Center,50 to 69,117,M,White,Spanish/Hispanic,21,Emergency,Home or Self Care,2017,156,Nephritis; nephrosis; renal sclerosis,110,OT DX PRCS URINARY TRCT,462,Nephritis & nephrosis,11,Diseases and Disorders of the Kidney and Urinary Tract,3,Major,Moderate,Medical,Medicare,Private Health Insurance,,,N,Y,176177.64,53088.07
Southern Tier,Broome,0303001,000058,United Health Services Hospitals Inc. - Wilson Medical Center,18 to 29,138,M,White,Not Span/Hispanic,20,Emergency,Home or Self Care,2017,156,Nephritis; nephrosis; renal sclerosis,110,OT DX PRCS URINARY TRCT,462,Nephritis & nephrosis,11,Diseases and Disorders of the Kidney and Urinary Tract,3,Major,Moderate,Medical,Medicaid,,,,N,Y,37954.40,22542.80
Capital/Adirond,Albany,0101000,000001,Albany Medical Center Hospital,0 to 17,121,F,White,Not Span/Hispanic,2,Emergency,Home or Self Care,2017,156,Nephritis; nephrosis; renal sclerosis,000,NO PROC,462,Nephritis & nephrosis,11,Diseases and Disorders of the Kidney and Urinary Tract,1,Minor,Minor,Medical,"Managed Care, Unspecified",,,,N,Y,12853.00,3366.99
Capital/Adirond,Albany,0101000,000001,Albany Medical Center Hospital,0 to 17,120,M,White,Not Span/Hispanic,1,Emergency,Home or Self Care,2017,156,Nephritis; nephrosis; renal sclerosis,000,NO PROC,462,Nephritis & nephrosis,11,Diseases and Disorders of the Kidney and Urinary Tract,3,Major,Moderate,Medical,Blue Cross/Blue Shield,,,,N,Y,13310.50,2653.03
Capital/Adirond,Schenectady,4601001,000829,Ellis Hospital,50 to 69,123,M,White,Not Span/Hispanic,5,Emergency,Home w/ Home Health Services,2017,156,Nephritis; nephrosis; renal sclerosis,054,OT VASC CATH; NOT HEART,462,Nephritis & nephrosis,11,Diseases and Disorders of the Kidney and Urinary Tract,3,Major,Major,Medical,Medicare,Medicare,Medicaid,,N,N,30078.67,9742.69
Hudson Valley,Westchester,5907001,001097,SJRH - St Johns Division,30 to 49,107,M,White,Not Span/Hispanic,6,Emergency,Home or Self Care,2017,156,Nephritis; nephrosis; renal sclerosis,041,OT NON-OR THER PRC RESP,462,Nephritis & nephrosis,11,Diseases and Disorders of the Kidney and Urinary Tract,3,Major,Extreme,Medical,Medicaid,Self-Pay,Self-Pay,,N,Y,33597.67,13093.90