Hospital Service Area,Hospital County,Operating Certificate Number,Permanent Facility Id,Facility Name,Age Group,Zip Code - 3 digits,Gender,Race,Ethnicity,Length of Stay,Type of Admission,Patient Disposition,Discharge Year,CCS Diagnosis Code,CCS Diagnosis Description,CCS Procedure Code,CCS Procedure Description,APR DRG Code,APR DRG Description,APR MDC Code,APR MDC Description,APR Severity of Illness Code,APR Severity of Illness Description,APR Risk of Mortality,APR Medical Surgical Description,Payment Typology 1,Payment Typology 2,Payment Typology 3,Birth Weight,Abortion Edit Indicator,Emergency Department Indicator,Total Charges,Total Costs
Long Island,Nassau,2908000,000511,NYU Langone Hospital-Long Island,70 or Older,115,M,Other Race,Not Span/Hispanic,3,Emergency,Home w/ Home Health Services,2019,GEN004,URINARY TRACT INFECTIONS,,,463,KIDNEY & URINARY TRACT INFECTIONS,11,DISEASES AND DISORDERS OF THE KIDNEY AND URINARY TRACT,3,Major,Major,Medical,Medicare,Medicare,Medicaid,,,true,47911.32,8302.34
Long Island,Nassau,2908000,000511,NYU Langone Hospital-Long Island,70 or Older,117,M,Other Race,Not Span/Hispanic,3,Emergency,Short-term Hospital,2019,GEN004,URINARY TRACT INFECTIONS,,,463,KIDNEY & URINARY TRACT INFECTIONS,11,DISEASES AND DISORDERS OF THE KIDNEY AND URINARY TRACT,3,Major,Major,Medical,Medicaid,Medicaid,,,,true,51134.54,8379.11
Long Island,Nassau,2908000,000511,NYU Langone Hospital-Long Island,0 to 17,117,M,White,Not Span/Hispanic,2,Emergency,Home or Self Care,2019,GEN004,URINARY TRACT INFECTIONS,CNS002,LUMBAR PUNCTURE,463,KIDNEY & URINARY TRACT INFECTIONS,11,DISEASES AND DISORDERS OF THE KIDNEY AND URINARY TRACT,3,Major,Minor,Medical,Private Health Insurance,,,04000,,true,35185.82,5974.16
Long Island,Nassau,2908000,000511,NYU Langone Hospital-Long Island,0 to 17,115,F,Black/African American,Not Span/Hispanic,2,Urgent,Home or Self Care,2019,GEN004,URINARY TRACT INFECTIONS,,,463,KIDNEY & URINARY TRACT INFECTIONS,11,DISEASES AND DISORDERS OF THE KIDNEY AND URINARY TRACT,2,Moderate,Minor,Medical,Medicaid,Medicaid,,,,false,17247.53,3943.51
Long Island,Nassau,2908000,000511,NYU Langone Hospital-Long Island,70 or Older,115,F,White,Not Span/Hispanic,3,Emergency,Home w/ Home Health Services,2019,GEN004,URINARY TRACT INFECTIONS,,,463,KIDNEY & URINARY TRACT INFECTIONS,11,DISEASES AND DISORDERS OF THE KIDNEY AND URINARY TRACT,2,Moderate,Major,Medical,Medicare,Medicare,Private Health Insurance,,,true,65943.01,9935.36
Long Island,Nassau,2908000,000511,NYU Langone Hospital-Long Island,50 to 69,110,F,White,Not Span/Hispanic,4,Emergency,Home w/ Home Health Services,2019,GEN004,URINARY TRACT INFECTIONS,,,463,KIDNEY & URINARY TRACT INFECTIONS,11,DISEASES AND DISORDERS OF THE KIDNEY AND URINARY TRACT,2,Moderate,Minor,Medical,Medicare,Medicare,Private Health Insurance,,,true,96407.06,12307.03
Long Island,Nassau,2908000,000511,NYU Langone Hospital-Long Island,50 to 69,115,F,White,Not Span/Hispanic,1,Emergency,Home or Self Care,2019,GEN004,URINARY TRACT INFECTIONS,URN003,URETER AND OTHER URINARY TRACT DILATION,463,KIDNEY & URINARY TRACT INFECTIONS,11,DISEASES AND DISORDERS OF THE KIDNEY AND URINARY TRACT,2,Moderate,Minor,Medical,Medicaid,Medicaid,,,,true,42323.2,5544.86
Long Island,Nassau,2908000,000511,NYU Langone Hospital-Long Island,70 or Older,115,F,Black/African American,Not Span/Hispanic,11,Emergency,Home w/ Home Health Services,2019,GEN004,URINARY TRACT INFECTIONS,,,463,KIDNEY & URINARY TRACT INFECTIONS,11,DISEASES AND DISORDERS OF THE KIDNEY AND URINARY TRACT,3,Major,Major,Medical,Medicare,Medicare,Medicaid,,,true,127018.51,23413.8
Long Island,Nassau,2908000,000511,NYU Langone Hospital-Long Island,70 or Older,115,F,Other Race,Not Span/Hispanic,6,Emergency,Home w/ Home Health Services,2019,GEN004,URINARY TRACT INFECTIONS,ESA004,NON-INVASIVE VENTILATION,463,KIDNEY & URINARY TRACT INFECTIONS,11,DISEASES AND DISORDERS OF THE KIDNEY AND URINARY TRACT,3,Major,Major,Medical,Medicare,Medicare,Private Health Insurance,,,true,106845.61,18311.92
Long Island,Nassau,2908000,000511,NYU Langone Hospital-Long Island,50 to 69,115,F,White,Not Span/Hispanic,1,Emergency,Home or Self Care,2019,GEN004,URINARY TRACT INFECTIONS,IMG004,FLUOROSCOPY OF NON-CIRCULATORY ORGANS,463,KIDNEY & URINARY TRACT INFECTIONS,11,DISEASES AND DISORDERS OF THE KIDNEY AND URINARY TRACT,2,Moderate,Moderate,Medical,Medicare,Medicare,Medicaid,,,true,71607.79,10207.22
Long Island,Nassau,2908000,000511,NYU Langone Hospital-Long Island,70 or Older,110,F,White,Not Span/Hispanic,2,Emergency,Home w/ Home Health Services,2019,GEN004,URINARY TRACT INFECTIONS,ADM001,TRANSFUSION OF BLOOD AND BLOOD PRODUCTS,463,KIDNEY & URINARY TRACT INFECTIONS,11,DISEASES AND DISORDERS OF THE KIDNEY AND URINARY TRACT,2,Moderate,Moderate,Medical,Medicare,Medicare,Blue Cross/Blue Shield,,,true,53574.24,7305.89
Long Island,Nassau,2908000,000511,NYU Langone Hospital-Long Island,70 or Older,115,F,Black/African American,Not Span/Hispanic,2,Emergency,Home w/ Home Health Services,2019,GEN004,URINARY TRACT INFECTIONS,,,463,KIDNEY & URINARY TRACT INFECTIONS,11,DISEASES AND DISORDERS OF THE KIDNEY AND URINARY TRACT,2,Moderate,Minor,Medical,Medicare,Medicare,,,,true,31443.29,5408.14
Long Island,Nassau,2908000,000511,NYU Langone Hospital-Long Island,70 or Older,110,F,White,Not Span/Hispanic,9,Emergency,Skilled Nursing Home,2019,GEN004,URINARY TRACT INFECTIONS,,,463,KIDNEY & URINARY TRACT INFECTIONS,11,DISEASES AND DISORDERS OF THE KIDNEY AND URINARY TRACT,3,Major,Major,Medical,Medicare,Medicare,,,,true,104977.82,19343.6
Long Island,Nassau,2908000,000511,NYU Langone Hospital-Long Island,70 or Older,110,F,White,Not Span/Hispanic,3,Emergency,Home w/ Home Health Services,2019,GEN004,URINARY TRACT INFECTIONS,,,463,KIDNEY & URINARY TRACT INFECTIONS,11,DISEASES AND DISORDERS OF THE KIDNEY AND URINARY TRACT,3,Major,Major,Medical,Medicare,Medicare,,,,true,44972.34,7838.76
Long Island,Nassau,2908000,000511,NYU Langone Hospital-Long Island,70 or Older,115,F,White,Not Span/Hispanic,3,Emergency,Home w/ Home Health Services,2019,GEN004,URINARY TRACT INFECTIONS,,,463,KIDNEY & URINARY TRACT INFECTIONS,11,DISEASES AND DISORDERS OF THE KIDNEY AND URINARY TRACT,3,Major,Major,Medical,Medicare,Medicare,Medicaid,,,true,41194.94,7419.56
Long Island,Nassau,2908000,000511,NYU Langone Hospital-Long Island,70 or Older,115,F,Other Race,Spanish/Hispanic,2,Emergency,Home w/ Home Health Services,2019,GEN004,URINARY TRACT INFECTIONS,,,463,KIDNEY & URINARY TRACT INFECTIONS,11,DISEASES AND DISORDERS OF THE KIDNEY AND URINARY TRACT,2,Moderate,Moderate,Medical,Medicare,Medicare,Private Health Insurance,,,true,31220.65,5173.09
Long Island,Nassau,2908000,000511,NYU Langone Hospital-Long Island,70 or Older,115,M,Black/African American,Not Span/Hispanic,9,Emergency,Skilled Nursing Home,2019,GEN004,URINARY TRACT INFECTIONS,,,463,KIDNEY & URINARY TRACT INFECTIONS,11,DISEASES AND DISORDERS OF THE KIDNEY AND URINARY TRACT,3,Major,Major,Medical,Medicare,Medicare,Private Health Insurance,,,true,96453.95,20197.75
Long Island,Nassau,2908000,000511,NYU Langone Hospital-Long Island,0 to 17,115,F,Black/African American,Not Span/Hispanic,3,Emergency,Home or Self Care,2019,GEN004,URINARY TRACT INFECTIONS,,,463,KIDNEY & URINARY TRACT INFECTIONS,11,DISEASES AND DISORDERS OF THE KIDNEY AND URINARY TRACT,1,Minor,Minor,Medical,Medicaid,Medicaid,,,,true,38233.31,7734.57
Long Island,Nassau,2908000,000511,NYU Langone Hospital-Long Island,70 or Older,110,F,White,Not Span/Hispanic,5,Emergency,Home w/ Home Health Services,2019,GEN004,URINARY TRACT INFECTIONS,,,463,KIDNEY & URINARY TRACT INFECTIONS,11,DISEASES AND DISORDERS OF THE KIDNEY AND URINARY TRACT,3,Major,Major,Medical,Medicare,Medicare,Medicaid,,,true,126583.06,15041.84
Long Island,Nassau,2908000,000511,NYU Langone Hospital-Long Island,18 to 29,110,F,Black/African American,Not Span/Hispanic,1,Emergency,Home or Self Care,2019,GEN004,URINARY TRACT INFECTIONS,,,463,KIDNEY & URINARY TRACT INFECTIONS,11,DISEASES AND DISORDERS OF THE KIDNEY AND URINARY TRACT,2,Moderate,Minor,Medical,Medicaid,Medicaid,,,,true,26666.52,3527.77
Long Island,Nassau,2908000,000511,NYU Langone Hospital-Long Island,70 or Older,115,M,White,Spanish/Hispanic,6,Emergency,Home w/ Home Health Services,2019,GEN004,URINARY TRACT INFECTIONS,,,463,KIDNEY & URINARY TRACT INFECTIONS,11,DISEASES AND DISORDERS OF THE KIDNEY AND URINARY TRACT,2,Moderate,Moderate,Medical,Medicare,Medicare,Blue Cross/Blue Shield,,,true,61253.27,12748.79
Long Island,Nassau,2908000,000511,NYU Langone Hospital-Long Island,70 or Older,110,F,White,Not Span/Hispanic,4,Emergency,Skilled Nursing Home,2019,GEN004,URINARY TRACT INFECTIONS,,,463,KIDNEY & URINARY TRACT INFECTIONS,11,DISEASES AND DISORDERS OF THE KIDNEY AND URINARY TRACT,2,Moderate,Moderate,Medical,Medicare,Medicare,Medicaid,,,true,55166.07,9909.97
Long Island,Nassau,2908000,000511,NYU Langone Hospital-Long Island,30 to 49,115,F,Other Race,Spanish/Hispanic,7,Emergency,Home or Self Care,2019,GEN004,URINARY TRACT INFECTIONS,,,463,KIDNEY & URINARY TRACT INFECTIONS,11,DISEASES AND DISORDERS OF THE KIDNEY AND URINARY TRACT,3,Major,Moderate,Medical,Medicaid,Medicaid,,,,true,96823.17,17280.15
Long Island,Nassau,2908000,000511,NYU Langone Hospital-Long Island,0 to 17,115,F,Other Race,Spanish/Hispanic,2,Urgent,Home or Self Care,2019,GEN004,URINARY TRACT INFECTIONS,,,463,KIDNEY & URINARY TRACT INFECTIONS,11,DISEASES AND DISORDERS OF THE KIDNEY AND URINARY TRACT,1,Minor,Minor,Medical,Medicaid,Medicaid,,,,false,18786.88,4101.93
Long Island,Nassau,2908000,000511,NYU Langone Hospital-Long Island,50 to 69,115,F,Black/African American,Not Span/Hispanic,1,Emergency,Left Against Medical Advice,2019,GEN004,URINARY TRACT INFECTIONS,,,463,KIDNEY & URINARY TRACT INFECTIONS,11,DISEASES AND DISORDERS OF THE KIDNEY AND URINARY TRACT,2,Moderate,Minor,Medical,Medicare,Medicare,,,,true,25865.32,3981.42
Long Island,Nassau,2908000,000511,NYU Langone Hospital-Long Island,50 to 69,115,M,Black/African American,Not Span/Hispanic,1,Emergency,Home or Self Care,2019,GEN004,URINARY TRACT INFECTIONS,,,463,KIDNEY & URINARY TRACT INFECTIONS,11,DISEASES AND DISORDERS OF THE KIDNEY AND URINARY TRACT,3,Major,Major,Medical,Medicaid,Medicaid,,,,true,36337.48,4687.06
Long Island,Nassau,2908000,000511,NYU Langone Hospital-Long Island,50 to 69,115,F,White,Not Span/Hispanic,1,Emergency,Home or Self Care,2019,GEN004,URINARY TRACT INFECTIONS,,,463,KIDNEY & URINARY TRACT INFECTIONS,11,DISEASES AND DISORDERS OF THE KIDNEY AND URINARY TRACT,1,Minor,Minor,Medical,Medicaid,Medicaid,,,,true,38306.93,3920.46
Long Island,Nassau,2908000,000511,NYU Langone Hospital-Long Island,70 or Older,115,F,White,Not Span/Hispanic,8,Emergency,Skilled Nursing Home,2019,GEN004,URINARY TRACT INFECTIONS,,,463,KIDNEY & URINARY TRACT INFECTIONS,11,DISEASES AND DISORDERS OF THE KIDNEY AND URINARY TRACT,2,Moderate,Moderate,Medical,Medicare,Medicare,,,,true,75721.48,16772.14
Long Island,Nassau,2908000,000511,NYU Langone Hospital-Long Island,70 or Older,115,F,White,Not Span/Hispanic,2,Emergency,Home w/ Home Health Services,2019,GEN004,URINARY TRACT INFECTIONS,,,463,KIDNEY & URINARY TRACT INFECTIONS,11,DISEASES AND DISORDERS OF THE KIDNEY AND URINARY TRACT,2,Moderate,Moderate,Medical,Medicare,Medicare,,,,true,29083.86,5558.87
Long Island,Nassau,2908000,000511,NYU Langone Hospital-Long Island,0 to 17,117,F,White,Spanish/Hispanic,3,Emergency,Home or Self Care,2019,GEN004,URINARY TRACT INFECTIONS,,,463,KIDNEY & URINARY TRACT INFECTIONS,11,DISEASES AND DISORDERS OF THE KIDNEY AND URINARY TRACT,1,Minor,Minor,Medical,Private Health Insurance,,,,,true,34714.18,7277.46
Long Island,Nassau,2908000,000511,NYU Langone Hospital-Long Island,50 to 69,115,F,Other Race,Spanish/Hispanic,3,Emergency,Home or Self Care,2019,GEN004,URINARY TRACT INFECTIONS,,,463,KIDNEY & URINARY TRACT INFECTIONS,11,DISEASES AND DISORDERS OF THE KIDNEY AND URINARY TRACT,3,Major,Major,Medical,Medicaid,Medicaid,,,,true,46390.4,7706.57
Long Island,Nassau,2908000,000511,NYU Langone Hospital-Long Island,70 or Older,115,M,White,Not Span/Hispanic,4,Emergency,Home w/ Home Health Services,2019,GEN004,URINARY TRACT INFECTIONS,,,463,KIDNEY & URINARY TRACT INFECTIONS,11,DISEASES AND DISORDERS OF THE KIDNEY AND URINARY TRACT,3,Major,Major,Medical,Medicare,Medicare,Private Health Insurance,,,true,47743.13,8753.31
Long Island,Nassau,2908000,000511,NYU Langone Hospital-Long Island,0 to 17,118,M,Other Race,Spanish/Hispanic,3,Emergency,Home or Self Care,2019,GEN004,URINARY TRACT INFECTIONS,OTR004,ISOLATION PROCEDURES,463,KIDNEY & URINARY TRACT INFECTIONS,11,DISEASES AND DISORDERS OF THE KIDNEY AND URINARY TRACT,1,Minor,Minor,Medical,Medicaid,,,,,true,41988.38,8056.59
Long Island,Nassau,2908000,000511,NYU Langone Hospital-Long Island,50 to 69,115,M,White,Not Span/Hispanic,1,Emergency,Home or Self Care,2019,GEN004,URINARY TRACT INFECTIONS,,,463,KIDNEY & URINARY TRACT INFECTIONS,11,DISEASES AND DISORDERS OF THE KIDNEY AND URINARY TRACT,2,Moderate,Minor,Medical,Private Health Insurance,,,,,true,21108.41,3301.77
Long Island,Nassau,2908000,000511,NYU Langone Hospital-Long Island,0 to 17,115,M,White,Spanish/Hispanic,5,Urgent,Home or Self Care,2019,GEN004,URINARY TRACT INFECTIONS,,,463,KIDNEY & URINARY TRACT INFECTIONS,11,DISEASES AND DISORDERS OF THE KIDNEY AND URINARY TRACT,2,Moderate,Minor,Medical,Medicaid,,,,,false,40780.16,9526.75
Long Island,Nassau,2908000,000511,NYU Langone Hospital-Long Island,70 or Older,115,M,White,Not Span/Hispanic,4,Emergency,Home or Self Care,2019,GEN004,URINARY TRACT INFECTIONS,,,463,KIDNEY & URINARY TRACT INFECTIONS,11,DISEASES AND DISORDERS OF THE KIDNEY AND URINARY TRACT,3,Major,Moderate,Medical,Medicare,Medicare,Private Health Insurance,,,true,46898.95,8966.91
Long Island,Nassau,2908000,000511,NYU Langone Hospital-Long Island,70 or Older,115,F,White,Not Span/Hispanic,4,Emergency,Skilled Nursing Home,2019,GEN004,URINARY TRACT INFECTIONS,,,463,KIDNEY & URINARY TRACT INFECTIONS,11,DISEASES AND DISORDERS OF THE KIDNEY AND URINARY TRACT,2,Moderate,Moderate,Medical,Medicare,Medicare,,,,true,69352.03,9904.03
Long Island,Nassau,2908000,000511,NYU Langone Hospital-Long Island,50 to 69,110,F,White,Not Span/Hispanic,5,Emergency,Skilled Nursing Home,2019,GEN004,URINARY TRACT INFECTIONS,CAR024,VENOUS AND ARTERIAL CATHETER PLACEMENT,463,KIDNEY & URINARY TRACT INFECTIONS,11,DISEASES AND DISORDERS OF THE KIDNEY AND URINARY TRACT,3,Major,Major,Medical,Medicare,Medicare,Private Health Insurance,,,true,78606.78,13056.58
Long Island,Nassau,2908000,000511,NYU Langone Hospital-Long Island,50 to 69,110,F,White,Not Span/Hispanic,3,Emergency,Home or Self Care,2019,GEN004,URINARY TRACT INFECTIONS,,,463,KIDNEY & URINARY TRACT INFECTIONS,11,DISEASES AND DISORDERS OF THE KIDNEY AND URINARY TRACT,3,Major,Moderate,Medical,Medicare,Medicare,Private Health Insurance,,,true,62095.3,9128.97
Long Island,Nassau,2908000,000511,NYU Langone Hospital-Long Island,70 or Older,110,F,Other Race,Not Span/Hispanic,3,Emergency,Home or Self Care,2019,GEN004,URINARY TRACT INFECTIONS,,,463,KIDNEY & URINARY TRACT INFECTIONS,11,DISEASES AND DISORDERS OF THE KIDNEY AND URINARY TRACT,2,Moderate,Moderate,Medical,Medicare,Medicare,Blue Cross/Blue Shield,,,true,40847.48,7208.89
Long Island,Nassau,2908000,000511,NYU Langone Hospital-Long Island,70 or Older,113,F,White,Not Span/Hispanic,3,Emergency,Home or Self Care,2019,GEN004,URINARY TRACT INFECTIONS,,,463,KIDNEY & URINARY TRACT INFECTIONS,11,DISEASES AND DISORDERS OF THE KIDNEY AND URINARY TRACT,3,Major,Major,Medical,Medicare,Medicare,Private Health Insurance,,,true,46758.6,7852.77
Long Island,Nassau,2908000,000511,NYU Langone Hospital-Long Island,50 to 69,117,F,White,Not Span/Hispanic,11,Emergency,Home or Self Care,2019,GEN004,URINARY TRACT INFECTIONS,,,463,KIDNEY & URINARY TRACT INFECTIONS,11,DISEASES AND DISORDERS OF THE KIDNEY AND URINARY TRACT,3,Major,Moderate,Medical,Miscellaneous/Other,Medicare,Medicare,,,true,80811,20257.32
Long Island,Nassau,2908000,000511,NYU Langone Hospital-Long Island,70 or Older,115,F,White,Not Span/Hispanic,4,Emergency,Home or Self Care,2019,GEN004,URINARY TRACT INFECTIONS,,,463,KIDNEY & URINARY TRACT INFECTIONS,11,DISEASES AND DISORDERS OF THE KIDNEY AND URINARY TRACT,2,Moderate,Moderate,Medical,Medicare,Medicare,,,,true,46449.92,9264.48
Long Island,Nassau,2908000,000511,NYU Langone Hospital-Long Island,70 or Older,115,M,White,Not Span/Hispanic,1,Emergency,Home or Self Care,2019,GEN004,URINARY TRACT INFECTIONS,,,463,KIDNEY & URINARY TRACT INFECTIONS,11,DISEASES AND DISORDERS OF THE KIDNEY AND URINARY TRACT,2,Moderate,Major,Medical,Medicare,Medicare,Blue Cross/Blue Shield,,,true,43997.38,5910.28
Long Island,Nassau,2908000,000511,NYU Langone Hospital-Long Island,70 or Older,115,M,White,Not Span/Hispanic,3,Emergency,Home or Self Care,2019,GEN004,URINARY TRACT INFECTIONS,URN001,CYSTOSCOPY AND URETEROSCOPY (INCLUDING BIOPSY),463,KIDNEY & URINARY TRACT INFECTIONS,11,DISEASES AND DISORDERS OF THE KIDNEY AND URINARY TRACT,2,Moderate,Minor,Medical,Medicare,Medicare,,,,true,63656.31,10993.99
Long Island,Nassau,2908000,000511,NYU Langone Hospital-Long Island,70 or Older,115,F,Black/African American,Spanish/Hispanic,4,Emergency,Home w/ Home Health Services,2019,GEN004,URINARY TRACT INFECTIONS,,,463,KIDNEY & URINARY TRACT INFECTIONS,11,DISEASES AND DISORDERS OF THE KIDNEY AND URINARY TRACT,3,Major,Major,Medical,Medicare,Medicare,Private Health Insurance,,,true,57055.01,9549.25
Long Island,Nassau,2908000,000511,NYU Langone Hospital-Long Island,70 or Older,116,F,Black/African American,Not Span/Hispanic,5,Emergency,Home or Self Care,2019,GEN004,URINARY TRACT INFECTIONS,ADM001,TRANSFUSION OF BLOOD AND BLOOD PRODUCTS,463,KIDNEY & URINARY TRACT INFECTIONS,11,DISEASES AND DISORDERS OF THE KIDNEY AND URINARY TRACT,3,Major,Major,Medical,Medicare,Medicare,Private Health Insurance,,,true,69832.19,12612.38
Long Island,Nassau,2908000,000511,NYU Langone Hospital-Long Island,70 or Older,115,F,White,Not Span/Hispanic,6,Emergency,Home w/ Home Health Services,2019,GEN004,URINARY TRACT INFECTIONS,,,463,KIDNEY & URINARY TRACT INFECTIONS,11,DISEASES AND DISORDERS OF THE KIDNEY AND URINARY TRACT,2,Moderate,Major,Medical,Medicare,Medicare,,,,true,65212.35,12930.5
Long Island,Nassau,2908000,000511,NYU Langone Hospital-Long Island,70 or Older,115,F,White,Not Span/Hispanic,4,Emergency,Home or Self Care,2019,GEN004,URINARY TRACT INFECTIONS,,,463,KIDNEY & URINARY TRACT INFECTIONS,11,DISEASES AND DISORDERS OF THE KIDNEY AND URINARY TRACT,3,Major,Major,Medical,Medicare,Medicare,,,,true,67360.64,10691.39
Long Island,Nassau,2908000,000511,NYU Langone Hospital-Long Island,70 or Older,115,M,White,Not Span/Hispanic,2,Emergency,Home or Self Care,2019,GEN004,URINARY TRACT INFECTIONS,,,463,KIDNEY & URINARY TRACT INFECTIONS,11,DISEASES AND DISORDERS OF THE KIDNEY AND URINARY TRACT,3,Major,Major,Medical,Medicare,Private Health Insurance,Medicare,,,true,28069.57,5394.45
Long Island,Nassau,2908000,000511,NYU Langone Hospital-Long Island,70 or Older,115,F,White,Not Span/Hispanic,10,Emergency,Skilled Nursing Home,2019,GEN004,URINARY TRACT INFECTIONS,IMG005,MAGNETIC RESONANCE IMAGING (MRI),463,KIDNEY & URINARY TRACT INFECTIONS,11,DISEASES AND DISORDERS OF THE KIDNEY AND URINARY TRACT,3,Major,Major,Medical,Medicare,Medicare,Private Health Insurance,,,true,114058.72,21510.43
Long Island,Nassau,2908000,000511,NYU Langone Hospital-Long Island,70 or Older,110,M,White,Not Span/Hispanic,3,Emergency,Home or Self Care,2019,GEN004,URINARY TRACT INFECTIONS,URN003,URETER AND OTHER URINARY TRACT DILATION,463,KIDNEY & URINARY TRACT INFECTIONS,11,DISEASES AND DISORDERS OF THE KIDNEY AND URINARY TRACT,3,Major,Major,Medical,Medicare,Medicare,,,,true,46436.95,8773.35
Long Island,Nassau,2908000,000511,NYU Langone Hospital-Long Island,30 to 49,115,M,Black/African American,Not Span/Hispanic,1,Emergency,Home or Self Care,2019,GEN004,URINARY TRACT INFECTIONS,,,463,KIDNEY & URINARY TRACT INFECTIONS,11,DISEASES AND DISORDERS OF THE KIDNEY AND URINARY TRACT,3,Major,Moderate,Medical,Medicaid,,,,,true,21218.84,3408.42
Long Island,Nassau,2908000,000511,NYU Langone Hospital-Long Island,70 or Older,115,M,White,Not Span/Hispanic,2,Emergency,Home w/ Home Health Services,2019,GEN004,URINARY TRACT INFECTIONS,,,463,KIDNEY & URINARY TRACT INFECTIONS,11,DISEASES AND DISORDERS OF THE KIDNEY AND URINARY TRACT,2,Moderate,Moderate,Medical,Medicare,Medicare,Blue Cross/Blue Shield,,,true,37110.03,5757.08
Long Island,Nassau,2908000,000511,NYU Langone Hospital-Long Island,70 or Older,117,F,White,Not Span/Hispanic,3,Emergency,Home or Self Care,2019,GEN004,URINARY TRACT INFECTIONS,,,463,KIDNEY & URINARY TRACT INFECTIONS,11,DISEASES AND DISORDERS OF THE KIDNEY AND URINARY TRACT,3,Major,Moderate,Medical,Medicare,Medicare,Private Health Insurance,,,true,56971.44,7592.55
Long Island,Nassau,2908000,000511,NYU Langone Hospital-Long Island,70 or Older,115,F,White,Not Span/Hispanic,6,Emergency,Home w/ Home Health Services,2019,GEN004,URINARY TRACT INFECTIONS,,,463,KIDNEY & URINARY TRACT INFECTIONS,11,DISEASES AND DISORDERS OF THE KIDNEY AND URINARY TRACT,3,Major,Moderate,Medical,Medicare,Medicare,Private Health Insurance,,,true,98638.34,17396.32
Long Island,Nassau,2908000,000511,NYU Langone Hospital-Long Island,50 to 69,110,M,Other Race,Not Span/Hispanic,1,Emergency,Home or Self Care,2019,GEN004,URINARY TRACT INFECTIONS,,,463,KIDNEY & URINARY TRACT INFECTIONS,11,DISEASES AND DISORDERS OF THE KIDNEY AND URINARY TRACT,2,Moderate,Minor,Medical,Blue Cross/Blue Shield,,,,,true,24380.78,3483.98
Long Island,Nassau,2908000,000511,NYU Langone Hospital-Long Island,50 to 69,115,M,White,Not Span/Hispanic,2,Emergency,Home or Self Care,2019,GEN004,URINARY TRACT INFECTIONS,,,463,KIDNEY & URINARY TRACT INFECTIONS,11,DISEASES AND DISORDERS OF THE KIDNEY AND URINARY TRACT,2,Moderate,Minor,Medical,Blue Cross/Blue Shield,Medicare,,,,true,40477.73,6045.84
Long Island,Nassau,2908000,000511,NYU Langone Hospital-Long Island,70 or Older,115,F,White,Not Span/Hispanic,5,Emergency,Skilled Nursing Home,2019,GEN004,URINARY TRACT INFECTIONS,,,463,KIDNEY & URINARY TRACT INFECTIONS,11,DISEASES AND DISORDERS OF THE KIDNEY AND URINARY TRACT,2,Moderate,Major,Medical,Medicare,Medicare,Blue Cross/Blue Shield,,,true,44742.09,9969.32
Long Island,Nassau,2908000,000511,NYU Langone Hospital-Long Island,0 to 17,115,F,White,Not Span/Hispanic,2,Emergency,Home or Self Care,2019,GEN004,URINARY TRACT INFECTIONS,,,463,KIDNEY & URINARY TRACT INFECTIONS,11,DISEASES AND DISORDERS OF THE KIDNEY AND URINARY TRACT,2,Moderate,Minor,Medical,Blue Cross/Blue Shield,,,,,true,30044.34,5430.84
Long Island,Nassau,2908000,000511,NYU Langone Hospital-Long Island,70 or Older,115,F,White,Not Span/Hispanic,4,Emergency,Home or Self Care,2019,GEN004,URINARY TRACT INFECTIONS,,,463,KIDNEY & URINARY TRACT INFECTIONS,11,DISEASES AND DISORDERS OF THE KIDNEY AND URINARY TRACT,2,Moderate,Moderate,Medical,Medicare,Medicare,,,,true,60951.17,10700.57
Long Island,Nassau,2908000,000511,NYU Langone Hospital-Long Island,18 to 29,115,M,Black/African American,Not Span/Hispanic,4,Emergency,Home or Self Care,2019,GEN004,URINARY TRACT INFECTIONS,,,463,KIDNEY & URINARY TRACT INFECTIONS,11,DISEASES AND DISORDERS OF THE KIDNEY AND URINARY TRACT,2,Moderate,Minor,Medical,Medicaid,,,,,true,51048.97,8394.84
Long Island,Nassau,2908000,000511,NYU Langone Hospital-Long Island,50 to 69,115,F,White,Not Span/Hispanic,4,Emergency,Home or Self Care,2019,GEN004,URINARY TRACT INFECTIONS,,,463,KIDNEY & URINARY TRACT INFECTIONS,11,DISEASES AND DISORDERS OF THE KIDNEY AND URINARY TRACT,3,Major,Minor,Medical,Self-Pay,,,,,true,92306.8,10784.55
Long Island,Nassau,2908000,000511,NYU Langone Hospital-Long Island,50 to 69,115,F,Other Race,Spanish/Hispanic,2,Emergency,Home or Self Care,2019,GEN004,URINARY TRACT INFECTIONS,,,463,KIDNEY & URINARY TRACT INFECTIONS,11,DISEASES AND DISORDERS OF THE KIDNEY AND URINARY TRACT,1,Minor,Minor,Medical,Private Health Insurance,,,,,true,25155.02,4649.36