Hospital Service Area,Hospital County,Operating Certificate Number,Permanent Facility Id,Facility Name,Age Group,Zip Code - 3 digits,Gender,Race,Ethnicity,Length of Stay,Type of Admission,Patient Disposition,Discharge Year,CCS Diagnosis Code,CCS Diagnosis Description,CCS Procedure Code,CCS Procedure Description,APR DRG Code,APR DRG Description,APR MDC Code,APR MDC Description,APR Severity of Illness Code,APR Severity of Illness Description,APR Risk of Mortality,APR Medical Surgical Description,Payment Typology 1,Payment Typology 2,Payment Typology 3,Birth Weight,Abortion Edit Indicator,Emergency Department Indicator,Total Charges,Total Costs
Long Island,Suffolk,5123000,000885,Long Island Community Hospital,50 to 69,117,F,White,Not Span/Hispanic,3,Emergency,Home w/ Home Health Services,2019,GEN004,URINARY TRACT INFECTIONS,,,463,KIDNEY & URINARY TRACT INFECTIONS,11,DISEASES AND DISORDERS OF THE KIDNEY AND URINARY TRACT,3,Major,Moderate,Medical,Medicare,Medicare,Medicaid,,,true,43313.89,6295.04
Long Island,Suffolk,5123000,000885,Long Island Community Hospital,70 or Older,117,M,White,Not Span/Hispanic,11,Emergency,Skilled Nursing Home,2019,GEN004,URINARY TRACT INFECTIONS,,,463,KIDNEY & URINARY TRACT INFECTIONS,11,DISEASES AND DISORDERS OF THE KIDNEY AND URINARY TRACT,3,Major,Moderate,Medical,Medicare,Medicare,,,,true,63242.34,13627.54
Long Island,Suffolk,5123000,000885,Long Island Community Hospital,70 or Older,117,F,White,Not Span/Hispanic,8,Emergency,Skilled Nursing Home,2019,GEN004,URINARY TRACT INFECTIONS,,,463,KIDNEY & URINARY TRACT INFECTIONS,11,DISEASES AND DISORDERS OF THE KIDNEY AND URINARY TRACT,3,Major,Major,Medical,Medicare,Medicare,Private Health Insurance,,,true,76694.03,11566.2
Long Island,Suffolk,5123000,000885,Long Island Community Hospital,70 or Older,117,F,White,Not Span/Hispanic,4,Emergency,Home w/ Home Health Services,2019,GEN004,URINARY TRACT INFECTIONS,,,463,KIDNEY & URINARY TRACT INFECTIONS,11,DISEASES AND DISORDERS OF THE KIDNEY AND URINARY TRACT,3,Major,Major,Medical,Medicare,Medicare,Blue Cross/Blue Shield,,,true,35721.37,5786.51
Long Island,Suffolk,5123000,000885,Long Island Community Hospital,70 or Older,117,F,White,Not Span/Hispanic,1,Emergency,Left Against Medical Advice,2019,GEN004,URINARY TRACT INFECTIONS,,,463,KIDNEY & URINARY TRACT INFECTIONS,11,DISEASES AND DISORDERS OF THE KIDNEY AND URINARY TRACT,2,Moderate,Moderate,Medical,Medicare,Medicare,Private Health Insurance,,,true,20307.21,1892.51
Long Island,Suffolk,5123000,000885,Long Island Community Hospital,50 to 69,119,M,Other Race,Not Span/Hispanic,5,Emergency,Home or Self Care,2019,GEN004,URINARY TRACT INFECTIONS,SUD001,SUBSTANCE USE DETOXIFICATION,463,KIDNEY & URINARY TRACT INFECTIONS,11,DISEASES AND DISORDERS OF THE KIDNEY AND URINARY TRACT,2,Moderate,Moderate,Medical,Medicaid,,,,,true,41900.12,7984.91
Long Island,Suffolk,5123000,000885,Long Island Community Hospital,50 to 69,117,F,White,Not Span/Hispanic,1,Emergency,Home or Self Care,2019,GEN004,URINARY TRACT INFECTIONS,,,463,KIDNEY & URINARY TRACT INFECTIONS,11,DISEASES AND DISORDERS OF THE KIDNEY AND URINARY TRACT,3,Major,Minor,Medical,Medicaid,,,,,true,14129.31,2240.51
Long Island,Suffolk,5123000,000885,Long Island Community Hospital,50 to 69,117,F,Black/African American,Not Span/Hispanic,7,Emergency,Home w/ Home Health Services,2019,GEN004,URINARY TRACT INFECTIONS,,,463,KIDNEY & URINARY TRACT INFECTIONS,11,DISEASES AND DISORDERS OF THE KIDNEY AND URINARY TRACT,2,Moderate,Minor,Medical,Medicare,Medicaid,,,,true,59685.64,10023.76
Long Island,Suffolk,5123000,000885,Long Island Community Hospital,50 to 69,117,M,White,Not Span/Hispanic,1,Emergency,Left Against Medical Advice,2019,GEN004,URINARY TRACT INFECTIONS,,,463,KIDNEY & URINARY TRACT INFECTIONS,11,DISEASES AND DISORDERS OF THE KIDNEY AND URINARY TRACT,1,Minor,Minor,Medical,Medicare,Medicare,Medicaid,,,true,22621.12,2077.69
Long Island,Suffolk,5123000,000885,Long Island Community Hospital,50 to 69,119,F,White,Not Span/Hispanic,1,Emergency,Left Against Medical Advice,2019,GEN004,URINARY TRACT INFECTIONS,,,463,KIDNEY & URINARY TRACT INFECTIONS,11,DISEASES AND DISORDERS OF THE KIDNEY AND URINARY TRACT,2,Moderate,Minor,Medical,Private Health Insurance,Medicaid,,,,true,22854.31,2233.05
Long Island,Suffolk,5123000,000885,Long Island Community Hospital,70 or Older,117,F,Other Race,Not Span/Hispanic,8,Emergency,Skilled Nursing Home,2019,GEN004,URINARY TRACT INFECTIONS,,,463,KIDNEY & URINARY TRACT INFECTIONS,11,DISEASES AND DISORDERS OF THE KIDNEY AND URINARY TRACT,3,Major,Major,Medical,Medicare,Medicare,,,,true,63187.97,11316.49
Long Island,Suffolk,5123000,000885,Long Island Community Hospital,30 to 49,119,M,Other Race,Not Span/Hispanic,2,Emergency,Home or Self Care,2019,GEN004,URINARY TRACT INFECTIONS,,,463,KIDNEY & URINARY TRACT INFECTIONS,11,DISEASES AND DISORDERS OF THE KIDNEY AND URINARY TRACT,2,Moderate,Minor,Medical,Private Health Insurance,,,,,true,12648.46,2787.28
Long Island,Suffolk,5123000,000885,Long Island Community Hospital,70 or Older,119,M,Other Race,Not Span/Hispanic,3,Emergency,Home w/ Home Health Services,2019,GEN004,URINARY TRACT INFECTIONS,,,463,KIDNEY & URINARY TRACT INFECTIONS,11,DISEASES AND DISORDERS OF THE KIDNEY AND URINARY TRACT,1,Minor,Minor,Medical,Medicare,Medicare,Private Health Insurance,,,true,28946.46,4503.99
Long Island,Suffolk,5123000,000885,Long Island Community Hospital,50 to 69,117,F,White,Not Span/Hispanic,6,Emergency,Skilled Nursing Home,2019,GEN004,URINARY TRACT INFECTIONS,,,463,KIDNEY & URINARY TRACT INFECTIONS,11,DISEASES AND DISORDERS OF THE KIDNEY AND URINARY TRACT,2,Moderate,Moderate,Medical,Medicare,Medicare,Medicaid,,,true,38693.65,7921.41
Long Island,Suffolk,5123000,000885,Long Island Community Hospital,50 to 69,119,M,White,Not Span/Hispanic,3,Emergency,Skilled Nursing Home,2019,GEN004,URINARY TRACT INFECTIONS,,,463,KIDNEY & URINARY TRACT INFECTIONS,11,DISEASES AND DISORDERS OF THE KIDNEY AND URINARY TRACT,3,Major,Moderate,Medical,Medicare,Medicare,Private Health Insurance,,,true,53227.44,6145.24
Long Island,Suffolk,5123000,000885,Long Island Community Hospital,50 to 69,117,F,White,Not Span/Hispanic,2,Emergency,Home or Self Care,2019,GEN004,URINARY TRACT INFECTIONS,,,463,KIDNEY & URINARY TRACT INFECTIONS,11,DISEASES AND DISORDERS OF THE KIDNEY AND URINARY TRACT,3,Major,Major,Medical,Medicare,Medicare,Medicaid,,,true,18629.16,3328.29
Long Island,Suffolk,5123000,000885,Long Island Community Hospital,30 to 49,117,F,White,Not Span/Hispanic,2,Emergency,Home or Self Care,2019,GEN004,URINARY TRACT INFECTIONS,,,463,KIDNEY & URINARY TRACT INFECTIONS,11,DISEASES AND DISORDERS OF THE KIDNEY AND URINARY TRACT,1,Minor,Minor,Medical,Private Health Insurance,,,,,true,22291.1,3121.12
Long Island,Suffolk,5123000,000885,Long Island Community Hospital,70 or Older,119,M,White,Not Span/Hispanic,7,Emergency,Home or Self Care,2019,GEN004,URINARY TRACT INFECTIONS,URN006,BLADDER CATHETERIZATION AND DRAINAGE,463,KIDNEY & URINARY TRACT INFECTIONS,11,DISEASES AND DISORDERS OF THE KIDNEY AND URINARY TRACT,2,Moderate,Moderate,Medical,Medicare,Medicare,,,,true,61059.89,9878.22
Long Island,Suffolk,5123000,000885,Long Island Community Hospital,70 or Older,117,F,White,Not Span/Hispanic,5,Emergency,Home w/ Home Health Services,2019,GEN004,URINARY TRACT INFECTIONS,,,463,KIDNEY & URINARY TRACT INFECTIONS,11,DISEASES AND DISORDERS OF THE KIDNEY AND URINARY TRACT,3,Major,Major,Medical,Medicare,Medicare,Medicaid,,,true,36960.51,7573.24
Long Island,Suffolk,5123000,000885,Long Island Community Hospital,70 or Older,119,F,White,Not Span/Hispanic,8,Emergency,Home w/ Home Health Services,2019,GEN004,URINARY TRACT INFECTIONS,URN003,URETER AND OTHER URINARY TRACT DILATION,463,KIDNEY & URINARY TRACT INFECTIONS,11,DISEASES AND DISORDERS OF THE KIDNEY AND URINARY TRACT,2,Moderate,Moderate,Medical,Medicare,Medicare,Private Health Insurance,,,true,76186.68,15122.05
Long Island,Suffolk,5123000,000885,Long Island Community Hospital,30 to 49,119,F,Black/African American,Not Span/Hispanic,2,Emergency,Home or Self Care,2019,GEN004,URINARY TRACT INFECTIONS,,,463,KIDNEY & URINARY TRACT INFECTIONS,11,DISEASES AND DISORDERS OF THE KIDNEY AND URINARY TRACT,1,Minor,Minor,Medical,Private Health Insurance,Medicaid,,,,true,31756.2,3957.69
Long Island,Suffolk,5123000,000885,Long Island Community Hospital,70 or Older,117,M,White,Not Span/Hispanic,3,Emergency,Home w/ Home Health Services,2019,GEN004,URINARY TRACT INFECTIONS,,,463,KIDNEY & URINARY TRACT INFECTIONS,11,DISEASES AND DISORDERS OF THE KIDNEY AND URINARY TRACT,3,Major,Major,Medical,Medicare,Medicare,Private Health Insurance,,,true,49470.1,6814.09
Long Island,Suffolk,5123000,000885,Long Island Community Hospital,70 or Older,117,F,White,Not Span/Hispanic,5,Emergency,Skilled Nursing Home,2019,GEN004,URINARY TRACT INFECTIONS,,,463,KIDNEY & URINARY TRACT INFECTIONS,11,DISEASES AND DISORDERS OF THE KIDNEY AND URINARY TRACT,2,Moderate,Major,Medical,Medicare,Medicare,,,,true,31723.86,6516.48
Long Island,Suffolk,5123000,000885,Long Island Community Hospital,50 to 69,117,F,White,Not Span/Hispanic,5,Emergency,Home or Self Care,2019,GEN004,URINARY TRACT INFECTIONS,,,463,KIDNEY & URINARY TRACT INFECTIONS,11,DISEASES AND DISORDERS OF THE KIDNEY AND URINARY TRACT,3,Major,Moderate,Medical,Medicare,,,,,true,42264.94,7342.39
Long Island,Suffolk,5123000,000885,Long Island Community Hospital,70 or Older,117,F,White,Not Span/Hispanic,4,Emergency,Skilled Nursing Home,2019,GEN004,URINARY TRACT INFECTIONS,,,463,KIDNEY & URINARY TRACT INFECTIONS,11,DISEASES AND DISORDERS OF THE KIDNEY AND URINARY TRACT,3,Major,Major,Medical,Medicare,Medicare,Private Health Insurance,,,true,35911.13,6451.31
Long Island,Suffolk,5123000,000885,Long Island Community Hospital,70 or Older,117,F,White,Not Span/Hispanic,6,Emergency,Skilled Nursing Home,2019,GEN004,URINARY TRACT INFECTIONS,,,463,KIDNEY & URINARY TRACT INFECTIONS,11,DISEASES AND DISORDERS OF THE KIDNEY AND URINARY TRACT,2,Moderate,Moderate,Medical,Medicare,,,,,true,40620.49,7874.57
Long Island,Suffolk,5123000,000885,Long Island Community Hospital,50 to 69,117,F,White,Not Span/Hispanic,6,Emergency,Home or Self Care,2019,GEN004,URINARY TRACT INFECTIONS,,,463,KIDNEY & URINARY TRACT INFECTIONS,11,DISEASES AND DISORDERS OF THE KIDNEY AND URINARY TRACT,1,Minor,Minor,Medical,Private Health Insurance,Medicaid,,,,true,41553.07,8002.02
Long Island,Suffolk,5123000,000885,Long Island Community Hospital,70 or Older,119,M,White,Not Span/Hispanic,4,Emergency,Home w/ Home Health Services,2019,GEN004,URINARY TRACT INFECTIONS,,,463,KIDNEY & URINARY TRACT INFECTIONS,11,DISEASES AND DISORDERS OF THE KIDNEY AND URINARY TRACT,3,Major,Major,Medical,Medicare,,,,,true,43136.92,5836.49
Long Island,Suffolk,5123000,000885,Long Island Community Hospital,70 or Older,117,F,White,Not Span/Hispanic,4,Emergency,Skilled Nursing Home,2019,GEN004,URINARY TRACT INFECTIONS,,,463,KIDNEY & URINARY TRACT INFECTIONS,11,DISEASES AND DISORDERS OF THE KIDNEY AND URINARY TRACT,3,Major,Major,Medical,Medicare,,,,,true,55467.02,7948.27
Long Island,Suffolk,5123000,000885,Long Island Community Hospital,70 or Older,117,M,White,Not Span/Hispanic,4,Emergency,Home w/ Home Health Services,2019,GEN004,URINARY TRACT INFECTIONS,CAR024,VENOUS AND ARTERIAL CATHETER PLACEMENT,463,KIDNEY & URINARY TRACT INFECTIONS,11,DISEASES AND DISORDERS OF THE KIDNEY AND URINARY TRACT,2,Moderate,Major,Medical,Medicare,Medicare,Private Health Insurance,,,true,28669.22,5810.82
Long Island,Suffolk,5123000,000885,Long Island Community Hospital,50 to 69,117,M,White,Not Span/Hispanic,1,Emergency,Home or Self Care,2019,GEN004,URINARY TRACT INFECTIONS,URN003,URETER AND OTHER URINARY TRACT DILATION,463,KIDNEY & URINARY TRACT INFECTIONS,11,DISEASES AND DISORDERS OF THE KIDNEY AND URINARY TRACT,2,Moderate,Minor,Medical,Blue Cross/Blue Shield,,,,,true,28485.82,4782.88
Long Island,Suffolk,5123000,000885,Long Island Community Hospital,70 or Older,117,F,White,Not Span/Hispanic,5,Emergency,Skilled Nursing Home,2019,GEN004,URINARY TRACT INFECTIONS,,,463,KIDNEY & URINARY TRACT INFECTIONS,11,DISEASES AND DISORDERS OF THE KIDNEY AND URINARY TRACT,1,Minor,Minor,Medical,Medicare,Medicare,Blue Cross/Blue Shield,,,true,34939.05,7468.85
Long Island,Suffolk,5123000,000885,Long Island Community Hospital,50 to 69,117,M,Black/African American,Not Span/Hispanic,2,Emergency,Home or Self Care,2019,GEN004,URINARY TRACT INFECTIONS,,,463,KIDNEY & URINARY TRACT INFECTIONS,11,DISEASES AND DISORDERS OF THE KIDNEY AND URINARY TRACT,2,Moderate,Minor,Medical,Self-Pay,,,,,true,30405.15,3669.06
Long Island,Suffolk,5123000,000885,Long Island Community Hospital,70 or Older,117,F,White,Not Span/Hispanic,10,Emergency,Skilled Nursing Home,2019,GEN004,URINARY TRACT INFECTIONS,,,463,KIDNEY & URINARY TRACT INFECTIONS,11,DISEASES AND DISORDERS OF THE KIDNEY AND URINARY TRACT,2,Moderate,Moderate,Medical,Medicare,Medicare,Blue Cross/Blue Shield,,,true,60503.6,13109.67
Long Island,Suffolk,5123000,000885,Long Island Community Hospital,70 or Older,117,F,White,Not Span/Hispanic,5,Emergency,Skilled Nursing Home,2019,GEN004,URINARY TRACT INFECTIONS,,,463,KIDNEY & URINARY TRACT INFECTIONS,11,DISEASES AND DISORDERS OF THE KIDNEY AND URINARY TRACT,3,Major,Major,Medical,Medicare,Medicare,Medicaid,,,true,47024.84,7581.5
Long Island,Suffolk,5123000,000885,Long Island Community Hospital,50 to 69,119,M,White,Not Span/Hispanic,1,Emergency,Home or Self Care,2019,GEN004,URINARY TRACT INFECTIONS,,,463,KIDNEY & URINARY TRACT INFECTIONS,11,DISEASES AND DISORDERS OF THE KIDNEY AND URINARY TRACT,2,Moderate,Moderate,Medical,Medicare,Medicare,,,,true,21264.02,2269.4
Long Island,Suffolk,5123000,000885,Long Island Community Hospital,70 or Older,117,F,White,Not Span/Hispanic,6,Emergency,Skilled Nursing Home,2019,GEN004,URINARY TRACT INFECTIONS,,,463,KIDNEY & URINARY TRACT INFECTIONS,11,DISEASES AND DISORDERS OF THE KIDNEY AND URINARY TRACT,3,Major,Extreme,Medical,Medicare,Medicare,Private Health Insurance,,,true,38737.98,8356.79
Long Island,Suffolk,5123000,000885,Long Island Community Hospital,18 to 29,,F,Other Race,Not Span/Hispanic,10,Emergency,Home or Self Care,2019,GEN004,URINARY TRACT INFECTIONS,,,463,KIDNEY & URINARY TRACT INFECTIONS,11,DISEASES AND DISORDERS OF THE KIDNEY AND URINARY TRACT,2,Moderate,Moderate,Medical,Private Health Insurance,Medicaid,,,,false,58978.34,12187.25
Long Island,Suffolk,5123000,000885,Long Island Community Hospital,70 or Older,117,M,White,Not Span/Hispanic,3,Emergency,Hospice - Home,2019,GEN004,URINARY TRACT INFECTIONS,,,463,KIDNEY & URINARY TRACT INFECTIONS,11,DISEASES AND DISORDERS OF THE KIDNEY AND URINARY TRACT,3,Major,Moderate,Medical,Medicare,Medicare,Private Health Insurance,,,true,35409.02,4697.12
Long Island,Suffolk,5123000,000885,Long Island Community Hospital,50 to 69,117,F,White,Not Span/Hispanic,1,Emergency,Left Against Medical Advice,2019,GEN004,URINARY TRACT INFECTIONS,,,463,KIDNEY & URINARY TRACT INFECTIONS,11,DISEASES AND DISORDERS OF THE KIDNEY AND URINARY TRACT,2,Moderate,Minor,Medical,Medicare,Medicare,Medicaid,,,true,10621.42,1766.3
Long Island,Suffolk,5123000,000885,Long Island Community Hospital,70 or Older,119,M,White,Not Span/Hispanic,3,Emergency,Home or Self Care,2019,SYM011,GENITOURINARY SIGNS AND SYMPTOMS,OTR004,ISOLATION PROCEDURES,463,KIDNEY & URINARY TRACT INFECTIONS,11,DISEASES AND DISORDERS OF THE KIDNEY AND URINARY TRACT,2,Moderate,Moderate,Medical,Medicare,Medicare,Blue Cross/Blue Shield,,,true,22961.05,4680.04
Long Island,Suffolk,5123000,000885,Long Island Community Hospital,70 or Older,119,F,White,Not Span/Hispanic,8,Emergency,Skilled Nursing Home,2019,GEN004,URINARY TRACT INFECTIONS,,,463,KIDNEY & URINARY TRACT INFECTIONS,11,DISEASES AND DISORDERS OF THE KIDNEY AND URINARY TRACT,2,Moderate,Moderate,Medical,Medicare,Medicaid,,,,true,55036.37,11099.05
Long Island,Suffolk,5123000,000885,Long Island Community Hospital,70 or Older,117,F,White,Not Span/Hispanic,4,Emergency,Skilled Nursing Home,2019,GEN004,URINARY TRACT INFECTIONS,,,463,KIDNEY & URINARY TRACT INFECTIONS,11,DISEASES AND DISORDERS OF THE KIDNEY AND URINARY TRACT,2,Moderate,Moderate,Medical,Medicare,Medicare,Private Health Insurance,,,true,37637.44,6573.33
Long Island,Suffolk,5123000,000885,Long Island Community Hospital,50 to 69,119,F,White,Not Span/Hispanic,2,Emergency,Home or Self Care,2019,GEN004,URINARY TRACT INFECTIONS,IMG004,FLUOROSCOPY OF NON-CIRCULATORY ORGANS,463,KIDNEY & URINARY TRACT INFECTIONS,11,DISEASES AND DISORDERS OF THE KIDNEY AND URINARY TRACT,1,Minor,Minor,Medical,Blue Cross/Blue Shield,,,,,true,31895.56,5888.15
Long Island,Suffolk,5123000,000885,Long Island Community Hospital,70 or Older,117,F,White,Not Span/Hispanic,2,Emergency,Home w/ Home Health Services,2019,GEN004,URINARY TRACT INFECTIONS,,,463,KIDNEY & URINARY TRACT INFECTIONS,11,DISEASES AND DISORDERS OF THE KIDNEY AND URINARY TRACT,2,Moderate,Moderate,Medical,Medicare,Medicare,Blue Cross/Blue Shield,,,true,48879.69,3882.1
Long Island,Suffolk,5123000,000885,Long Island Community Hospital,70 or Older,117,F,White,Not Span/Hispanic,5,Emergency,Home w/ Home Health Services,2019,GEN004,URINARY TRACT INFECTIONS,,,463,KIDNEY & URINARY TRACT INFECTIONS,11,DISEASES AND DISORDERS OF THE KIDNEY AND URINARY TRACT,2,Moderate,Major,Medical,Medicare,Medicare,Medicaid,,,true,29526.12,6570.6
Long Island,Suffolk,5123000,000885,Long Island Community Hospital,18 to 29,117,F,White,Not Span/Hispanic,4,Emergency,Home or Self Care,2019,GEN004,URINARY TRACT INFECTIONS,CAR024,VENOUS AND ARTERIAL CATHETER PLACEMENT,463,KIDNEY & URINARY TRACT INFECTIONS,11,DISEASES AND DISORDERS OF THE KIDNEY AND URINARY TRACT,1,Minor,Minor,Medical,Private Health Insurance,,,,,true,32466.73,5865.26
Long Island,Suffolk,5123000,000885,Long Island Community Hospital,18 to 29,119,F,White,Not Span/Hispanic,2,Emergency,Home w/ Home Health Services,2019,GEN004,URINARY TRACT INFECTIONS,CAR024,VENOUS AND ARTERIAL CATHETER PLACEMENT,463,KIDNEY & URINARY TRACT INFECTIONS,11,DISEASES AND DISORDERS OF THE KIDNEY AND URINARY TRACT,1,Minor,Minor,Medical,Private Health Insurance,,,,,true,27030.42,3420.23
Long Island,Suffolk,5123000,000885,Long Island Community Hospital,70 or Older,117,F,White,Not Span/Hispanic,7,Emergency,Skilled Nursing Home,2019,GEN004,URINARY TRACT INFECTIONS,,,463,KIDNEY & URINARY TRACT INFECTIONS,11,DISEASES AND DISORDERS OF THE KIDNEY AND URINARY TRACT,2,Moderate,Moderate,Medical,Medicare,Medicare,,,,true,44553.87,8966.93
Long Island,Suffolk,5123000,000885,Long Island Community Hospital,70 or Older,117,F,White,Not Span/Hispanic,4,Emergency,Skilled Nursing Home,2019,GEN004,URINARY TRACT INFECTIONS,,,463,KIDNEY & URINARY TRACT INFECTIONS,11,DISEASES AND DISORDERS OF THE KIDNEY AND URINARY TRACT,2,Moderate,Moderate,Medical,Medicare,Medicare,Private Health Insurance,,,true,47349.65,6312.32
Long Island,Suffolk,5123000,000885,Long Island Community Hospital,70 or Older,119,M,White,Not Span/Hispanic,5,Emergency,Home or Self Care,2019,GEN004,URINARY TRACT INFECTIONS,,,463,KIDNEY & URINARY TRACT INFECTIONS,11,DISEASES AND DISORDERS OF THE KIDNEY AND URINARY TRACT,3,Major,Major,Medical,Medicare,Medicare,,,,true,43795.68,7775.84
Long Island,Suffolk,5123000,000885,Long Island Community Hospital,70 or Older,117,F,White,Not Span/Hispanic,4,Emergency,Skilled Nursing Home,2019,GEN004,URINARY TRACT INFECTIONS,,,463,KIDNEY & URINARY TRACT INFECTIONS,11,DISEASES AND DISORDERS OF THE KIDNEY AND URINARY TRACT,2,Moderate,Moderate,Medical,Medicare,Medicare,Private Health Insurance,,,true,28594.5,5495.96
Long Island,Suffolk,5123000,000885,Long Island Community Hospital,70 or Older,117,F,White,Not Span/Hispanic,6,Emergency,Home w/ Home Health Services,2019,GEN004,URINARY TRACT INFECTIONS,,,463,KIDNEY & URINARY TRACT INFECTIONS,11,DISEASES AND DISORDERS OF THE KIDNEY AND URINARY TRACT,3,Major,Moderate,Medical,Medicare,Medicare,Private Health Insurance,,,true,46648.22,8196.81
Long Island,Suffolk,5123000,000885,Long Island Community Hospital,70 or Older,117,F,White,Not Span/Hispanic,5,Emergency,Skilled Nursing Home,2019,GEN004,URINARY TRACT INFECTIONS,,,463,KIDNEY & URINARY TRACT INFECTIONS,11,DISEASES AND DISORDERS OF THE KIDNEY AND URINARY TRACT,2,Moderate,Major,Medical,Medicare,Medicare,Blue Cross/Blue Shield,,,true,53486.72,7060.14
Long Island,Suffolk,5123000,000885,Long Island Community Hospital,50 to 69,117,M,White,Not Span/Hispanic,5,Emergency,Home or Self Care,2019,GEN004,URINARY TRACT INFECTIONS,ADM001,TRANSFUSION OF BLOOD AND BLOOD PRODUCTS,463,KIDNEY & URINARY TRACT INFECTIONS,11,DISEASES AND DISORDERS OF THE KIDNEY AND URINARY TRACT,2,Moderate,Moderate,Medical,Medicare,Medicare,Blue Cross/Blue Shield,,,true,37039.94,7805.68
Long Island,Suffolk,5123000,000885,Long Island Community Hospital,70 or Older,119,M,White,Not Span/Hispanic,4,Emergency,Home or Self Care,2019,GEN004,URINARY TRACT INFECTIONS,GIS004,GI SYSTEM ENDOSCOPY WITHOUT BIOPSY (DIAGNOSTIC),463,KIDNEY & URINARY TRACT INFECTIONS,11,DISEASES AND DISORDERS OF THE KIDNEY AND URINARY TRACT,3,Major,Moderate,Medical,Medicare,Medicare,Private Health Insurance,,,true,30484.7,7678.98
Long Island,Suffolk,5123000,000885,Long Island Community Hospital,70 or Older,119,F,Black/African American,Not Span/Hispanic,3,Emergency,Skilled Nursing Home,2019,GEN004,URINARY TRACT INFECTIONS,,,463,KIDNEY & URINARY TRACT INFECTIONS,11,DISEASES AND DISORDERS OF THE KIDNEY AND URINARY TRACT,2,Moderate,Moderate,Medical,Medicare,Medicare,Blue Cross/Blue Shield,,,true,26984.69,4838.1
Long Island,Suffolk,5123000,000885,Long Island Community Hospital,70 or Older,117,F,Black/African American,Not Span/Hispanic,5,Emergency,Skilled Nursing Home,2019,GEN004,URINARY TRACT INFECTIONS,,,463,KIDNEY & URINARY TRACT INFECTIONS,11,DISEASES AND DISORDERS OF THE KIDNEY AND URINARY TRACT,3,Major,Major,Medical,Medicare,Medicare,Medicaid,,,true,30462.31,6851.66
Long Island,Suffolk,5123000,000885,Long Island Community Hospital,70 or Older,117,F,White,Not Span/Hispanic,6,Emergency,Skilled Nursing Home,2019,GEN004,URINARY TRACT INFECTIONS,,,463,KIDNEY & URINARY TRACT INFECTIONS,11,DISEASES AND DISORDERS OF THE KIDNEY AND URINARY TRACT,2,Moderate,Major,Medical,Medicare,Medicaid,,,,true,37939.56,8132.49
Long Island,Suffolk,5123000,000885,Long Island Community Hospital,70 or Older,119,F,White,Not Span/Hispanic,3,Emergency,Skilled Nursing Home,2019,GEN004,URINARY TRACT INFECTIONS,,,463,KIDNEY & URINARY TRACT INFECTIONS,11,DISEASES AND DISORDERS OF THE KIDNEY AND URINARY TRACT,2,Moderate,Moderate,Medical,Medicare,Medicare,,,,true,19973.67,4318.29
Long Island,Suffolk,5123000,000885,Long Island Community Hospital,70 or Older,119,F,White,Not Span/Hispanic,7,Emergency,Home w/ Home Health Services,2019,GEN004,URINARY TRACT INFECTIONS,URN001,CYSTOSCOPY AND URETEROSCOPY (INCLUDING BIOPSY),463,KIDNEY & URINARY TRACT INFECTIONS,11,DISEASES AND DISORDERS OF THE KIDNEY AND URINARY TRACT,2,Moderate,Major,Medical,Medicare,Medicare,Blue Cross/Blue Shield,,,true,71362.86,13080.69
Long Island,Suffolk,5123000,000885,Long Island Community Hospital,50 to 69,117,F,White,Not Span/Hispanic,4,Emergency,Home or Self Care,2019,GEN004,URINARY TRACT INFECTIONS,,,463,KIDNEY & URINARY TRACT INFECTIONS,11,DISEASES AND DISORDERS OF THE KIDNEY AND URINARY TRACT,2,Moderate,Moderate,Medical,Blue Cross/Blue Shield,,,,,true,39221.2,5973.56
Long Island,Suffolk,5123000,000885,Long Island Community Hospital,70 or Older,117,F,White,Not Span/Hispanic,8,Emergency,Home w/ Home Health Services,2019,GEN004,URINARY TRACT INFECTIONS,,,463,KIDNEY & URINARY TRACT INFECTIONS,11,DISEASES AND DISORDERS OF THE KIDNEY AND URINARY TRACT,2,Moderate,Major,Medical,Medicare,,,,,true,54129.64,11561.91