Hospital Service Area,Hospital County,Operating Certificate Number,Permanent Facility Id,Facility Name,Age Group,Zip Code - 3 digits,Gender,Race,Ethnicity,Length of Stay,Type of Admission,Patient Disposition,Discharge Year,CCS Diagnosis Code,CCS Diagnosis Description,CCS Procedure Code,CCS Procedure Description,APR DRG Code,APR DRG Description,APR MDC Code,APR MDC Description,APR Severity of Illness Code,APR Severity of Illness Description,APR Risk of Mortality,APR Medical Surgical Description,Payment Typology 1,Payment Typology 2,Payment Typology 3,Birth Weight,Abortion Edit Indicator,Emergency Department Indicator,Total Charges,Total Costs
New York City,Manhattan,7002053,001463,NYU Langone Hospitals,0 to 17,112,M,White,Not Span/Hispanic,2,Emergency,Home or Self Care,2020,GEN004,URINARY TRACT INFECTIONS,CNS002,LUMBAR PUNCTURE,463,KIDNEY & URINARY TRACT INFECTIONS,11,DISEASES AND DISORDERS OF THE KIDNEY AND URINARY TRACT,2,Moderate,Minor,Medical,Medicaid,,,03700,,Y,25527.35,6862.42
New York City,Manhattan,7002053,001463,NYU Langone Hospitals,70 or Older,100,F,White,Not Span/Hispanic,1,Emergency,Home or Self Care,2020,GEN004,URINARY TRACT INFECTIONS,,,463,KIDNEY & URINARY TRACT INFECTIONS,11,DISEASES AND DISORDERS OF THE KIDNEY AND URINARY TRACT,1,Minor,Minor,Medical,Medicaid,,,,,Y,40077.9,10664.65
New York City,Manhattan,7002053,001463,NYU Langone Hospitals,50 to 69,100,M,White,Spanish/Hispanic,1,Emergency,Home or Self Care,2020,GEN004,URINARY TRACT INFECTIONS,,,463,KIDNEY & URINARY TRACT INFECTIONS,11,DISEASES AND DISORDERS OF THE KIDNEY AND URINARY TRACT,2,Moderate,Major,Medical,Private Health Insurance,,,,,Y,47086.86,10137.08
New York City,Manhattan,7002053,001463,NYU Langone Hospitals,70 or Older,,M,White,Not Span/Hispanic,1,Emergency,Home w/ Home Health Services,2020,GEN004,URINARY TRACT INFECTIONS,,,463,KIDNEY & URINARY TRACT INFECTIONS,11,DISEASES AND DISORDERS OF THE KIDNEY AND URINARY TRACT,2,Moderate,Minor,Medical,Medicare,Blue Cross/Blue Shield,Private Health Insurance,,,Y,25779.37,5733.6
New York City,Manhattan,7002053,001463,NYU Langone Hospitals,50 to 69,112,M,Other Race,Not Span/Hispanic,1,Emergency,Skilled Nursing Home,2020,GEN004,URINARY TRACT INFECTIONS,ADM018,IRRIGATION (DIAGNOSTIC AND THERAPEUTIC),463,KIDNEY & URINARY TRACT INFECTIONS,11,DISEASES AND DISORDERS OF THE KIDNEY AND URINARY TRACT,3,Major,Moderate,Medical,Medicaid,,,,,Y,31931.66,9243.44
New York City,Manhattan,7002053,001463,NYU Langone Hospitals,70 or Older,100,M,Other Race,Not Span/Hispanic,2,Emergency,Skilled Nursing Home,2020,GEN004,URINARY TRACT INFECTIONS,IMG008,ULTRASONOGRAPHY,463,KIDNEY & URINARY TRACT INFECTIONS,11,DISEASES AND DISORDERS OF THE KIDNEY AND URINARY TRACT,3,Major,Major,Medical,Medicare,Medicare,,,,Y,29815.62,8218.02
New York City,Manhattan,7002053,001463,NYU Langone Hospitals,50 to 69,100,F,White,Not Span/Hispanic,7,Emergency,Skilled Nursing Home,2020,GEN004,URINARY TRACT INFECTIONS,,,463,KIDNEY & URINARY TRACT INFECTIONS,11,DISEASES AND DISORDERS OF THE KIDNEY AND URINARY TRACT,3,Major,Major,Medical,Medicare,,,,,Y,107461.44,32294.57
New York City,Manhattan,7002053,001463,NYU Langone Hospitals,0 to 17,,F,White,Unknown,1,Emergency,Home or Self Care,2020,GEN004,URINARY TRACT INFECTIONS,,,463,KIDNEY & URINARY TRACT INFECTIONS,11,DISEASES AND DISORDERS OF THE KIDNEY AND URINARY TRACT,1,Minor,Minor,Medical,Private Health Insurance,,,,,Y,21256.19,4050.47
New York City,Manhattan,7002053,001463,NYU Langone Hospitals,70 or Older,112,F,White,Not Span/Hispanic,1,Emergency,Home w/ Home Health Services,2020,GEN004,URINARY TRACT INFECTIONS,,,463,KIDNEY & URINARY TRACT INFECTIONS,11,DISEASES AND DISORDERS OF THE KIDNEY AND URINARY TRACT,3,Major,Major,Medical,Medicare,Medicaid,,,,Y,39929.23,10133.44
New York City,Manhattan,7002053,001463,NYU Langone Hospitals,0 to 17,103,F,White,Not Span/Hispanic,1,Emergency,Home or Self Care,2020,GEN004,URINARY TRACT INFECTIONS,,,463,KIDNEY & URINARY TRACT INFECTIONS,11,DISEASES AND DISORDERS OF THE KIDNEY AND URINARY TRACT,1,Minor,Minor,Medical,Blue Cross/Blue Shield,,,,,Y,18610.74,4906.99
New York City,Manhattan,7002053,001463,NYU Langone Hospitals,70 or Older,113,M,Other Race,Not Span/Hispanic,4,Emergency,Home w/ Home Health Services,2020,GEN004,URINARY TRACT INFECTIONS,ESA001,HEMODIALYSIS,463,KIDNEY & URINARY TRACT INFECTIONS,11,DISEASES AND DISORDERS OF THE KIDNEY AND URINARY TRACT,3,Major,Major,Medical,Medicare,Medicaid,,,,Y,59841.7,18047.2
New York City,Manhattan,7002053,001463,NYU Langone Hospitals,70 or Older,112,M,Multi-racial,Not Span/Hispanic,3,Emergency,Home w/ Home Health Services,2020,GEN004,URINARY TRACT INFECTIONS,ADM018,IRRIGATION (DIAGNOSTIC AND THERAPEUTIC),463,KIDNEY & URINARY TRACT INFECTIONS,11,DISEASES AND DISORDERS OF THE KIDNEY AND URINARY TRACT,2,Moderate,Major,Medical,Medicare,Private Health Insurance,,,,Y,31522.34,10747.44
New York City,Manhattan,7002053,001463,NYU Langone Hospitals,0 to 17,112,F,Multi-racial,Not Span/Hispanic,1,Emergency,Home or Self Care,2020,GEN004,URINARY TRACT INFECTIONS,,,463,KIDNEY & URINARY TRACT INFECTIONS,11,DISEASES AND DISORDERS OF THE KIDNEY AND URINARY TRACT,1,Minor,Minor,Medical,Medicaid,,,,,Y,16762.39,4471.68
New York City,Manhattan,7002053,001463,NYU Langone Hospitals,70 or Older,100,M,White,Not Span/Hispanic,3,Emergency,Home w/ Home Health Services,2020,GEN004,URINARY TRACT INFECTIONS,,,463,KIDNEY & URINARY TRACT INFECTIONS,11,DISEASES AND DISORDERS OF THE KIDNEY AND URINARY TRACT,2,Moderate,Moderate,Medical,Medicare,Blue Cross/Blue Shield,,,,Y,36149.32,10978.16
New York City,Manhattan,7002053,001463,NYU Langone Hospitals,70 or Older,112,F,Other Race,Spanish/Hispanic,3,Emergency,Home w/ Home Health Services,2020,GEN004,URINARY TRACT INFECTIONS,,,463,KIDNEY & URINARY TRACT INFECTIONS,11,DISEASES AND DISORDERS OF THE KIDNEY AND URINARY TRACT,3,Major,Major,Medical,Medicare,,,,,Y,40550.96,11627.75
New York City,Manhattan,7002053,001463,NYU Langone Hospitals,50 to 69,112,F,Other Race,Spanish/Hispanic,1,Emergency,Home or Self Care,2020,GEN004,URINARY TRACT INFECTIONS,,,463,KIDNEY & URINARY TRACT INFECTIONS,11,DISEASES AND DISORDERS OF THE KIDNEY AND URINARY TRACT,1,Minor,Minor,Medical,Private Health Insurance,,,,,Y,21493.39,6939.55
New York City,Manhattan,7002053,001463,NYU Langone Hospitals,50 to 69,103,M,White,Not Span/Hispanic,1,Emergency,Home or Self Care,2020,GEN004,URINARY TRACT INFECTIONS,URN003,URETER AND OTHER URINARY TRACT DILATION,463,KIDNEY & URINARY TRACT INFECTIONS,11,DISEASES AND DISORDERS OF THE KIDNEY AND URINARY TRACT,2,Moderate,Moderate,Medical,Blue Cross/Blue Shield,,,,,Y,49044.99,8600.75
New York City,Manhattan,7002053,001463,NYU Langone Hospitals,0 to 17,100,M,Other Race,Spanish/Hispanic,8,Emergency,Home or Self Care,2020,GEN004,URINARY TRACT INFECTIONS,CNS002,LUMBAR PUNCTURE,463,KIDNEY & URINARY TRACT INFECTIONS,11,DISEASES AND DISORDERS OF THE KIDNEY AND URINARY TRACT,2,Moderate,Minor,Medical,Private Health Insurance,,,,,Y,85271.64,21661.06
New York City,Manhattan,7002053,001463,NYU Langone Hospitals,18 to 29,100,F,Other Race,Not Span/Hispanic,1,Emergency,Home or Self Care,2020,GEN004,URINARY TRACT INFECTIONS,,,463,KIDNEY & URINARY TRACT INFECTIONS,11,DISEASES AND DISORDERS OF THE KIDNEY AND URINARY TRACT,2,Moderate,Minor,Medical,Private Health Insurance,,,,,Y,43949.56,11413.23
New York City,Manhattan,7002053,001463,NYU Langone Hospitals,30 to 49,112,M,White,Not Span/Hispanic,1,Emergency,Home or Self Care,2020,GEN004,URINARY TRACT INFECTIONS,,,463,KIDNEY & URINARY TRACT INFECTIONS,11,DISEASES AND DISORDERS OF THE KIDNEY AND URINARY TRACT,1,Minor,Minor,Medical,Blue Cross/Blue Shield,,,,,Y,38257.32,9375.66
New York City,Manhattan,7002053,001463,NYU Langone Hospitals,70 or Older,100,M,White,Not Span/Hispanic,1,Emergency,Home w/ Home Health Services,2020,GEN004,URINARY TRACT INFECTIONS,,,463,KIDNEY & URINARY TRACT INFECTIONS,11,DISEASES AND DISORDERS OF THE KIDNEY AND URINARY TRACT,2,Moderate,Moderate,Medical,Medicare,,,,,Y,31462.27,8839.83
New York City,Manhattan,7002053,001463,NYU Langone Hospitals,70 or Older,100,M,Other Race,Spanish/Hispanic,3,Emergency,Home w/ Home Health Services,2020,GEN004,URINARY TRACT INFECTIONS,,,463,KIDNEY & URINARY TRACT INFECTIONS,11,DISEASES AND DISORDERS OF THE KIDNEY AND URINARY TRACT,2,Moderate,Moderate,Medical,Medicare,Medicaid,,,,Y,48698.81,11963.08
New York City,Manhattan,7002053,001463,NYU Langone Hospitals,70 or Older,100,F,Other Race,Spanish/Hispanic,1,Emergency,Home w/ Home Health Services,2020,GEN004,URINARY TRACT INFECTIONS,MAM011,ELECTROENCEPHALOGRAM (EEG),463,KIDNEY & URINARY TRACT INFECTIONS,11,DISEASES AND DISORDERS OF THE KIDNEY AND URINARY TRACT,2,Moderate,Moderate,Medical,Medicare,Medicaid,,,,Y,45392,11391.81
New York City,Manhattan,7002053,001463,NYU Langone Hospitals,30 to 49,100,F,Other Race,Not Span/Hispanic,2,Emergency,Home or Self Care,2020,GEN004,URINARY TRACT INFECTIONS,,,463,KIDNEY & URINARY TRACT INFECTIONS,11,DISEASES AND DISORDERS OF THE KIDNEY AND URINARY TRACT,2,Moderate,Minor,Medical,Private Health Insurance,,,,,Y,23090.91,7460.5
New York City,Manhattan,7002053,001463,NYU Langone Hospitals,0 to 17,100,M,Other Race,Not Span/Hispanic,2,Emergency,Home or Self Care,2020,GEN004,URINARY TRACT INFECTIONS,CNS002,LUMBAR PUNCTURE,463,KIDNEY & URINARY TRACT INFECTIONS,11,DISEASES AND DISORDERS OF THE KIDNEY AND URINARY TRACT,1,Minor,Minor,Medical,Private Health Insurance,,,,,Y,25926.02,5990.58
New York City,Manhattan,7002053,001463,NYU Langone Hospitals,70 or Older,112,F,White,Not Span/Hispanic,1,Emergency,Home or Self Care,2020,GEN004,URINARY TRACT INFECTIONS,,,463,KIDNEY & URINARY TRACT INFECTIONS,11,DISEASES AND DISORDERS OF THE KIDNEY AND URINARY TRACT,3,Major,Moderate,Medical,Medicare,Medicaid,,,,Y,40282.13,10139.5
New York City,Manhattan,7002053,001463,NYU Langone Hospitals,30 to 49,,M,Other Race,Not Span/Hispanic,2,Emergency,Home or Self Care,2020,GEN004,URINARY TRACT INFECTIONS,URN003,URETER AND OTHER URINARY TRACT DILATION,463,KIDNEY & URINARY TRACT INFECTIONS,11,DISEASES AND DISORDERS OF THE KIDNEY AND URINARY TRACT,1,Minor,Minor,Medical,Private Health Insurance,,,,,Y,54434.02,11421.87
New York City,Manhattan,7002053,001463,NYU Langone Hospitals,50 to 69,112,F,White,Not Span/Hispanic,5,Emergency,Home w/ Home Health Services,2020,GEN004,URINARY TRACT INFECTIONS,HEP007,BILIARY AND PANCREATIC CALCULUS REMOVAL,463,KIDNEY & URINARY TRACT INFECTIONS,11,DISEASES AND DISORDERS OF THE KIDNEY AND URINARY TRACT,2,Moderate,Major,Medical,Medicare,Medicaid,,,,Y,108830.33,23704.2
New York City,Manhattan,7002053,001463,NYU Langone Hospitals,70 or Older,117,F,White,Not Span/Hispanic,1,Emergency,Home w/ Home Health Services,2020,GEN004,URINARY TRACT INFECTIONS,,,463,KIDNEY & URINARY TRACT INFECTIONS,11,DISEASES AND DISORDERS OF THE KIDNEY AND URINARY TRACT,3,Major,Major,Medical,Medicare,Blue Cross/Blue Shield,,,,Y,15385.19,4181.26
New York City,Manhattan,7002053,001463,NYU Langone Hospitals,50 to 69,112,M,Other Race,Spanish/Hispanic,1,Emergency,Home w/ Home Health Services,2020,GEN004,URINARY TRACT INFECTIONS,,,463,KIDNEY & URINARY TRACT INFECTIONS,11,DISEASES AND DISORDERS OF THE KIDNEY AND URINARY TRACT,3,Major,Major,Medical,Medicare,Medicaid,,,,Y,48541.16,10874.5
New York City,Manhattan,7002053,001463,NYU Langone Hospitals,50 to 69,103,M,White,Not Span/Hispanic,3,Emergency,Home or Self Care,2020,GEN004,URINARY TRACT INFECTIONS,ADM018,IRRIGATION (DIAGNOSTIC AND THERAPEUTIC),463,KIDNEY & URINARY TRACT INFECTIONS,11,DISEASES AND DISORDERS OF THE KIDNEY AND URINARY TRACT,2,Moderate,Moderate,Medical,Private Health Insurance,,,,,Y,68520.71,20858.17
New York City,Manhattan,7002053,001463,NYU Langone Hospitals,70 or Older,112,F,White,Not Span/Hispanic,3,Emergency,Skilled Nursing Home,2020,GEN004,URINARY TRACT INFECTIONS,OTR004,ISOLATION PROCEDURES,463,KIDNEY & URINARY TRACT INFECTIONS,11,DISEASES AND DISORDERS OF THE KIDNEY AND URINARY TRACT,3,Major,Minor,Medical,Medicare,Blue Cross/Blue Shield,,,,Y,74272.07,15260.05
New York City,Manhattan,7002053,001463,NYU Langone Hospitals,50 to 69,112,F,Black/African American,Not Span/Hispanic,7,Emergency,Skilled Nursing Home,2020,GEN004,URINARY TRACT INFECTIONS,,,463,KIDNEY & URINARY TRACT INFECTIONS,11,DISEASES AND DISORDERS OF THE KIDNEY AND URINARY TRACT,3,Major,Moderate,Medical,Medicare,Medicaid,,,,Y,67417.31,23567.11
New York City,Manhattan,7002053,001463,NYU Langone Hospitals,30 to 49,100,F,White,Not Span/Hispanic,1,Emergency,Home or Self Care,2020,GEN004,URINARY TRACT INFECTIONS,,,463,KIDNEY & URINARY TRACT INFECTIONS,11,DISEASES AND DISORDERS OF THE KIDNEY AND URINARY TRACT,1,Minor,Minor,Medical,Blue Cross/Blue Shield,,,,,Y,57877.25,12989.49
New York City,Manhattan,7002053,001463,NYU Langone Hospitals,70 or Older,100,M,Other Race,Spanish/Hispanic,5,Emergency,Home w/ Home Health Services,2020,GEN004,URINARY TRACT INFECTIONS,,,463,KIDNEY & URINARY TRACT INFECTIONS,11,DISEASES AND DISORDERS OF THE KIDNEY AND URINARY TRACT,3,Major,Major,Medical,Medicare,,,,,Y,58382.82,17259.69
New York City,Manhattan,7002053,001463,NYU Langone Hospitals,70 or Older,100,M,White,Not Span/Hispanic,1,Emergency,Home w/ Home Health Services,2020,GEN004,URINARY TRACT INFECTIONS,,,463,KIDNEY & URINARY TRACT INFECTIONS,11,DISEASES AND DISORDERS OF THE KIDNEY AND URINARY TRACT,2,Moderate,Minor,Medical,Medicaid,,,,,Y,27122.06,8081.24
New York City,Manhattan,7002053,001463,NYU Langone Hospitals,50 to 69,112,M,Other Race,Not Span/Hispanic,1,Emergency,Home or Self Care,2020,GEN004,URINARY TRACT INFECTIONS,,,463,KIDNEY & URINARY TRACT INFECTIONS,11,DISEASES AND DISORDERS OF THE KIDNEY AND URINARY TRACT,2,Moderate,Minor,Medical,Medicaid,,,,,Y,25240.3,7947.02
New York City,Manhattan,7002053,001463,NYU Langone Hospitals,0 to 17,112,F,White,Not Span/Hispanic,4,Emergency,Home or Self Care,2020,GEN004,URINARY TRACT INFECTIONS,,,463,KIDNEY & URINARY TRACT INFECTIONS,11,DISEASES AND DISORDERS OF THE KIDNEY AND URINARY TRACT,2,Moderate,Minor,Medical,Private Health Insurance,,,,,Y,36406.96,9974.92
New York City,Manhattan,7002053,001463,NYU Langone Hospitals,70 or Older,112,F,White,Not Span/Hispanic,3,Emergency,Home w/ Home Health Services,2020,GEN004,URINARY TRACT INFECTIONS,CAR024,VENOUS AND ARTERIAL CATHETER PLACEMENT,463,KIDNEY & URINARY TRACT INFECTIONS,11,DISEASES AND DISORDERS OF THE KIDNEY AND URINARY TRACT,3,Major,Major,Medical,Medicare,Medicaid,,,,Y,49190.66,12384.66
New York City,Manhattan,7002053,001463,NYU Langone Hospitals,18 to 29,100,F,Other Race,Unknown,3,Emergency,Home or Self Care,2020,GEN004,URINARY TRACT INFECTIONS,,,463,KIDNEY & URINARY TRACT INFECTIONS,11,DISEASES AND DISORDERS OF THE KIDNEY AND URINARY TRACT,2,Moderate,Moderate,Medical,Blue Cross/Blue Shield,,,,,Y,48087.62,12571.21
New York City,Manhattan,7002053,001463,NYU Langone Hospitals,0 to 17,112,F,White,Not Span/Hispanic,2,Emergency,Home or Self Care,2020,PNL009,PERINATAL INFECTIONS,,,463,KIDNEY & URINARY TRACT INFECTIONS,11,DISEASES AND DISORDERS OF THE KIDNEY AND URINARY TRACT,2,Moderate,Minor,Medical,Medicaid,,,03500,,Y,25160.28,5786.47
New York City,Manhattan,7002053,001463,NYU Langone Hospitals,70 or Older,100,M,White,Not Span/Hispanic,4,Emergency,Skilled Nursing Home,2020,GEN004,URINARY TRACT INFECTIONS,SKB006,SKIN LACERATION REPAIR (EXCLUDING PERINEUM),463,KIDNEY & URINARY TRACT INFECTIONS,11,DISEASES AND DISORDERS OF THE KIDNEY AND URINARY TRACT,3,Major,Minor,Medical,Medicare,Medicaid,,,,Y,59530.57,19931.91
New York City,Manhattan,7002053,001463,NYU Langone Hospitals,70 or Older,112,M,White,Not Span/Hispanic,2,Emergency,Home w/ Home Health Services,2020,GEN004,URINARY TRACT INFECTIONS,,,463,KIDNEY & URINARY TRACT INFECTIONS,11,DISEASES AND DISORDERS OF THE KIDNEY AND URINARY TRACT,2,Moderate,Moderate,Medical,Medicare,Blue Cross/Blue Shield,Medicaid,,,Y,48672.24,9513.05
New York City,Manhattan,7002053,001463,NYU Langone Hospitals,70 or Older,100,F,White,Not Span/Hispanic,3,Emergency,Home w/ Home Health Services,2020,GEN004,URINARY TRACT INFECTIONS,MAM006,PACEMAKER AND DEFIBRILLATOR INTERROGATION,463,KIDNEY & URINARY TRACT INFECTIONS,11,DISEASES AND DISORDERS OF THE KIDNEY AND URINARY TRACT,2,Moderate,Moderate,Medical,Medicare,Medicare,,,,Y,47177.79,17242.49
New York City,Manhattan,7002053,001463,NYU Langone Hospitals,70 or Older,100,M,White,Not Span/Hispanic,1,Emergency,Home or Self Care,2020,GEN004,URINARY TRACT INFECTIONS,,,463,KIDNEY & URINARY TRACT INFECTIONS,11,DISEASES AND DISORDERS OF THE KIDNEY AND URINARY TRACT,2,Moderate,Moderate,Medical,Medicare,Private Health Insurance,,,,Y,56317.6,12690.46
New York City,Manhattan,7002053,001463,NYU Langone Hospitals,0 to 17,112,M,White,Not Span/Hispanic,2,Emergency,Home or Self Care,2020,GEN004,URINARY TRACT INFECTIONS,,,463,KIDNEY & URINARY TRACT INFECTIONS,11,DISEASES AND DISORDERS OF THE KIDNEY AND URINARY TRACT,2,Moderate,Minor,Medical,Private Health Insurance,,,,,Y,37334.91,7411.09
New York City,Manhattan,7002053,001463,NYU Langone Hospitals,50 to 69,112,F,White,Not Span/Hispanic,4,Elective,Home or Self Care,2020,GEN004,URINARY TRACT INFECTIONS,URN005,NEPHROSTOMY AND URETEROSTOMY PROCEDURES (INCLUDING STENTS),463,KIDNEY & URINARY TRACT INFECTIONS,11,DISEASES AND DISORDERS OF THE KIDNEY AND URINARY TRACT,3,Major,Minor,Medical,Private Health Insurance,,,,,N,86159.99,16055.76
New York City,Manhattan,7002053,001463,NYU Langone Hospitals,70 or Older,104,M,White,Not Span/Hispanic,3,Emergency,Home w/ Home Health Services,2020,GEN004,URINARY TRACT INFECTIONS,,,463,KIDNEY & URINARY TRACT INFECTIONS,11,DISEASES AND DISORDERS OF THE KIDNEY AND URINARY TRACT,2,Moderate,Major,Medical,Medicare,Medicare,Medicaid,,,Y,43695.78,11997
New York City,Manhattan,7002053,001463,NYU Langone Hospitals,70 or Older,100,F,White,Not Span/Hispanic,3,Emergency,Home w/ Home Health Services,2020,GEN004,URINARY TRACT INFECTIONS,,,463,KIDNEY & URINARY TRACT INFECTIONS,11,DISEASES AND DISORDERS OF THE KIDNEY AND URINARY TRACT,2,Moderate,Moderate,Medical,Medicare,Medicare,,,,Y,47401.75,15689.36
New York City,Manhattan,7002053,001463,NYU Langone Hospitals,18 to 29,104,F,Other Race,Not Span/Hispanic,1,Emergency,Home or Self Care,2020,INF010,SEXUALLY TRANSMITTED INFECTIONS (EXCLUDING HIV AND HEPATITIS),,,463,KIDNEY & URINARY TRACT INFECTIONS,11,DISEASES AND DISORDERS OF THE KIDNEY AND URINARY TRACT,2,Moderate,Minor,Medical,Medicaid,,,,,Y,35069.52,9680.91
New York City,Manhattan,7002053,001463,NYU Langone Hospitals,0 to 17,107,M,Other Race,Not Span/Hispanic,4,Elective,Skilled Nursing Home,2020,GEN004,URINARY TRACT INFECTIONS,ADM017,ADMINISTRATION OF NUTRITIONAL AND ELECTROLYTIC SUBSTANCES,463,KIDNEY & URINARY TRACT INFECTIONS,11,DISEASES AND DISORDERS OF THE KIDNEY AND URINARY TRACT,3,Major,Moderate,Medical,Medicaid,,,,,N,53347.5,17634.8
New York City,Manhattan,7002053,001463,NYU Langone Hospitals,30 to 49,111,F,White,Not Span/Hispanic,2,Emergency,Home or Self Care,2020,GEN004,URINARY TRACT INFECTIONS,,,463,KIDNEY & URINARY TRACT INFECTIONS,11,DISEASES AND DISORDERS OF THE KIDNEY AND URINARY TRACT,1,Minor,Minor,Medical,Private Health Insurance,,,,,Y,49509.06,14653.14
New York City,Manhattan,7002053,001463,NYU Langone Hospitals,50 to 69,112,F,White,Unknown,13,Emergency,Psychiatric Hospital or Unit of Hosp,2020,GEN004,URINARY TRACT INFECTIONS,CAR024,VENOUS AND ARTERIAL CATHETER PLACEMENT,463,KIDNEY & URINARY TRACT INFECTIONS,11,DISEASES AND DISORDERS OF THE KIDNEY AND URINARY TRACT,3,Major,Major,Medical,Medicaid,,,,,Y,141579.26,47048.2
New York City,Manhattan,7002053,001463,NYU Langone Hospitals,70 or Older,100,F,White,Not Span/Hispanic,3,Emergency,Home w/ Home Health Services,2020,GEN004,URINARY TRACT INFECTIONS,,,463,KIDNEY & URINARY TRACT INFECTIONS,11,DISEASES AND DISORDERS OF THE KIDNEY AND URINARY TRACT,3,Major,Major,Medical,Medicare,Medicare,,,,Y,54852.12,17311.79
New York City,Manhattan,7002053,001463,NYU Langone Hospitals,50 to 69,100,M,White,Not Span/Hispanic,2,Emergency,Home or Self Care,2020,GEN004,URINARY TRACT INFECTIONS,,,463,KIDNEY & URINARY TRACT INFECTIONS,11,DISEASES AND DISORDERS OF THE KIDNEY AND URINARY TRACT,1,Minor,Moderate,Medical,Medicaid,,,,,Y,25459.46,7709.31
New York City,Manhattan,7002053,001463,NYU Langone Hospitals,70 or Older,100,F,Black/African American,Unknown,5,Emergency,Home w/ Home Health Services,2020,GEN004,URINARY TRACT INFECTIONS,ADM010,VACCINATIONS,463,KIDNEY & URINARY TRACT INFECTIONS,11,DISEASES AND DISORDERS OF THE KIDNEY AND URINARY TRACT,3,Major,Major,Medical,Medicare,,,,,Y,127223.57,22857.47
New York City,Manhattan,7002053,001463,NYU Langone Hospitals,70 or Older,112,F,White,Not Span/Hispanic,6,Emergency,Home w/ Home Health Services,2020,GEN004,URINARY TRACT INFECTIONS,MAM011,ELECTROENCEPHALOGRAM (EEG),463,KIDNEY & URINARY TRACT INFECTIONS,11,DISEASES AND DISORDERS OF THE KIDNEY AND URINARY TRACT,3,Major,Major,Medical,Medicare,,,,,Y,88088.37,30745.06
New York City,Manhattan,7002053,001463,NYU Langone Hospitals,70 or Older,100,F,Black/African American,Not Span/Hispanic,2,Emergency,Skilled Nursing Home,2020,GEN004,URINARY TRACT INFECTIONS,,,463,KIDNEY & URINARY TRACT INFECTIONS,11,DISEASES AND DISORDERS OF THE KIDNEY AND URINARY TRACT,2,Moderate,Moderate,Medical,Medicare,,,,,Y,40085.63,12910.33
New York City,Manhattan,7002053,001463,NYU Langone Hospitals,70 or Older,112,F,Other Race,Unknown,1,Emergency,Home or Self Care,2020,GEN004,URINARY TRACT INFECTIONS,,,463,KIDNEY & URINARY TRACT INFECTIONS,11,DISEASES AND DISORDERS OF THE KIDNEY AND URINARY TRACT,2,Moderate,Moderate,Medical,Medicare,,,,,Y,29500.99,7323.95
New York City,Manhattan,7002053,001463,NYU Langone Hospitals,30 to 49,112,M,Black/African American,Not Span/Hispanic,4,Emergency,Home or Self Care,2020,GEN004,URINARY TRACT INFECTIONS,,,463,KIDNEY & URINARY TRACT INFECTIONS,11,DISEASES AND DISORDERS OF THE KIDNEY AND URINARY TRACT,3,Major,Major,Medical,Medicaid,,,,,Y,51707.61,14562.5
New York City,Manhattan,7002053,001463,NYU Langone Hospitals,30 to 49,103,M,White,Not Span/Hispanic,1,Emergency,Home or Self Care,2020,GEN004,URINARY TRACT INFECTIONS,,,463,KIDNEY & URINARY TRACT INFECTIONS,11,DISEASES AND DISORDERS OF THE KIDNEY AND URINARY TRACT,2,Moderate,Minor,Medical,Medicaid,,,,,N,67181.9,18932.35
New York City,Manhattan,7002053,001463,NYU Langone Hospitals,70 or Older,100,F,White,Not Span/Hispanic,1,Emergency,Home or Self Care,2020,GEN004,URINARY TRACT INFECTIONS,,,463,KIDNEY & URINARY TRACT INFECTIONS,11,DISEASES AND DISORDERS OF THE KIDNEY AND URINARY TRACT,2,Moderate,Moderate,Medical,Medicare,,,,,Y,36394.13,10278.12
New York City,Manhattan,7002053,001463,NYU Langone Hospitals,18 to 29,100,F,White,Not Span/Hispanic,3,Emergency,Home or Self Care,2020,GEN004,URINARY TRACT INFECTIONS,,,463,KIDNEY & URINARY TRACT INFECTIONS,11,DISEASES AND DISORDERS OF THE KIDNEY AND URINARY TRACT,1,Minor,Minor,Medical,Private Health Insurance,,,,,Y,52424.61,15021.77
New York City,Manhattan,7002053,001463,NYU Langone Hospitals,50 to 69,100,F,White,Not Span/Hispanic,1,Emergency,Home w/ Home Health Services,2020,GEN004,URINARY TRACT INFECTIONS,,,463,KIDNEY & URINARY TRACT INFECTIONS,11,DISEASES AND DISORDERS OF THE KIDNEY AND URINARY TRACT,2,Moderate,Minor,Medical,Private Health Insurance,,,,,Y,25544.44,7937.29
New York City,Manhattan,7002053,001463,NYU Langone Hospitals,50 to 69,112,M,Other Race,Unknown,1,Emergency,Home w/ Home Health Services,2020,GEN004,URINARY TRACT INFECTIONS,,,463,KIDNEY & URINARY TRACT INFECTIONS,11,DISEASES AND DISORDERS OF THE KIDNEY AND URINARY TRACT,2,Moderate,Moderate,Medical,Medicare,Medicaid,,,,Y,33141.53,8661.47
New York City,Manhattan,7002053,001463,NYU Langone Hospitals,70 or Older,100,F,Other Race,Spanish/Hispanic,6,Emergency,Skilled Nursing Home,2020,GEN004,URINARY TRACT INFECTIONS,URN006,BLADDER CATHETERIZATION AND DRAINAGE,463,KIDNEY & URINARY TRACT INFECTIONS,11,DISEASES AND DISORDERS OF THE KIDNEY AND URINARY TRACT,4,Extreme,Extreme,Medical,Medicare,Medicaid,,,,Y,78117.1,21862.36