Hospital Service Area,Hospital County,Operating Certificate Number,Permanent Facility Id,Facility Name,Age Group,Zip Code - 3 digits,Gender,Race,Ethnicity,Length of Stay,Type of Admission,Patient Disposition,Discharge Year,CCS Diagnosis Code,CCS Diagnosis Description,CCS Procedure Code,CCS Procedure Description,APR DRG Code,APR DRG Description,APR MDC Code,APR MDC Description,APR Severity of Illness Code,APR Severity of Illness Description,APR Risk of Mortality,APR Medical Surgical Description,Payment Typology 1,Payment Typology 2,Payment Typology 3,Birth Weight,Abortion Edit Indicator,Emergency Department Indicator,Total Charges,Total Costs
New York City,Manhattan,7002001,001438,Bellevue Hospital Center,50 to 69,100,M,White,Not Span/Hispanic,1,Emergency,Home or Self Care,2019,GEN005,CALCULUS OF URINARY TRACT,ADM021,"ADMINISTRATION OF THERAPEUTIC SUBSTANCES, NEC",465,URINARY STONES & ACQUIRED UPPER URINARY TRACT OBSTRUCTION,11,DISEASES AND DISORDERS OF THE KIDNEY AND URINARY TRACT,1,Minor,Minor,Medical,Self-Pay,,,,,true,6867.34,4564.03
New York City,Manhattan,7002001,001438,Bellevue Hospital Center,18 to 29,112,F,Black/African American,Not Span/Hispanic,5,Emergency,Home or Self Care,2019,GEN006,OTHER SPECIFIED AND UNSPECIFIED DISEASES OF KIDNEY AND URETERS,URN003,URETER AND OTHER URINARY TRACT DILATION,465,URINARY STONES & ACQUIRED UPPER URINARY TRACT OBSTRUCTION,11,DISEASES AND DISORDERS OF THE KIDNEY AND URINARY TRACT,3,Major,Moderate,Medical,Self-Pay,,,,,true,32964.69,21908.33
New York City,Manhattan,7002001,001438,Bellevue Hospital Center,50 to 69,112,F,Other Race,Spanish/Hispanic,1,Emergency,Home or Self Care,2019,GEN006,OTHER SPECIFIED AND UNSPECIFIED DISEASES OF KIDNEY AND URETERS,CAR024,VENOUS AND ARTERIAL CATHETER PLACEMENT,465,URINARY STONES & ACQUIRED UPPER URINARY TRACT OBSTRUCTION,11,DISEASES AND DISORDERS OF THE KIDNEY AND URINARY TRACT,2,Moderate,Minor,Medical,Medicaid,Medicaid,,,,true,7058.96,4691.38
New York City,Manhattan,7002001,001438,Bellevue Hospital Center,30 to 49,112,F,Other Race,Not Span/Hispanic,1,Elective,Home or Self Care,2019,GEN006,OTHER SPECIFIED AND UNSPECIFIED DISEASES OF KIDNEY AND URETERS,URN005,NEPHROSTOMY AND URETEROSTOMY PROCEDURES (INCLUDING STENTS),465,URINARY STONES & ACQUIRED UPPER URINARY TRACT OBSTRUCTION,11,DISEASES AND DISORDERS OF THE KIDNEY AND URINARY TRACT,2,Moderate,Minor,Medical,Medicaid,,,,,false,6406.92,4258.04
New York City,Manhattan,7002001,001438,Bellevue Hospital Center,30 to 49,113,M,Other Race,Not Span/Hispanic,1,Emergency,Home or Self Care,2019,GEN006,OTHER SPECIFIED AND UNSPECIFIED DISEASES OF KIDNEY AND URETERS,,,465,URINARY STONES & ACQUIRED UPPER URINARY TRACT OBSTRUCTION,11,DISEASES AND DISORDERS OF THE KIDNEY AND URINARY TRACT,2,Moderate,Moderate,Medical,Medicaid,,,,,true,8044.22,5346.19
New York City,Manhattan,7002001,001438,Bellevue Hospital Center,30 to 49,112,F,Other Race,Not Span/Hispanic,5,Emergency,Home or Self Care,2019,GEN005,CALCULUS OF URINARY TRACT,URN003,URETER AND OTHER URINARY TRACT DILATION,465,URINARY STONES & ACQUIRED UPPER URINARY TRACT OBSTRUCTION,11,DISEASES AND DISORDERS OF THE KIDNEY AND URINARY TRACT,4,Extreme,Extreme,Medical,Self-Pay,,,,,false,32710.98,21739.72
New York City,Manhattan,7002001,001438,Bellevue Hospital Center,50 to 69,OOS,M,Other Race,Not Span/Hispanic,2,Emergency,Home or Self Care,2019,GEN006,OTHER SPECIFIED AND UNSPECIFIED DISEASES OF KIDNEY AND URETERS,IMG008,ULTRASONOGRAPHY,465,URINARY STONES & ACQUIRED UPPER URINARY TRACT OBSTRUCTION,11,DISEASES AND DISORDERS OF THE KIDNEY AND URINARY TRACT,2,Moderate,Minor,Medical,Blue Cross/Blue Shield,,,,,false,13428.97,8924.89
New York City,Manhattan,7002001,001438,Bellevue Hospital Center,70 or Older,112,M,Black/African American,Not Span/Hispanic,3,Emergency,Home or Self Care,2019,GEN006,OTHER SPECIFIED AND UNSPECIFIED DISEASES OF KIDNEY AND URETERS,URN003,URETER AND OTHER URINARY TRACT DILATION,465,URINARY STONES & ACQUIRED UPPER URINARY TRACT OBSTRUCTION,11,DISEASES AND DISORDERS OF THE KIDNEY AND URINARY TRACT,3,Major,Major,Medical,Medicaid,Medicaid,,,,true,16670.19,11079.01
New York City,Manhattan,7002001,001438,Bellevue Hospital Center,30 to 49,100,M,Other Race,Spanish/Hispanic,1,Elective,Home or Self Care,2019,GEN005,CALCULUS OF URINARY TRACT,URN004,REMOVAL OF CALCULI AND OTHER MATTER FROM URINARY TRACT,465,URINARY STONES & ACQUIRED UPPER URINARY TRACT OBSTRUCTION,11,DISEASES AND DISORDERS OF THE KIDNEY AND URINARY TRACT,3,Major,Moderate,Medical,Self-Pay,,,,,false,2975.87,1977.76
New York City,Manhattan,7002001,001438,Bellevue Hospital Center,30 to 49,114,F,Other Race,Spanish/Hispanic,2,Emergency,Home or Self Care,2019,GEN005,CALCULUS OF URINARY TRACT,URN003,URETER AND OTHER URINARY TRACT DILATION,465,URINARY STONES & ACQUIRED UPPER URINARY TRACT OBSTRUCTION,11,DISEASES AND DISORDERS OF THE KIDNEY AND URINARY TRACT,2,Moderate,Minor,Medical,Medicaid,,,,,true,15187.94,10093.9
New York City,Manhattan,7002001,001438,Bellevue Hospital Center,50 to 69,112,M,Other Race,Spanish/Hispanic,2,Emergency,Home or Self Care,2019,GEN005,CALCULUS OF URINARY TRACT,IMG008,ULTRASONOGRAPHY,465,URINARY STONES & ACQUIRED UPPER URINARY TRACT OBSTRUCTION,11,DISEASES AND DISORDERS OF THE KIDNEY AND URINARY TRACT,2,Moderate,Minor,Medical,Self-Pay,,,,,true,14657.05,9741.08
New York City,Manhattan,7002001,001438,Bellevue Hospital Center,50 to 69,104,M,Black/African American,Not Span/Hispanic,5,Elective,Home or Self Care,2019,GEN006,OTHER SPECIFIED AND UNSPECIFIED DISEASES OF KIDNEY AND URETERS,URN005,NEPHROSTOMY AND URETEROSTOMY PROCEDURES (INCLUDING STENTS),465,URINARY STONES & ACQUIRED UPPER URINARY TRACT OBSTRUCTION,11,DISEASES AND DISORDERS OF THE KIDNEY AND URINARY TRACT,2,Moderate,Major,Medical,Medicare,Medicaid,,,,false,44721.92,29722.19
New York City,Manhattan,7002001,001438,Bellevue Hospital Center,18 to 29,112,F,Other Race,Spanish/Hispanic,1,Elective,Home or Self Care,2019,GEN005,CALCULUS OF URINARY TRACT,ADM015,ADMINISTRATION OF ANTIBIOTICS,465,URINARY STONES & ACQUIRED UPPER URINARY TRACT OBSTRUCTION,11,DISEASES AND DISORDERS OF THE KIDNEY AND URINARY TRACT,1,Minor,Minor,Medical,Medicare,Medicaid,,,,false,6110,4060.71
New York City,Manhattan,7002001,001438,Bellevue Hospital Center,50 to 69,100,M,Other Race,Spanish/Hispanic,1,Emergency,Home or Self Care,2019,GEN006,OTHER SPECIFIED AND UNSPECIFIED DISEASES OF KIDNEY AND URETERS,IMG007,COMPUTERIZED TOMOGRAPHY (CT) WITHOUT CONTRAST,465,URINARY STONES & ACQUIRED UPPER URINARY TRACT OBSTRUCTION,11,DISEASES AND DISORDERS OF THE KIDNEY AND URINARY TRACT,2,Moderate,Minor,Medical,Medicaid,,,,,true,8594.45,5711.87
New York City,Manhattan,7002001,001438,Bellevue Hospital Center,50 to 69,100,M,Other Race,Spanish/Hispanic,1,Emergency,Home or Self Care,2019,GEN006,OTHER SPECIFIED AND UNSPECIFIED DISEASES OF KIDNEY AND URETERS,URN003,URETER AND OTHER URINARY TRACT DILATION,465,URINARY STONES & ACQUIRED UPPER URINARY TRACT OBSTRUCTION,11,DISEASES AND DISORDERS OF THE KIDNEY AND URINARY TRACT,2,Moderate,Minor,Medical,Private Health Insurance,,,,,true,23570.82,15665.17
New York City,Manhattan,7002001,001438,Bellevue Hospital Center,50 to 69,OOS,M,White,Not Span/Hispanic,2,Emergency,Home or Self Care,2019,GEN006,OTHER SPECIFIED AND UNSPECIFIED DISEASES OF KIDNEY AND URETERS,URN003,URETER AND OTHER URINARY TRACT DILATION,465,URINARY STONES & ACQUIRED UPPER URINARY TRACT OBSTRUCTION,11,DISEASES AND DISORDERS OF THE KIDNEY AND URINARY TRACT,2,Moderate,Minor,Medical,Private Health Insurance,,,,,true,27779.29,18462.12
New York City,Manhattan,7002001,001438,Bellevue Hospital Center,30 to 49,114,F,White,Spanish/Hispanic,2,Emergency,Home or Self Care,2019,GEN006,OTHER SPECIFIED AND UNSPECIFIED DISEASES OF KIDNEY AND URETERS,URN003,URETER AND OTHER URINARY TRACT DILATION,465,URINARY STONES & ACQUIRED UPPER URINARY TRACT OBSTRUCTION,11,DISEASES AND DISORDERS OF THE KIDNEY AND URINARY TRACT,2,Moderate,Minor,Medical,Private Health Insurance,,,,,true,24032.87,15972.25
New York City,Manhattan,7002001,001438,Bellevue Hospital Center,30 to 49,112,M,Other Race,Spanish/Hispanic,1,Emergency,Home or Self Care,2019,GEN005,CALCULUS OF URINARY TRACT,URN003,URETER AND OTHER URINARY TRACT DILATION,465,URINARY STONES & ACQUIRED UPPER URINARY TRACT OBSTRUCTION,11,DISEASES AND DISORDERS OF THE KIDNEY AND URINARY TRACT,2,Moderate,Minor,Medical,Medicaid,,,,,true,17304.67,11500.68
New York City,Manhattan,7002001,001438,Bellevue Hospital Center,30 to 49,100,M,Other Race,Not Span/Hispanic,4,Elective,Medicaid Cert Nursing Facility,2019,GEN006,OTHER SPECIFIED AND UNSPECIFIED DISEASES OF KIDNEY AND URETERS,URN003,URETER AND OTHER URINARY TRACT DILATION,465,URINARY STONES & ACQUIRED UPPER URINARY TRACT OBSTRUCTION,11,DISEASES AND DISORDERS OF THE KIDNEY AND URINARY TRACT,3,Major,Moderate,Medical,Medicaid,,,,,false,39713.41,26393.53
New York City,Manhattan,7002001,001438,Bellevue Hospital Center,30 to 49,100,M,Other Race,Spanish/Hispanic,1,Emergency,Home or Self Care,2019,GEN006,OTHER SPECIFIED AND UNSPECIFIED DISEASES OF KIDNEY AND URETERS,URN003,URETER AND OTHER URINARY TRACT DILATION,465,URINARY STONES & ACQUIRED UPPER URINARY TRACT OBSTRUCTION,11,DISEASES AND DISORDERS OF THE KIDNEY AND URINARY TRACT,2,Moderate,Minor,Medical,Medicaid,,,,,true,17957.87,11934.8
New York City,Manhattan,7002001,001438,Bellevue Hospital Center,0 to 17,112,M,Black/African American,Not Span/Hispanic,1,Urgent,Home or Self Care,2019,GEN006,OTHER SPECIFIED AND UNSPECIFIED DISEASES OF KIDNEY AND URETERS,,,465,URINARY STONES & ACQUIRED UPPER URINARY TRACT OBSTRUCTION,11,DISEASES AND DISORDERS OF THE KIDNEY AND URINARY TRACT,2,Moderate,Minor,Medical,Medicaid,,,,,false,5520,3668.59
New York City,Manhattan,7002001,001438,Bellevue Hospital Center,50 to 69,100,M,Other Race,Not Span/Hispanic,1,Emergency,Home or Self Care,2019,GEN005,CALCULUS OF URINARY TRACT,IMG007,COMPUTERIZED TOMOGRAPHY (CT) WITHOUT CONTRAST,465,URINARY STONES & ACQUIRED UPPER URINARY TRACT OBSTRUCTION,11,DISEASES AND DISORDERS OF THE KIDNEY AND URINARY TRACT,3,Major,Moderate,Medical,Private Health Insurance,,,,,true,10145.18,6742.49
New York City,Manhattan,7002001,001438,Bellevue Hospital Center,0 to 17,112,F,Other Race,Spanish/Hispanic,1,Emergency,Home or Self Care,2019,GEN006,OTHER SPECIFIED AND UNSPECIFIED DISEASES OF KIDNEY AND URETERS,ADM017,ADMINISTRATION OF NUTRITIONAL AND ELECTROLYTIC SUBSTANCES,465,URINARY STONES & ACQUIRED UPPER URINARY TRACT OBSTRUCTION,11,DISEASES AND DISORDERS OF THE KIDNEY AND URINARY TRACT,2,Moderate,Minor,Medical,Medicaid,,,,,true,10574.02,7027.49
New York City,Manhattan,7002001,001438,Bellevue Hospital Center,50 to 69,112,M,Other Race,Not Span/Hispanic,1,Emergency,Home or Self Care,2019,GEN005,CALCULUS OF URINARY TRACT,URN003,URETER AND OTHER URINARY TRACT DILATION,465,URINARY STONES & ACQUIRED UPPER URINARY TRACT OBSTRUCTION,11,DISEASES AND DISORDERS OF THE KIDNEY AND URINARY TRACT,3,Major,Moderate,Medical,Medicaid,,,,,true,26920.07,17891.08
New York City,Manhattan,7002001,001438,Bellevue Hospital Center,50 to 69,100,M,White,Not Span/Hispanic,1,Emergency,Home or Self Care,2019,GEN005,CALCULUS OF URINARY TRACT,URN003,URETER AND OTHER URINARY TRACT DILATION,465,URINARY STONES & ACQUIRED UPPER URINARY TRACT OBSTRUCTION,11,DISEASES AND DISORDERS OF THE KIDNEY AND URINARY TRACT,1,Minor,Minor,Medical,Private Health Insurance,,,,,true,19913.1,13234.25
New York City,Manhattan,7002001,001438,Bellevue Hospital Center,18 to 29,112,M,Other Race,Spanish/Hispanic,1,Urgent,Home or Self Care,2019,GEN006,OTHER SPECIFIED AND UNSPECIFIED DISEASES OF KIDNEY AND URETERS,URN005,NEPHROSTOMY AND URETEROSTOMY PROCEDURES (INCLUDING STENTS),465,URINARY STONES & ACQUIRED UPPER URINARY TRACT OBSTRUCTION,11,DISEASES AND DISORDERS OF THE KIDNEY AND URINARY TRACT,2,Moderate,Minor,Medical,Medicaid,,,,,false,8733.59,5804.34
New York City,Manhattan,7002001,001438,Bellevue Hospital Center,50 to 69,112,F,Black/African American,Unknown,1,Elective,Home or Self Care,2019,GEN006,OTHER SPECIFIED AND UNSPECIFIED DISEASES OF KIDNEY AND URETERS,ADM021,"ADMINISTRATION OF THERAPEUTIC SUBSTANCES, NEC",465,URINARY STONES & ACQUIRED UPPER URINARY TRACT OBSTRUCTION,11,DISEASES AND DISORDERS OF THE KIDNEY AND URINARY TRACT,2,Moderate,Moderate,Medical,Medicare,,,,,false,9555.04,6350.28
New York City,Manhattan,7002001,001438,Bellevue Hospital Center,30 to 49,113,F,Other Race,Spanish/Hispanic,1,Emergency,Home or Self Care,2019,GEN006,OTHER SPECIFIED AND UNSPECIFIED DISEASES OF KIDNEY AND URETERS,URN003,URETER AND OTHER URINARY TRACT DILATION,465,URINARY STONES & ACQUIRED UPPER URINARY TRACT OBSTRUCTION,11,DISEASES AND DISORDERS OF THE KIDNEY AND URINARY TRACT,2,Moderate,Minor,Medical,Private Health Insurance,,,,,true,15667.25,10412.45
New York City,Manhattan,7002001,001438,Bellevue Hospital Center,50 to 69,112,F,Black/African American,Not Span/Hispanic,1,Emergency,Home or Self Care,2019,GEN006,OTHER SPECIFIED AND UNSPECIFIED DISEASES OF KIDNEY AND URETERS,GNR010,"GENITOURINARY TRACT PROCEDURES, NEC",465,URINARY STONES & ACQUIRED UPPER URINARY TRACT OBSTRUCTION,11,DISEASES AND DISORDERS OF THE KIDNEY AND URINARY TRACT,2,Moderate,Minor,Medical,Medicaid,,,,,true,14070.72,9351.4
New York City,Manhattan,7002001,001438,Bellevue Hospital Center,30 to 49,100,F,Other Race,Not Span/Hispanic,3,Emergency,Home or Self Care,2019,GEN006,OTHER SPECIFIED AND UNSPECIFIED DISEASES OF KIDNEY AND URETERS,IMG006,COMPUTERIZED TOMOGRAPHY (CT) WITH CONTRAST,465,URINARY STONES & ACQUIRED UPPER URINARY TRACT OBSTRUCTION,11,DISEASES AND DISORDERS OF THE KIDNEY AND URINARY TRACT,2,Moderate,Minor,Medical,Medicaid,,,,,true,27828.37,18494.73
New York City,Manhattan,7002001,001438,Bellevue Hospital Center,30 to 49,103,M,Other Race,Spanish/Hispanic,1,Emergency,Home or Self Care,2019,GEN006,OTHER SPECIFIED AND UNSPECIFIED DISEASES OF KIDNEY AND URETERS,IMG006,COMPUTERIZED TOMOGRAPHY (CT) WITH CONTRAST,465,URINARY STONES & ACQUIRED UPPER URINARY TRACT OBSTRUCTION,11,DISEASES AND DISORDERS OF THE KIDNEY AND URINARY TRACT,2,Moderate,Moderate,Medical,Medicaid,,,,,true,9955.93,6616.71
New York City,Manhattan,7002001,001438,Bellevue Hospital Center,50 to 69,112,F,Black/African American,Unknown,4,Urgent,Home or Self Care,2019,GEN006,OTHER SPECIFIED AND UNSPECIFIED DISEASES OF KIDNEY AND URETERS,IMG007,COMPUTERIZED TOMOGRAPHY (CT) WITHOUT CONTRAST,465,URINARY STONES & ACQUIRED UPPER URINARY TRACT OBSTRUCTION,11,DISEASES AND DISORDERS OF THE KIDNEY AND URINARY TRACT,4,Extreme,Major,Medical,Private Health Insurance,,,,,false,27802.64,18477.63
