Hospital Service Area,Hospital County,Operating Certificate Number,Permanent Facility Id,Facility Name,Age Group,Zip Code - 3 digits,Gender,Race,Ethnicity,Length of Stay,Type of Admission,Patient Disposition,Discharge Year,CCS Diagnosis Code,CCS Diagnosis Description,CCS Procedure Code,CCS Procedure Description,APR DRG Code,APR DRG Description,APR MDC Code,APR MDC Description,APR Severity of Illness Code,APR Severity of Illness Description,APR Risk of Mortality,APR Medical Surgical Description,Payment Typology 1,Payment Typology 2,Payment Typology 3,Birth Weight,Abortion Edit Indicator,Emergency Department Indicator,Total Charges,Total Costs
Long Island,Nassau,2908000,000511,NYU Winthrop Hospital,70 or Older,115,M,White,Not Span/Hispanic,8,Emergency,Skilled Nursing Home,2017,237,Complication of device; implant or graft,000,NO PROC,466,"Malfunction, reaction, complic of genitourinary device or proc",11,Diseases and Disorders of the Kidney and Urinary Tract,4,Extreme,Extreme,Medical,Medicare,Medicare,Blue Cross/Blue Shield,,N,Y,110314.42,27004.30
Long Island,Nassau,2908000,000511,NYU Winthrop Hospital,50 to 69,117,F,Black/African American,Not Span/Hispanic,4,Emergency,Home or Self Care,2017,237,Complication of device; implant or graft,000,NO PROC,466,"Malfunction, reaction, complic of genitourinary device or proc",11,Diseases and Disorders of the Kidney and Urinary Tract,3,Major,Minor,Medical,Federal/State/Local/VA,,,,N,Y,50056.37,10683.12
Long Island,Nassau,2908000,000511,NYU Winthrop Hospital,50 to 69,117,M,White,Not Span/Hispanic,5,Emergency,Hospice - Medical Facility,2017,237,Complication of device; implant or graft,222,BLOOD TRANSFUSION,466,"Malfunction, reaction, complic of genitourinary device or proc",11,Diseases and Disorders of the Kidney and Urinary Tract,4,Extreme,Major,Medical,Medicare,Medicare,,,N,Y,51633.33,10712.64
Long Island,Nassau,2908000,000511,NYU Winthrop Hospital,70 or Older,115,M,White,Not Span/Hispanic,14,Emergency,Skilled Nursing Home,2017,237,Complication of device; implant or graft,222,BLOOD TRANSFUSION,466,"Malfunction, reaction, complic of genitourinary device or proc",11,Diseases and Disorders of the Kidney and Urinary Tract,3,Major,Major,Medical,Medicare,Medicare,Medicaid,,N,Y,80724.24,19168.50
Long Island,Nassau,2908000,000511,NYU Winthrop Hospital,70 or Older,115,M,White,Not Span/Hispanic,6,Emergency,Home w/ Home Health Services,2017,237,Complication of device; implant or graft,000,NO PROC,466,"Malfunction, reaction, complic of genitourinary device or proc",11,Diseases and Disorders of the Kidney and Urinary Tract,3,Major,Moderate,Medical,Medicare,Medicare,Blue Cross/Blue Shield,,N,Y,53284.37,12898.47
Long Island,Nassau,2908000,000511,NYU Winthrop Hospital,70 or Older,115,F,White,Not Span/Hispanic,4,Emergency,Home w/ Home Health Services,2017,237,Complication of device; implant or graft,000,NO PROC,466,"Malfunction, reaction, complic of genitourinary device or proc",11,Diseases and Disorders of the Kidney and Urinary Tract,2,Moderate,Major,Medical,Medicare,Medicare,,,N,Y,36057.15,7199.95
Long Island,Nassau,2908000,000511,NYU Winthrop Hospital,50 to 69,117,M,White,Not Span/Hispanic,6,Emergency,Home or Self Care,2017,238,Complications of surgical procedures or medical care,088,ABDOMINAL PARACENTESIS,466,"Malfunction, reaction, complic of genitourinary device or proc",11,Diseases and Disorders of the Kidney and Urinary Tract,2,Moderate,Minor,Medical,Private Health Insurance,,,,N,Y,73997.01,17954.50
Long Island,Nassau,2908000,000511,NYU Winthrop Hospital,70 or Older,115,F,White,Not Span/Hispanic,8,Emergency,Home w/ Home Health Services,2017,237,Complication of device; implant or graft,174,OT NON-OR THER PRC SKIN,466,"Malfunction, reaction, complic of genitourinary device or proc",11,Diseases and Disorders of the Kidney and Urinary Tract,3,Major,Moderate,Medical,Medicare,Medicare,Private Health Insurance,,N,Y,65137.33,17554.41
Long Island,Nassau,2908000,000511,NYU Winthrop Hospital,70 or Older,115,M,White,Spanish/Hispanic,6,Emergency,Home w/ Home Health Services,2017,237,Complication of device; implant or graft,000,NO PROC,466,"Malfunction, reaction, complic of genitourinary device or proc",11,Diseases and Disorders of the Kidney and Urinary Tract,2,Moderate,Major,Medical,Private Health Insurance,Medicare,Medicare,,N,Y,39981.33,9527.09
Long Island,Nassau,2908000,000511,NYU Winthrop Hospital,30 to 49,113,M,White,Spanish/Hispanic,4,Emergency,Home or Self Care,2017,238,Complications of surgical procedures or medical care,168,"INCIS/DRAIN, SKIN/SUBCU",466,"Malfunction, reaction, complic of genitourinary device or proc",11,Diseases and Disorders of the Kidney and Urinary Tract,1,Minor,Minor,Medical,Private Health Insurance,,,,N,Y,46595.92,10479.52
Long Island,Nassau,2908000,000511,NYU Winthrop Hospital,50 to 69,115,F,White,Not Span/Hispanic,13,Emergency,Home w/ Home Health Services,2017,237,Complication of device; implant or graft,222,BLOOD TRANSFUSION,466,"Malfunction, reaction, complic of genitourinary device or proc",11,Diseases and Disorders of the Kidney and Urinary Tract,3,Major,Major,Medical,Medicare,Medicare,Private Health Insurance,,N,Y,113347.64,22643.20
Long Island,Nassau,2908000,000511,NYU Winthrop Hospital,50 to 69,110,M,White,Not Span/Hispanic,9,Emergency,Home w/ Home Health Services,2017,237,Complication of device; implant or graft,054,OT VASC CATH; NOT HEART,466,"Malfunction, reaction, complic of genitourinary device or proc",11,Diseases and Disorders of the Kidney and Urinary Tract,3,Major,Major,Medical,Blue Cross/Blue Shield,Medicare,Medicaid,,N,Y,64872.84,17577.96
Long Island,Nassau,2908000,000511,NYU Winthrop Hospital,30 to 49,115,M,White,Spanish/Hispanic,4,Emergency,Home or Self Care,2017,237,Complication of device; implant or graft,111,OT NON-OR THER PRC URIN,466,"Malfunction, reaction, complic of genitourinary device or proc",11,Diseases and Disorders of the Kidney and Urinary Tract,3,Major,Minor,Medical,Self-Pay,,,,N,Y,44681.52,11487.25
Long Island,Nassau,2908000,000511,NYU Winthrop Hospital,70 or Older,115,F,Black/African American,Not Span/Hispanic,8,Emergency,Skilled Nursing Home,2017,237,Complication of device; implant or graft,000,NO PROC,466,"Malfunction, reaction, complic of genitourinary device or proc",11,Diseases and Disorders of the Kidney and Urinary Tract,3,Major,Major,Medical,Medicare,Medicare,Medicaid,,N,Y,62353.30,13848.98
Long Island,Nassau,2908000,000511,NYU Winthrop Hospital,50 to 69,118,F,Other Race,Not Span/Hispanic,6,Emergency,Home or Self Care,2017,237,Complication of device; implant or graft,191,ARTERIO/VENOGRAM-NOT HH,466,"Malfunction, reaction, complic of genitourinary device or proc",11,Diseases and Disorders of the Kidney and Urinary Tract,3,Major,Moderate,Medical,Federal/State/Local/VA,Medicaid,,,N,Y,61183.49,14341.53
Long Island,Nassau,2908000,000511,NYU Winthrop Hospital,70 or Older,115,M,Black/African American,Not Span/Hispanic,8,Emergency,Home or Self Care,2017,237,Complication of device; implant or graft,025,DX PRCS ON EAR,466,"Malfunction, reaction, complic of genitourinary device or proc",11,Diseases and Disorders of the Kidney and Urinary Tract,3,Major,Major,Medical,Medicare,Medicare,Blue Cross/Blue Shield,,N,Y,161475.99,37139.99
Long Island,Nassau,2908000,000511,NYU Winthrop Hospital,70 or Older,115,M,White,Not Span/Hispanic,6,Emergency,Home or Self Care,2017,237,Complication of device; implant or graft,000,NO PROC,466,"Malfunction, reaction, complic of genitourinary device or proc",11,Diseases and Disorders of the Kidney and Urinary Tract,4,Extreme,Major,Medical,Medicare,Medicare,Private Health Insurance,,N,Y,49906.77,11566.65
Long Island,Nassau,2908000,000511,NYU Winthrop Hospital,70 or Older,115,M,White,Spanish/Hispanic,8,Emergency,Home w/ Home Health Services,2017,237,Complication of device; implant or graft,000,NO PROC,466,"Malfunction, reaction, complic of genitourinary device or proc",11,Diseases and Disorders of the Kidney and Urinary Tract,3,Major,Major,Medical,Private Health Insurance,Medicare,Medicare,,N,Y,110236.75,28031.42
Long Island,Nassau,2908000,000511,NYU Winthrop Hospital,70 or Older,110,M,White,Not Span/Hispanic,13,Emergency,Skilled Nursing Home,2017,237,Complication of device; implant or graft,061,OT OR PRCS VES NOT HEAD,466,"Malfunction, reaction, complic of genitourinary device or proc",11,Diseases and Disorders of the Kidney and Urinary Tract,3,Major,Major,Medical,Medicare,Medicare,Blue Cross/Blue Shield,,N,Y,136104.41,30680.81
Long Island,Nassau,2908000,000511,NYU Winthrop Hospital,70 or Older,115,M,White,Not Span/Hispanic,5,Emergency,Skilled Nursing Home,2017,237,Complication of device; implant or graft,223,ENTERAL/PARENTERAL NUTR,466,"Malfunction, reaction, complic of genitourinary device or proc",11,Diseases and Disorders of the Kidney and Urinary Tract,3,Major,Moderate,Medical,Medicare,Medicare,Private Health Insurance,,N,Y,38557.88,7876.02
Long Island,Nassau,2908000,000511,NYU Winthrop Hospital,70 or Older,115,M,Black/African American,Not Span/Hispanic,3,Emergency,Home w/ Home Health Services,2017,237,Complication of device; implant or graft,000,NO PROC,466,"Malfunction, reaction, complic of genitourinary device or proc",11,Diseases and Disorders of the Kidney and Urinary Tract,3,Major,Major,Medical,Medicare,Medicare,,,N,Y,32461.57,6086.01
Long Island,Nassau,2908000,000511,NYU Winthrop Hospital,50 to 69,115,F,Black/African American,Not Span/Hispanic,2,Emergency,Expired,2017,237,Complication of device; implant or graft,222,BLOOD TRANSFUSION,466,"Malfunction, reaction, complic of genitourinary device or proc",11,Diseases and Disorders of the Kidney and Urinary Tract,4,Extreme,Extreme,Medical,Medicaid,Medicaid,,,N,Y,60788.25,9689.60
Long Island,Nassau,2908000,000511,NYU Winthrop Hospital,50 to 69,110,M,White,Not Span/Hispanic,6,Emergency,Home w/ Home Health Services,2017,237,Complication of device; implant or graft,054,OT VASC CATH; NOT HEART,466,"Malfunction, reaction, complic of genitourinary device or proc",11,Diseases and Disorders of the Kidney and Urinary Tract,3,Major,Moderate,Medical,Blue Cross/Blue Shield,Medicare,Medicaid,,N,Y,66346.00,15742.34
Long Island,Nassau,2908000,000511,NYU Winthrop Hospital,70 or Older,115,M,White,Not Span/Hispanic,14,Emergency,Skilled Nursing Home,2017,237,Complication of device; implant or graft,222,BLOOD TRANSFUSION,466,"Malfunction, reaction, complic of genitourinary device or proc",11,Diseases and Disorders of the Kidney and Urinary Tract,4,Extreme,Extreme,Medical,Medicare,Medicare,Medicaid,,N,Y,166470.44,41975.45
Long Island,Nassau,2908000,000511,NYU Winthrop Hospital,70 or Older,113,F,White,Spanish/Hispanic,8,Emergency,Skilled Nursing Home,2017,237,Complication of device; implant or graft,216,RESP INTUB/MECH VENTIL,466,"Malfunction, reaction, complic of genitourinary device or proc",11,Diseases and Disorders of the Kidney and Urinary Tract,3,Major,Major,Medical,Medicare,Medicaid,Medicare,,N,Y,59886.84,12555.83
Long Island,Nassau,2908000,000511,NYU Winthrop Hospital,50 to 69,110,M,White,Not Span/Hispanic,4,Emergency,Skilled Nursing Home,2017,237,Complication of device; implant or graft,000,NO PROC,466,"Malfunction, reaction, complic of genitourinary device or proc",11,Diseases and Disorders of the Kidney and Urinary Tract,2,Moderate,Moderate,Medical,Medicare,Medicare,Blue Cross/Blue Shield,,N,Y,28272.78,6447.01
Long Island,Nassau,2908000,000511,NYU Winthrop Hospital,70 or Older,115,M,White,Not Span/Hispanic,6,Emergency,Inpatient Rehabilitation Facility,2017,237,Complication of device; implant or graft,000,NO PROC,466,"Malfunction, reaction, complic of genitourinary device or proc",11,Diseases and Disorders of the Kidney and Urinary Tract,2,Moderate,Moderate,Medical,Medicare,Medicare,Private Health Insurance,,N,Y,48806.43,11505.98
Long Island,Nassau,2908000,000511,NYU Winthrop Hospital,50 to 69,115,F,Black/African American,Not Span/Hispanic,26,Emergency,Skilled Nursing Home,2017,237,Complication of device; implant or graft,054,OT VASC CATH; NOT HEART,466,"Malfunction, reaction, complic of genitourinary device or proc",11,Diseases and Disorders of the Kidney and Urinary Tract,3,Major,Major,Medical,Medicare,Medicare,Blue Cross/Blue Shield,,N,Y,326553.10,78289.95
Long Island,Nassau,2908000,000511,NYU Winthrop Hospital,70 or Older,110,F,White,Not Span/Hispanic,4,Emergency,Hospice - Medical Facility,2017,237,Complication of device; implant or graft,222,BLOOD TRANSFUSION,466,"Malfunction, reaction, complic of genitourinary device or proc",11,Diseases and Disorders of the Kidney and Urinary Tract,4,Extreme,Extreme,Medical,Medicare,Medicare,Private Health Insurance,,N,Y,35052.91,7250.57
Long Island,Nassau,2908000,000511,NYU Winthrop Hospital,70 or Older,115,M,White,Not Span/Hispanic,6,Emergency,Hospice - Home,2017,237,Complication of device; implant or graft,000,NO PROC,466,"Malfunction, reaction, complic of genitourinary device or proc",11,Diseases and Disorders of the Kidney and Urinary Tract,3,Major,Moderate,Medical,Medicare,Medicare,Private Health Insurance,,N,Y,72315.78,13330.69
Long Island,Nassau,2908000,000511,NYU Winthrop Hospital,30 to 49,115,F,White,Not Span/Hispanic,1,Emergency,Skilled Nursing Home,2017,237,Complication of device; implant or graft,231,OTHER THERAPEUTIC PRCS,466,"Malfunction, reaction, complic of genitourinary device or proc",11,Diseases and Disorders of the Kidney and Urinary Tract,2,Moderate,Moderate,Medical,Medicare,Medicare,Medicaid,,N,Y,27994.30,5486.45
Long Island,Nassau,2908000,000511,NYU Winthrop Hospital,50 to 69,115,M,White,Spanish/Hispanic,5,Emergency,Home w/ Home Health Services,2017,237,Complication of device; implant or graft,000,NO PROC,466,"Malfunction, reaction, complic of genitourinary device or proc",11,Diseases and Disorders of the Kidney and Urinary Tract,3,Major,Major,Medical,Medicare,Medicare,,,N,Y,76680.33,18442.74
Long Island,Nassau,2908000,000511,NYU Winthrop Hospital,50 to 69,115,M,Black/African American,Not Span/Hispanic,4,Emergency,Home or Self Care,2017,237,Complication of device; implant or graft,091,PERITONEAL DIALYSIS,466,"Malfunction, reaction, complic of genitourinary device or proc",11,Diseases and Disorders of the Kidney and Urinary Tract,3,Major,Major,Medical,Private Health Insurance,,,,N,Y,43567.28,8576.89
Long Island,Nassau,2908000,000511,NYU Winthrop Hospital,50 to 69,115,F,White,Not Span/Hispanic,10,Emergency,Home w/ Home Health Services,2017,237,Complication of device; implant or graft,000,NO PROC,466,"Malfunction, reaction, complic of genitourinary device or proc",11,Diseases and Disorders of the Kidney and Urinary Tract,4,Extreme,Major,Medical,Blue Cross/Blue Shield,Medicare,Medicare,,N,Y,63793.57,15217.18
Long Island,Nassau,2908000,000511,NYU Winthrop Hospital,70 or Older,115,F,Black/African American,Not Span/Hispanic,4,Emergency,Home w/ Home Health Services,2017,237,Complication of device; implant or graft,000,NO PROC,466,"Malfunction, reaction, complic of genitourinary device or proc",11,Diseases and Disorders of the Kidney and Urinary Tract,2,Moderate,Moderate,Medical,Medicare,Medicare,Blue Cross/Blue Shield,,N,Y,40952.05,8819.64
Long Island,Nassau,2908000,000511,NYU Winthrop Hospital,50 to 69,115,M,Black/African American,Not Span/Hispanic,6,Emergency,Home or Self Care,2017,237,Complication of device; implant or graft,058,HEMODIALYSIS,466,"Malfunction, reaction, complic of genitourinary device or proc",11,Diseases and Disorders of the Kidney and Urinary Tract,3,Major,Moderate,Medical,Private Health Insurance,,,,N,Y,63575.81,13814.96
Long Island,Nassau,2908000,000511,NYU Winthrop Hospital,70 or Older,115,M,White,Not Span/Hispanic,2,Emergency,Home w/ Home Health Services,2017,237,Complication of device; implant or graft,000,NO PROC,466,"Malfunction, reaction, complic of genitourinary device or proc",11,Diseases and Disorders of the Kidney and Urinary Tract,3,Major,Major,Medical,Medicare,Medicare,Private Health Insurance,,N,Y,65405.14,13358.79
Long Island,Nassau,2908000,000511,NYU Winthrop Hospital,0 to 17,115,M,Other Race,Not Span/Hispanic,2,Emergency,Home w/ Home Health Services,2017,237,Complication of device; implant or graft,000,NO PROC,466,"Malfunction, reaction, complic of genitourinary device or proc",11,Diseases and Disorders of the Kidney and Urinary Tract,2,Moderate,Minor,Medical,Blue Cross/Blue Shield,,,,N,Y,23501.29,5468.38
Long Island,Nassau,2908000,000511,NYU Winthrop Hospital,70 or Older,113,M,Other Race,Not Span/Hispanic,5,Emergency,Home w/ Home Health Services,2017,237,Complication of device; implant or graft,000,NO PROC,466,"Malfunction, reaction, complic of genitourinary device or proc",11,Diseases and Disorders of the Kidney and Urinary Tract,3,Major,Major,Medical,Medicare,Medicare,,,N,Y,88156.01,22508.48
Long Island,Nassau,2908000,000511,NYU Winthrop Hospital,70 or Older,115,M,White,Not Span/Hispanic,4,Emergency,Home or Self Care,2017,237,Complication of device; implant or graft,111,OT NON-OR THER PRC URIN,466,"Malfunction, reaction, complic of genitourinary device or proc",11,Diseases and Disorders of the Kidney and Urinary Tract,3,Major,Major,Medical,Medicare,Medicare,Blue Cross/Blue Shield,,N,Y,62557.34,15051.07
Long Island,Nassau,2908000,000511,NYU Winthrop Hospital,50 to 69,115,F,White,Not Span/Hispanic,5,Emergency,Home or Self Care,2017,238,Complications of surgical procedures or medical care,000,NO PROC,466,"Malfunction, reaction, complic of genitourinary device or proc",11,Diseases and Disorders of the Kidney and Urinary Tract,3,Major,Minor,Medical,Medicaid,Medicaid,,,N,Y,77601.61,13747.30
Long Island,Nassau,2908000,000511,NYU Winthrop Hospital,50 to 69,115,F,White,Not Span/Hispanic,3,Emergency,Home or Self Care,2017,237,Complication of device; implant or graft,000,NO PROC,466,"Malfunction, reaction, complic of genitourinary device or proc",11,Diseases and Disorders of the Kidney and Urinary Tract,2,Moderate,Minor,Medical,Private Health Insurance,,,,N,Y,33266.13,7017.44
Long Island,Nassau,2908000,000511,NYU Winthrop Hospital,50 to 69,117,F,White,Not Span/Hispanic,4,Emergency,Home or Self Care,2017,237,Complication of device; implant or graft,000,NO PROC,466,"Malfunction, reaction, complic of genitourinary device or proc",11,Diseases and Disorders of the Kidney and Urinary Tract,3,Major,Moderate,Medical,Private Health Insurance,,,,N,Y,60748.70,15033.72
Long Island,Nassau,2908000,000511,NYU Winthrop Hospital,50 to 69,118,F,White,Not Span/Hispanic,26,Emergency,Home w/ Home Health Services,2017,237,Complication of device; implant or graft,054,OT VASC CATH; NOT HEART,466,"Malfunction, reaction, complic of genitourinary device or proc",11,Diseases and Disorders of the Kidney and Urinary Tract,3,Major,Moderate,Medical,Private Health Insurance,Medicare,,,N,Y,226929.57,51911.84
Long Island,Nassau,2908000,000511,NYU Winthrop Hospital,50 to 69,115,M,White,Not Span/Hispanic,3,Emergency,Home or Self Care,2017,237,Complication of device; implant or graft,111,OT NON-OR THER PRC URIN,466,"Malfunction, reaction, complic of genitourinary device or proc",11,Diseases and Disorders of the Kidney and Urinary Tract,2,Moderate,Moderate,Medical,Blue Cross/Blue Shield,,,,N,Y,48855.60,12598.66
Long Island,Nassau,2908000,000511,NYU Winthrop Hospital,50 to 69,114,M,Black/African American,Spanish/Hispanic,12,Emergency,Home w/ Home Health Services,2017,238,Complications of surgical procedures or medical care,054,OT VASC CATH; NOT HEART,466,"Malfunction, reaction, complic of genitourinary device or proc",11,Diseases and Disorders of the Kidney and Urinary Tract,3,Major,Moderate,Medical,Medicaid,Medicaid,,,N,Y,103759.75,23288.24
Long Island,Nassau,2908000,000511,NYU Winthrop Hospital,70 or Older,115,F,White,Not Span/Hispanic,7,Emergency,Home w/ Home Health Services,2017,237,Complication of device; implant or graft,000,NO PROC,466,"Malfunction, reaction, complic of genitourinary device or proc",11,Diseases and Disorders of the Kidney and Urinary Tract,3,Major,Major,Medical,Medicare,Medicare,,,N,Y,102129.88,21107.21
Long Island,Nassau,2908000,000511,NYU Winthrop Hospital,70 or Older,115,M,White,Not Span/Hispanic,14,Emergency,Home w/ Home Health Services,2017,237,Complication of device; implant or graft,000,NO PROC,466,"Malfunction, reaction, complic of genitourinary device or proc",11,Diseases and Disorders of the Kidney and Urinary Tract,4,Extreme,Extreme,Medical,Medicare,Medicare,Blue Cross/Blue Shield,,N,Y,198065.15,48777.15
Long Island,Nassau,2908000,000511,NYU Winthrop Hospital,70 or Older,115,M,White,Not Span/Hispanic,7,Emergency,Home w/ Home Health Services,2017,237,Complication of device; implant or graft,000,NO PROC,466,"Malfunction, reaction, complic of genitourinary device or proc",11,Diseases and Disorders of the Kidney and Urinary Tract,4,Extreme,Major,Medical,Medicare,Medicare,Private Health Insurance,,N,Y,114317.41,26883.50
Long Island,Nassau,2908000,000511,NYU Winthrop Hospital,70 or Older,115,F,Black/African American,Not Span/Hispanic,9,Emergency,Home w/ Home Health Services,2017,237,Complication of device; implant or graft,000,NO PROC,466,"Malfunction, reaction, complic of genitourinary device or proc",11,Diseases and Disorders of the Kidney and Urinary Tract,3,Major,Major,Medical,Medicare,Medicare,,,N,Y,74070.02,16159.18
Long Island,Nassau,2908000,000511,NYU Winthrop Hospital,50 to 69,117,M,White,Not Span/Hispanic,1,Emergency,Home or Self Care,2017,237,Complication of device; implant or graft,000,NO PROC,466,"Malfunction, reaction, complic of genitourinary device or proc",11,Diseases and Disorders of the Kidney and Urinary Tract,3,Major,Moderate,Medical,Medicare,Medicare,Private Health Insurance,,N,Y,23818.52,3979.58
Long Island,Nassau,2908000,000511,NYU Winthrop Hospital,70 or Older,115,F,White,Not Span/Hispanic,3,Emergency,Home or Self Care,2017,237,Complication of device; implant or graft,000,NO PROC,466,"Malfunction, reaction, complic of genitourinary device or proc",11,Diseases and Disorders of the Kidney and Urinary Tract,2,Moderate,Major,Medical,Medicare,Medicare,Private Health Insurance,,N,Y,34770.56,6859.50
Long Island,Nassau,2908000,000511,NYU Winthrop Hospital,70 or Older,117,F,Other Race,Not Span/Hispanic,10,Emergency,Skilled Nursing Home,2017,237,Complication of device; implant or graft,222,BLOOD TRANSFUSION,466,"Malfunction, reaction, complic of genitourinary device or proc",11,Diseases and Disorders of the Kidney and Urinary Tract,4,Extreme,Major,Medical,Medicare,Medicare,Private Health Insurance,,N,Y,102544.17,19884.99
Long Island,Nassau,2908000,000511,NYU Winthrop Hospital,70 or Older,117,M,White,Not Span/Hispanic,13,Emergency,Home w/ Home Health Services,2017,237,Complication of device; implant or graft,000,NO PROC,466,"Malfunction, reaction, complic of genitourinary device or proc",11,Diseases and Disorders of the Kidney and Urinary Tract,4,Extreme,Extreme,Medical,Medicare,Medicare,Blue Cross/Blue Shield,,N,Y,118642.12,25352.05
Long Island,Nassau,2908000,000511,NYU Winthrop Hospital,70 or Older,115,F,White,Not Span/Hispanic,4,Emergency,Home w/ Home Health Services,2017,237,Complication of device; implant or graft,000,NO PROC,466,"Malfunction, reaction, complic of genitourinary device or proc",11,Diseases and Disorders of the Kidney and Urinary Tract,4,Extreme,Extreme,Medical,Medicare,Medicare,Blue Cross/Blue Shield,,N,Y,39896.19,8535.93
Long Island,Nassau,2908000,000511,NYU Winthrop Hospital,50 to 69,115,M,White,Not Span/Hispanic,14,Emergency,Home w/ Home Health Services,2017,237,Complication of device; implant or graft,159,OT DX PRCS ON MUSC/SKEL,466,"Malfunction, reaction, complic of genitourinary device or proc",11,Diseases and Disorders of the Kidney and Urinary Tract,4,Extreme,Major,Medical,Medicare,Medicare,Medicaid,,N,Y,247978.57,42108.11