Hospital Service Area,Hospital County,Operating Certificate Number,Permanent Facility Id,Facility Name,Age Group,Zip Code - 3 digits,Gender,Race,Ethnicity,Length of Stay,Type of Admission,Patient Disposition,Discharge Year,CCS Diagnosis Code,CCS Diagnosis Description,CCS Procedure Code,CCS Procedure Description,APR DRG Code,APR DRG Description,APR MDC Code,APR MDC Description,APR Severity of Illness Code,APR Severity of Illness Description,APR Risk of Mortality,APR Medical Surgical Description,Payment Typology 1,Payment Typology 2,Payment Typology 3,Birth Weight,Abortion Edit Indicator,Emergency Department Indicator,Total Charges,Total Costs
Long Island,Suffolk,5123000,000885,Brookhaven Memorial Hospital Medical Center Inc,70 or Older,117,F,White,Not Span/Hispanic,6,Emergency,Skilled Nursing Home,2017,237,Complication of device; implant or graft,054,OT VASC CATH; NOT HEART,466,"Malfunction, reaction, complic of genitourinary device or proc",11,Diseases and Disorders of the Kidney and Urinary Tract,3,Major,Major,Medical,Medicare,Medicare,,,N,Y,48825.85,9934.16
Long Island,Suffolk,5123000,000885,Brookhaven Memorial Hospital Medical Center Inc,70 or Older,119,M,White,Not Span/Hispanic,5,Emergency,Skilled Nursing Home,2017,237,Complication of device; implant or graft,058,HEMODIALYSIS,466,"Malfunction, reaction, complic of genitourinary device or proc",11,Diseases and Disorders of the Kidney and Urinary Tract,4,Extreme,Major,Medical,Medicare,Medicare,Private Health Insurance,,N,Y,59030.57,10062.59
Long Island,Suffolk,5123000,000885,Brookhaven Memorial Hospital Medical Center Inc,50 to 69,117,M,Black/African American,Not Span/Hispanic,5,Emergency,Skilled Nursing Home,2017,237,Complication of device; implant or graft,223,ENTERAL/PARENTERAL NUTR,466,"Malfunction, reaction, complic of genitourinary device or proc",11,Diseases and Disorders of the Kidney and Urinary Tract,4,Extreme,Extreme,Medical,Medicare,Medicaid,,,N,Y,48282.81,7688.73
Long Island,Suffolk,5123000,000885,Brookhaven Memorial Hospital Medical Center Inc,70 or Older,117,F,White,Not Span/Hispanic,8,Emergency,Skilled Nursing Home,2017,237,Complication of device; implant or graft,000,NO PROC,466,"Malfunction, reaction, complic of genitourinary device or proc",11,Diseases and Disorders of the Kidney and Urinary Tract,3,Major,Major,Medical,Medicare,Medicare,Medicaid,,N,Y,49964.18,10727.62
Long Island,Suffolk,5123000,000885,Brookhaven Memorial Hospital Medical Center Inc,30 to 49,119,M,Black/African American,Not Span/Hispanic,1,Emergency,Home or Self Care,2017,237,Complication of device; implant or graft,058,HEMODIALYSIS,466,"Malfunction, reaction, complic of genitourinary device or proc",11,Diseases and Disorders of the Kidney and Urinary Tract,3,Major,Major,Medical,Private Health Insurance,Medicaid,,,N,Y,26619.18,5590.91
Long Island,Suffolk,5123000,000885,Brookhaven Memorial Hospital Medical Center Inc,70 or Older,117,M,White,Not Span/Hispanic,6,Emergency,Skilled Nursing Home,2017,237,Complication of device; implant or graft,000,NO PROC,466,"Malfunction, reaction, complic of genitourinary device or proc",11,Diseases and Disorders of the Kidney and Urinary Tract,3,Major,Major,Medical,Medicare,Medicare,Medicaid,,N,Y,46888.92,8350.97
Long Island,Suffolk,5123000,000885,Brookhaven Memorial Hospital Medical Center Inc,70 or Older,117,M,White,Not Span/Hispanic,2,Emergency,Skilled Nursing Home,2017,237,Complication of device; implant or graft,111,OT NON-OR THER PRC URIN,466,"Malfunction, reaction, complic of genitourinary device or proc",11,Diseases and Disorders of the Kidney and Urinary Tract,2,Moderate,Minor,Medical,Medicare,Medicare,Private Health Insurance,,N,Y,13279.38,2830.00
Long Island,Suffolk,5123000,000885,Brookhaven Memorial Hospital Medical Center Inc,70 or Older,119,M,White,Not Span/Hispanic,7,Emergency,Skilled Nursing Home,2017,237,Complication of device; implant or graft,000,NO PROC,466,"Malfunction, reaction, complic of genitourinary device or proc",11,Diseases and Disorders of the Kidney and Urinary Tract,4,Extreme,Extreme,Medical,Medicare,Medicare,,,N,Y,65111.45,10788.75
Long Island,Suffolk,5123000,000885,Brookhaven Memorial Hospital Medical Center Inc,70 or Older,117,F,White,Not Span/Hispanic,3,Emergency,Home w/ Home Health Services,2017,237,Complication of device; implant or graft,000,NO PROC,466,"Malfunction, reaction, complic of genitourinary device or proc",11,Diseases and Disorders of the Kidney and Urinary Tract,3,Major,Major,Medical,Medicare,Medicare,Private Health Insurance,,N,Y,22509.25,4503.16
Long Island,Suffolk,5123000,000885,Brookhaven Memorial Hospital Medical Center Inc,50 to 69,117,M,Other Race,Not Span/Hispanic,5,Emergency,Home w/ Home Health Services,2017,237,Complication of device; implant or graft,000,NO PROC,466,"Malfunction, reaction, complic of genitourinary device or proc",11,Diseases and Disorders of the Kidney and Urinary Tract,3,Major,Major,Medical,Medicare,Medicare,Medicaid,,N,Y,36430.87,6551.03
Long Island,Suffolk,5123000,000885,Brookhaven Memorial Hospital Medical Center Inc,70 or Older,117,M,White,Not Span/Hispanic,3,Emergency,Home w/ Home Health Services,2017,237,Complication of device; implant or graft,111,OT NON-OR THER PRC URIN,466,"Malfunction, reaction, complic of genitourinary device or proc",11,Diseases and Disorders of the Kidney and Urinary Tract,3,Major,Major,Medical,Medicare,Medicare,Blue Cross/Blue Shield,,N,Y,25775.66,4720.61
Long Island,Suffolk,5123000,000885,Brookhaven Memorial Hospital Medical Center Inc,70 or Older,119,M,White,Not Span/Hispanic,6,Emergency,Home w/ Home Health Services,2017,237,Complication of device; implant or graft,000,NO PROC,466,"Malfunction, reaction, complic of genitourinary device or proc",11,Diseases and Disorders of the Kidney and Urinary Tract,2,Moderate,Moderate,Medical,Medicare,Medicare,,,N,Y,34130.83,7448.22
Long Island,Suffolk,5123000,000885,Brookhaven Memorial Hospital Medical Center Inc,70 or Older,117,M,White,Not Span/Hispanic,4,Emergency,Skilled Nursing Home,2017,237,Complication of device; implant or graft,000,NO PROC,466,"Malfunction, reaction, complic of genitourinary device or proc",11,Diseases and Disorders of the Kidney and Urinary Tract,3,Major,Major,Medical,Medicare,Medicare,,,N,Y,27269.06,5486.96
Long Island,Suffolk,5123000,000885,Brookhaven Memorial Hospital Medical Center Inc,70 or Older,117,M,White,Not Span/Hispanic,10,Emergency,Expired,2017,237,Complication of device; implant or graft,000,NO PROC,466,"Malfunction, reaction, complic of genitourinary device or proc",11,Diseases and Disorders of the Kidney and Urinary Tract,3,Major,Extreme,Medical,Medicare,Medicare,Private Health Insurance,,N,Y,83810.82,14702.51
Long Island,Suffolk,5123000,000885,Brookhaven Memorial Hospital Medical Center Inc,50 to 69,117,F,White,Not Span/Hispanic,3,Emergency,Short-term Hospital,2017,237,Complication of device; implant or graft,222,BLOOD TRANSFUSION,466,"Malfunction, reaction, complic of genitourinary device or proc",11,Diseases and Disorders of the Kidney and Urinary Tract,3,Major,Moderate,Medical,Medicare,Medicare,Medicaid,,N,Y,41182.71,6584.46
Long Island,Suffolk,5123000,000885,Brookhaven Memorial Hospital Medical Center Inc,50 to 69,117,F,White,Not Span/Hispanic,7,Emergency,Skilled Nursing Home,2017,237,Complication of device; implant or graft,000,NO PROC,466,"Malfunction, reaction, complic of genitourinary device or proc",11,Diseases and Disorders of the Kidney and Urinary Tract,4,Extreme,Major,Medical,Medicare,Medicare,Medicaid,,N,Y,43489.76,9354.97
Long Island,Suffolk,5123000,000885,Brookhaven Memorial Hospital Medical Center Inc,70 or Older,117,M,White,Not Span/Hispanic,13,Emergency,Skilled Nursing Home,2017,237,Complication of device; implant or graft,000,NO PROC,466,"Malfunction, reaction, complic of genitourinary device or proc",11,Diseases and Disorders of the Kidney and Urinary Tract,3,Major,Major,Medical,Medicare,,,,N,Y,81828.04,16723.94
Long Island,Suffolk,5123000,000885,Brookhaven Memorial Hospital Medical Center Inc,70 or Older,117,M,White,Not Span/Hispanic,4,Emergency,Home w/ Home Health Services,2017,237,Complication of device; implant or graft,000,NO PROC,466,"Malfunction, reaction, complic of genitourinary device or proc",11,Diseases and Disorders of the Kidney and Urinary Tract,3,Major,Major,Medical,Medicare,Medicare,Private Health Insurance,,N,Y,24930.87,5295.05
Long Island,Suffolk,5123000,000885,Brookhaven Memorial Hospital Medical Center Inc,50 to 69,119,M,Other Race,Not Span/Hispanic,5,Emergency,Home w/ Home Health Services,2017,237,Complication of device; implant or graft,000,NO PROC,466,"Malfunction, reaction, complic of genitourinary device or proc",11,Diseases and Disorders of the Kidney and Urinary Tract,4,Extreme,Extreme,Medical,Medicare,Medicare,Medicaid,,N,Y,38616.39,7846.60
Long Island,Suffolk,5123000,000885,Brookhaven Memorial Hospital Medical Center Inc,70 or Older,117,M,White,Not Span/Hispanic,3,Emergency,Skilled Nursing Home,2017,237,Complication of device; implant or graft,000,NO PROC,466,"Malfunction, reaction, complic of genitourinary device or proc",11,Diseases and Disorders of the Kidney and Urinary Tract,3,Major,Major,Medical,Medicare,,,,N,Y,20639.76,4221.56
Long Island,Suffolk,5123000,000885,Brookhaven Memorial Hospital Medical Center Inc,70 or Older,117,M,White,Not Span/Hispanic,8,Emergency,Skilled Nursing Home,2017,237,Complication of device; implant or graft,054,OT VASC CATH; NOT HEART,466,"Malfunction, reaction, complic of genitourinary device or proc",11,Diseases and Disorders of the Kidney and Urinary Tract,4,Extreme,Major,Medical,Medicare,Medicare,Private Health Insurance,,N,Y,89353.73,14894.84
Long Island,Suffolk,5123000,000885,Brookhaven Memorial Hospital Medical Center Inc,70 or Older,117,F,White,Not Span/Hispanic,2,Emergency,Skilled Nursing Home,2017,237,Complication of device; implant or graft,000,NO PROC,466,"Malfunction, reaction, complic of genitourinary device or proc",11,Diseases and Disorders of the Kidney and Urinary Tract,3,Major,Major,Medical,Medicare,Medicare,Private Health Insurance,,N,Y,22793.12,3938.90
Long Island,Suffolk,5123000,000885,Brookhaven Memorial Hospital Medical Center Inc,50 to 69,119,M,White,Not Span/Hispanic,3,Emergency,Home w/ Home Health Services,2017,237,Complication of device; implant or graft,000,NO PROC,466,"Malfunction, reaction, complic of genitourinary device or proc",11,Diseases and Disorders of the Kidney and Urinary Tract,3,Major,Moderate,Medical,Medicare,Medicare,Blue Cross/Blue Shield,,N,Y,28475.16,4589.89
Long Island,Suffolk,5123000,000885,Brookhaven Memorial Hospital Medical Center Inc,70 or Older,119,M,White,Not Span/Hispanic,2,Emergency,Home w/ Home Health Services,2017,237,Complication of device; implant or graft,000,NO PROC,466,"Malfunction, reaction, complic of genitourinary device or proc",11,Diseases and Disorders of the Kidney and Urinary Tract,3,Major,Major,Medical,Medicare,Medicare,,,N,Y,16964.48,3091.88
Long Island,Suffolk,5123000,000885,Brookhaven Memorial Hospital Medical Center Inc,50 to 69,117,M,Other Race,Not Span/Hispanic,4,Emergency,Skilled Nursing Home,2017,237,Complication of device; implant or graft,223,ENTERAL/PARENTERAL NUTR,466,"Malfunction, reaction, complic of genitourinary device or proc",11,Diseases and Disorders of the Kidney and Urinary Tract,4,Extreme,Extreme,Medical,Medicare,Medicare,Medicaid,,N,Y,57318.84,9242.85
Long Island,Suffolk,5123000,000885,Brookhaven Memorial Hospital Medical Center Inc,50 to 69,119,M,White,Not Span/Hispanic,5,Emergency,Home or Self Care,2017,237,Complication of device; implant or graft,000,NO PROC,466,"Malfunction, reaction, complic of genitourinary device or proc",11,Diseases and Disorders of the Kidney and Urinary Tract,3,Major,Major,Medical,Medicare,Medicare,Private Health Insurance,,N,Y,33806.72,6523.82
Long Island,Suffolk,5123000,000885,Brookhaven Memorial Hospital Medical Center Inc,50 to 69,117,M,Other Race,Not Span/Hispanic,10,Emergency,Home or Self Care,2017,237,Complication of device; implant or graft,058,HEMODIALYSIS,466,"Malfunction, reaction, complic of genitourinary device or proc",11,Diseases and Disorders of the Kidney and Urinary Tract,3,Major,Major,Medical,Private Health Insurance,Medicare,Medicare,,N,Y,71516.59,14266.21
Long Island,Suffolk,5123000,000885,Brookhaven Memorial Hospital Medical Center Inc,70 or Older,119,F,White,Not Span/Hispanic,13,Emergency,Home w/ Home Health Services,2017,237,Complication of device; implant or graft,000,NO PROC,466,"Malfunction, reaction, complic of genitourinary device or proc",11,Diseases and Disorders of the Kidney and Urinary Tract,4,Extreme,Extreme,Medical,Medicare,Medicare,Private Health Insurance,,N,Y,74203.46,16392.96
Long Island,Suffolk,5123000,000885,Brookhaven Memorial Hospital Medical Center Inc,50 to 69,119,M,White,Not Span/Hispanic,6,Emergency,Home w/ Home Health Services,2017,237,Complication of device; implant or graft,000,NO PROC,466,"Malfunction, reaction, complic of genitourinary device or proc",11,Diseases and Disorders of the Kidney and Urinary Tract,3,Major,Moderate,Medical,Medicare,Medicare,Blue Cross/Blue Shield,,N,Y,55261.67,8030.93
Long Island,Suffolk,5123000,000885,Brookhaven Memorial Hospital Medical Center Inc,70 or Older,117,M,White,Not Span/Hispanic,3,Emergency,Home or Self Care,2017,237,Complication of device; implant or graft,000,NO PROC,466,"Malfunction, reaction, complic of genitourinary device or proc",11,Diseases and Disorders of the Kidney and Urinary Tract,2,Moderate,Major,Medical,Medicare,,,,N,Y,16724.59,3836.80
Long Island,Suffolk,5123000,000885,Brookhaven Memorial Hospital Medical Center Inc,70 or Older,117,M,White,Not Span/Hispanic,3,Emergency,Skilled Nursing Home,2017,237,Complication of device; implant or graft,216,RESP INTUB/MECH VENTIL,466,"Malfunction, reaction, complic of genitourinary device or proc",11,Diseases and Disorders of the Kidney and Urinary Tract,3,Major,Major,Medical,Medicare,Medicare,Blue Cross/Blue Shield,,N,Y,34879.29,5122.76
Long Island,Suffolk,5123000,000885,Brookhaven Memorial Hospital Medical Center Inc,70 or Older,117,M,White,Not Span/Hispanic,13,Emergency,Skilled Nursing Home,2017,237,Complication of device; implant or graft,054,OT VASC CATH; NOT HEART,466,"Malfunction, reaction, complic of genitourinary device or proc",11,Diseases and Disorders of the Kidney and Urinary Tract,3,Major,Major,Medical,Medicare,Medicare,Blue Cross/Blue Shield,,N,Y,116783.86,20173.38
Long Island,Suffolk,5123000,000885,Brookhaven Memorial Hospital Medical Center Inc,50 to 69,119,M,White,Not Span/Hispanic,4,Emergency,Home or Self Care,2017,237,Complication of device; implant or graft,000,NO PROC,466,"Malfunction, reaction, complic of genitourinary device or proc",11,Diseases and Disorders of the Kidney and Urinary Tract,3,Major,Major,Medical,Medicare,Medicare,Private Health Insurance,,N,Y,27434.82,5526.06
Long Island,Suffolk,5123000,000885,Brookhaven Memorial Hospital Medical Center Inc,50 to 69,117,M,White,Not Span/Hispanic,9,Emergency,Home w/ Home Health Services,2017,237,Complication of device; implant or graft,091,PERITONEAL DIALYSIS,466,"Malfunction, reaction, complic of genitourinary device or proc",11,Diseases and Disorders of the Kidney and Urinary Tract,3,Major,Major,Medical,Medicare,Medicare,Private Health Insurance,,N,Y,69142.09,12938.47
Long Island,Suffolk,5123000,000885,Brookhaven Memorial Hospital Medical Center Inc,50 to 69,117,F,White,Not Span/Hispanic,3,Emergency,Home w/ Home Health Services,2017,237,Complication of device; implant or graft,000,NO PROC,466,"Malfunction, reaction, complic of genitourinary device or proc",11,Diseases and Disorders of the Kidney and Urinary Tract,3,Major,Major,Medical,Medicare,Medicare,Medicaid,,N,Y,21436.49,4234.83
Long Island,Suffolk,5123000,000885,Brookhaven Memorial Hospital Medical Center Inc,50 to 69,117,F,White,Not Span/Hispanic,7,Emergency,Skilled Nursing Home,2017,237,Complication of device; implant or graft,223,ENTERAL/PARENTERAL NUTR,466,"Malfunction, reaction, complic of genitourinary device or proc",11,Diseases and Disorders of the Kidney and Urinary Tract,4,Extreme,Extreme,Medical,Medicare,Medicare,Blue Cross/Blue Shield,,N,Y,100224.92,18910.56
Long Island,Suffolk,5123000,000885,Brookhaven Memorial Hospital Medical Center Inc,70 or Older,119,F,White,Not Span/Hispanic,6,Emergency,Home w/ Home Health Services,2017,237,Complication of device; implant or graft,201,CARDIAC STRESS TESTS,466,"Malfunction, reaction, complic of genitourinary device or proc",11,Diseases and Disorders of the Kidney and Urinary Tract,4,Extreme,Extreme,Medical,Medicare,Medicare,,,N,Y,70143.32,12192.95
Long Island,Suffolk,5123000,000885,Brookhaven Memorial Hospital Medical Center Inc,70 or Older,117,M,Other Race,Not Span/Hispanic,19,Emergency,Skilled Nursing Home,2017,237,Complication of device; implant or graft,223,ENTERAL/PARENTERAL NUTR,466,"Malfunction, reaction, complic of genitourinary device or proc",11,Diseases and Disorders of the Kidney and Urinary Tract,3,Major,Extreme,Medical,Medicare,Medicare,Medicaid,,N,Y,139728.76,26647.97
Long Island,Suffolk,5123000,000885,Brookhaven Memorial Hospital Medical Center Inc,70 or Older,117,M,White,Not Span/Hispanic,6,Emergency,Skilled Nursing Home,2017,237,Complication of device; implant or graft,000,NO PROC,466,"Malfunction, reaction, complic of genitourinary device or proc",11,Diseases and Disorders of the Kidney and Urinary Tract,2,Moderate,Moderate,Medical,Medicare,Private Health Insurance,Medicare,,N,Y,39593.00,8171.08
Long Island,Suffolk,5123000,000885,Brookhaven Memorial Hospital Medical Center Inc,70 or Older,117,M,White,Not Span/Hispanic,5,Emergency,Skilled Nursing Home,2017,237,Complication of device; implant or graft,221,NASOGASTRIC TUBE,466,"Malfunction, reaction, complic of genitourinary device or proc",11,Diseases and Disorders of the Kidney and Urinary Tract,3,Major,Major,Medical,Medicare,Medicare,Blue Cross/Blue Shield,,N,Y,59815.51,10439.47
Long Island,Suffolk,5123000,000885,Brookhaven Memorial Hospital Medical Center Inc,70 or Older,117,M,White,Not Span/Hispanic,7,Emergency,Home w/ Home Health Services,2017,237,Complication of device; implant or graft,100,ENDOSCOPY URINARY TRACT,466,"Malfunction, reaction, complic of genitourinary device or proc",11,Diseases and Disorders of the Kidney and Urinary Tract,3,Major,Major,Medical,Medicare,Medicare,Private Health Insurance,,N,Y,64192.27,11413.42
Long Island,Suffolk,5123000,000885,Brookhaven Memorial Hospital Medical Center Inc,50 to 69,119,M,White,Not Span/Hispanic,15,Emergency,Skilled Nursing Home,2017,237,Complication of device; implant or graft,193,DX ULTRASOUND HEART,466,"Malfunction, reaction, complic of genitourinary device or proc",11,Diseases and Disorders of the Kidney and Urinary Tract,4,Extreme,Major,Medical,Private Health Insurance,,,,N,Y,149015.42,22954.95
Long Island,Suffolk,5123000,000885,Brookhaven Memorial Hospital Medical Center Inc,50 to 69,117,M,White,Not Span/Hispanic,4,Emergency,Skilled Nursing Home,2017,237,Complication of device; implant or graft,054,OT VASC CATH; NOT HEART,466,"Malfunction, reaction, complic of genitourinary device or proc",11,Diseases and Disorders of the Kidney and Urinary Tract,3,Major,Major,Medical,Medicare,Medicare,Medicaid,,N,Y,32617.36,6173.06
Long Island,Suffolk,5123000,000885,Brookhaven Memorial Hospital Medical Center Inc,30 to 49,117,M,White,Not Span/Hispanic,16,Emergency,Skilled Nursing Home,2017,237,Complication of device; implant or graft,216,RESP INTUB/MECH VENTIL,466,"Malfunction, reaction, complic of genitourinary device or proc",11,Diseases and Disorders of the Kidney and Urinary Tract,2,Moderate,Minor,Medical,Medicare,Medicare,Blue Cross/Blue Shield,,N,Y,99422.17,21380.56
Long Island,Suffolk,5123000,000885,Brookhaven Memorial Hospital Medical Center Inc,50 to 69,117,F,White,Not Span/Hispanic,3,Emergency,Home w/ Home Health Services,2017,237,Complication of device; implant or graft,000,NO PROC,466,"Malfunction, reaction, complic of genitourinary device or proc",11,Diseases and Disorders of the Kidney and Urinary Tract,3,Major,Major,Medical,Medicare,Medicare,Medicaid,,N,Y,21864.09,4253.75
Long Island,Suffolk,5123000,000885,Brookhaven Memorial Hospital Medical Center Inc,70 or Older,117,M,White,Not Span/Hispanic,6,Emergency,Skilled Nursing Home,2017,237,Complication of device; implant or graft,000,NO PROC,466,"Malfunction, reaction, complic of genitourinary device or proc",11,Diseases and Disorders of the Kidney and Urinary Tract,3,Major,Major,Medical,Medicare,Private Health Insurance,,,N,Y,46949.83,7851.70
Long Island,Suffolk,5123000,000885,Brookhaven Memorial Hospital Medical Center Inc,70 or Older,117,M,White,Not Span/Hispanic,3,Emergency,Skilled Nursing Home,2017,237,Complication of device; implant or graft,000,NO PROC,466,"Malfunction, reaction, complic of genitourinary device or proc",11,Diseases and Disorders of the Kidney and Urinary Tract,3,Major,Major,Medical,Medicare,Medicare,Blue Cross/Blue Shield,,N,Y,31148.51,4626.82
Long Island,Suffolk,5123000,000885,Brookhaven Memorial Hospital Medical Center Inc,50 to 69,119,M,White,Not Span/Hispanic,11,Emergency,Home w/ Home Health Services,2017,237,Complication of device; implant or graft,216,RESP INTUB/MECH VENTIL,466,"Malfunction, reaction, complic of genitourinary device or proc",11,Diseases and Disorders of the Kidney and Urinary Tract,3,Major,Major,Medical,Medicare,Medicare,,,N,Y,92619.39,16720.61
Long Island,Suffolk,5123000,000885,Brookhaven Memorial Hospital Medical Center Inc,70 or Older,117,M,White,Not Span/Hispanic,4,Emergency,Skilled Nursing Home,2017,237,Complication of device; implant or graft,000,NO PROC,466,"Malfunction, reaction, complic of genitourinary device or proc",11,Diseases and Disorders of the Kidney and Urinary Tract,3,Major,Major,Medical,Medicare,Medicare,Private Health Insurance,,N,Y,34625.65,6772.54
Long Island,Suffolk,5123000,000885,Brookhaven Memorial Hospital Medical Center Inc,70 or Older,117,F,White,Not Span/Hispanic,13,Not Available,Home or Self Care,2017,237,Complication of device; implant or graft,000,NO PROC,466,"Malfunction, reaction, complic of genitourinary device or proc",11,Diseases and Disorders of the Kidney and Urinary Tract,3,Major,Major,Medical,Medicare,Medicare,,,N,Y,67646.25,15070.19
Long Island,Suffolk,5123000,000885,Brookhaven Memorial Hospital Medical Center Inc,70 or Older,117,M,White,Not Span/Hispanic,9,Emergency,Home or Self Care,2017,237,Complication of device; implant or graft,000,NO PROC,466,"Malfunction, reaction, complic of genitourinary device or proc",11,Diseases and Disorders of the Kidney and Urinary Tract,3,Major,Extreme,Medical,Medicare,Medicare,Private Health Insurance,,N,Y,60946.12,11257.60
Long Island,Suffolk,5123000,000885,Brookhaven Memorial Hospital Medical Center Inc,50 to 69,117,M,White,Not Span/Hispanic,4,Emergency,Skilled Nursing Home,2017,237,Complication of device; implant or graft,058,HEMODIALYSIS,466,"Malfunction, reaction, complic of genitourinary device or proc",11,Diseases and Disorders of the Kidney and Urinary Tract,3,Major,Moderate,Medical,Medicare,Medicare,Private Health Insurance,,N,Y,53469.88,11949.71
Long Island,Suffolk,5123000,000885,Brookhaven Memorial Hospital Medical Center Inc,70 or Older,117,M,White,Not Span/Hispanic,6,Emergency,Skilled Nursing Home,2017,237,Complication of device; implant or graft,222,BLOOD TRANSFUSION,466,"Malfunction, reaction, complic of genitourinary device or proc",11,Diseases and Disorders of the Kidney and Urinary Tract,3,Major,Major,Medical,Medicare,,,,N,Y,60564.37,11506.74