Hospital Service Area,Hospital County,Operating Certificate Number,Permanent Facility Id,Facility Name,Age Group,Zip Code - 3 digits,Gender,Race,Ethnicity,Length of Stay,Type of Admission,Patient Disposition,Discharge Year,CCS Diagnosis Code,CCS Diagnosis Description,CCS Procedure Code,CCS Procedure Description,APR DRG Code,APR DRG Description,APR MDC Code,APR MDC Description,APR Severity of Illness Code,APR Severity of Illness Description,APR Risk of Mortality,APR Medical Surgical Description,Payment Typology 1,Payment Typology 2,Payment Typology 3,Birth Weight,Abortion Edit Indicator,Emergency Department Indicator,Total Charges,Total Costs
Long Island,Suffolk,5123000,000885,Long Island Community Hospital,70 or Older,117,M,White,Not Span/Hispanic,4,Emergency,Home w/ Home Health Services,2019,INJ034,"COMPLICATION OF GENITOURINARY DEVICE, IMPLANT OR GRAFT, INITIAL ENCOUNTER",URN006,BLADDER CATHETERIZATION AND DRAINAGE,466,"MALFUNCTION, REACTION, COMPLIC OF GENITOURINARY DEVICE OR PROC",11,DISEASES AND DISORDERS OF THE KIDNEY AND URINARY TRACT,3,Major,Major,Medical,Medicare,Medicare,Private Health Insurance,,,true,56287.18,7472.98
Long Island,Suffolk,5123000,000885,Long Island Community Hospital,50 to 69,117,M,Other Race,Not Span/Hispanic,1,Emergency,Home or Self Care,2019,INJ033,"COMPLICATION OF CARDIOVASCULAR DEVICE, IMPLANT OR GRAFT, INITIAL ENCOUNTER",CAR024,VENOUS AND ARTERIAL CATHETER PLACEMENT,466,"MALFUNCTION, REACTION, COMPLIC OF GENITOURINARY DEVICE OR PROC",11,DISEASES AND DISORDERS OF THE KIDNEY AND URINARY TRACT,2,Moderate,Moderate,Medical,Medicare,Medicare,,,,true,23789.48,5277.56
Long Island,Suffolk,5123000,000885,Long Island Community Hospital,70 or Older,117,M,White,Not Span/Hispanic,9,Emergency,Expired,2019,INJ034,"COMPLICATION OF GENITOURINARY DEVICE, IMPLANT OR GRAFT, INITIAL ENCOUNTER",URN006,BLADDER CATHETERIZATION AND DRAINAGE,466,"MALFUNCTION, REACTION, COMPLIC OF GENITOURINARY DEVICE OR PROC",11,DISEASES AND DISORDERS OF THE KIDNEY AND URINARY TRACT,4,Extreme,Extreme,Medical,Medicare,Medicare,Private Health Insurance,,,true,54040.6,11313.68
Long Island,Suffolk,5123000,000885,Long Island Community Hospital,70 or Older,117,M,White,Not Span/Hispanic,13,Emergency,Skilled Nursing Home,2019,INJ034,"COMPLICATION OF GENITOURINARY DEVICE, IMPLANT OR GRAFT, INITIAL ENCOUNTER",URN006,BLADDER CATHETERIZATION AND DRAINAGE,466,"MALFUNCTION, REACTION, COMPLIC OF GENITOURINARY DEVICE OR PROC",11,DISEASES AND DISORDERS OF THE KIDNEY AND URINARY TRACT,3,Major,Major,Medical,Medicare,Medicare,Medicaid,,,true,87280.63,17509.58
Long Island,Suffolk,5123000,000885,Long Island Community Hospital,50 to 69,119,M,White,Not Span/Hispanic,6,Emergency,Home w/ Home Health Services,2019,INJ034,"COMPLICATION OF GENITOURINARY DEVICE, IMPLANT OR GRAFT, INITIAL ENCOUNTER",ADM001,TRANSFUSION OF BLOOD AND BLOOD PRODUCTS,466,"MALFUNCTION, REACTION, COMPLIC OF GENITOURINARY DEVICE OR PROC",11,DISEASES AND DISORDERS OF THE KIDNEY AND URINARY TRACT,3,Major,Moderate,Medical,Private Health Insurance,Medicaid,,,,true,80016.69,15352.98
Long Island,Suffolk,5123000,000885,Long Island Community Hospital,50 to 69,117,F,White,Not Span/Hispanic,6,Emergency,Skilled Nursing Home,2019,INJ034,"COMPLICATION OF GENITOURINARY DEVICE, IMPLANT OR GRAFT, INITIAL ENCOUNTER",URN006,BLADDER CATHETERIZATION AND DRAINAGE,466,"MALFUNCTION, REACTION, COMPLIC OF GENITOURINARY DEVICE OR PROC",11,DISEASES AND DISORDERS OF THE KIDNEY AND URINARY TRACT,3,Major,Major,Medical,Medicare,Medicare,Medicaid,,,true,59464.26,10754.98
Long Island,Suffolk,5123000,000885,Long Island Community Hospital,70 or Older,117,M,White,Not Span/Hispanic,2,Emergency,Home w/ Home Health Services,2019,INJ034,"COMPLICATION OF GENITOURINARY DEVICE, IMPLANT OR GRAFT, INITIAL ENCOUNTER",URN006,BLADDER CATHETERIZATION AND DRAINAGE,466,"MALFUNCTION, REACTION, COMPLIC OF GENITOURINARY DEVICE OR PROC",11,DISEASES AND DISORDERS OF THE KIDNEY AND URINARY TRACT,4,Extreme,Major,Medical,Medicare,Medicare,,,,true,17964.36,3329.57
Long Island,Suffolk,5123000,000885,Long Island Community Hospital,70 or Older,117,M,White,Not Span/Hispanic,8,Emergency,Skilled Nursing Home,2019,INJ034,"COMPLICATION OF GENITOURINARY DEVICE, IMPLANT OR GRAFT, INITIAL ENCOUNTER",ADM001,TRANSFUSION OF BLOOD AND BLOOD PRODUCTS,466,"MALFUNCTION, REACTION, COMPLIC OF GENITOURINARY DEVICE OR PROC",11,DISEASES AND DISORDERS OF THE KIDNEY AND URINARY TRACT,3,Major,Major,Medical,Medicare,Medicare,Medicaid,,,true,66626.73,11378.76
Long Island,Suffolk,5123000,000885,Long Island Community Hospital,70 or Older,119,M,White,Not Span/Hispanic,3,Emergency,Home or Self Care,2019,INJ034,"COMPLICATION OF GENITOURINARY DEVICE, IMPLANT OR GRAFT, INITIAL ENCOUNTER",ADM001,TRANSFUSION OF BLOOD AND BLOOD PRODUCTS,466,"MALFUNCTION, REACTION, COMPLIC OF GENITOURINARY DEVICE OR PROC",11,DISEASES AND DISORDERS OF THE KIDNEY AND URINARY TRACT,3,Major,Major,Medical,Medicare,Medicare,Private Health Insurance,,,true,78468.19,15999.97
Long Island,Suffolk,5123000,000885,Long Island Community Hospital,70 or Older,117,M,White,Not Span/Hispanic,9,Emergency,Skilled Nursing Home,2019,INJ034,"COMPLICATION OF GENITOURINARY DEVICE, IMPLANT OR GRAFT, INITIAL ENCOUNTER",,,466,"MALFUNCTION, REACTION, COMPLIC OF GENITOURINARY DEVICE OR PROC",11,DISEASES AND DISORDERS OF THE KIDNEY AND URINARY TRACT,2,Moderate,Minor,Medical,Medicare,Medicare,Blue Cross/Blue Shield,,,true,46016.69,11192.75
Long Island,Suffolk,5123000,000885,Long Island Community Hospital,70 or Older,117,M,White,Not Span/Hispanic,4,Emergency,Home w/ Home Health Services,2019,INJ034,"COMPLICATION OF GENITOURINARY DEVICE, IMPLANT OR GRAFT, INITIAL ENCOUNTER",MAM006,PACEMAKER AND DEFIBRILLATOR INTERROGATION,466,"MALFUNCTION, REACTION, COMPLIC OF GENITOURINARY DEVICE OR PROC",11,DISEASES AND DISORDERS OF THE KIDNEY AND URINARY TRACT,3,Major,Major,Medical,Medicare,Medicare,Private Health Insurance,,,true,30715.99,6121.45
Long Island,Suffolk,5123000,000885,Long Island Community Hospital,70 or Older,117,M,White,Not Span/Hispanic,4,Emergency,Home or Self Care,2019,INJ033,"COMPLICATION OF CARDIOVASCULAR DEVICE, IMPLANT OR GRAFT, INITIAL ENCOUNTER",ESA001,HEMODIALYSIS,466,"MALFUNCTION, REACTION, COMPLIC OF GENITOURINARY DEVICE OR PROC",11,DISEASES AND DISORDERS OF THE KIDNEY AND URINARY TRACT,3,Major,Moderate,Medical,Medicare,Medicare,Medicaid,,,true,59316.75,11863.97
Long Island,Suffolk,5123000,000885,Long Island Community Hospital,70 or Older,119,M,White,Not Span/Hispanic,2,Emergency,Home or Self Care,2019,INJ033,"COMPLICATION OF CARDIOVASCULAR DEVICE, IMPLANT OR GRAFT, INITIAL ENCOUNTER",CAR029,"CARDIOVASCULAR DEVICE PROCEDURES, NEC",466,"MALFUNCTION, REACTION, COMPLIC OF GENITOURINARY DEVICE OR PROC",11,DISEASES AND DISORDERS OF THE KIDNEY AND URINARY TRACT,3,Major,Major,Medical,Medicare,Medicare,Blue Cross/Blue Shield,,,true,31384.77,6992.23
Long Island,Suffolk,5123000,000885,Long Island Community Hospital,50 to 69,119,F,White,Not Span/Hispanic,7,Emergency,Home w/ Home Health Services,2019,INJ034,"COMPLICATION OF GENITOURINARY DEVICE, IMPLANT OR GRAFT, INITIAL ENCOUNTER",,,466,"MALFUNCTION, REACTION, COMPLIC OF GENITOURINARY DEVICE OR PROC",11,DISEASES AND DISORDERS OF THE KIDNEY AND URINARY TRACT,3,Major,Moderate,Medical,Private Health Insurance,Medicaid,,,,true,76282.63,11482.9
Long Island,Suffolk,5123000,000885,Long Island Community Hospital,18 to 29,117,F,White,Not Span/Hispanic,11,Emergency,Home w/ Home Health Services,2019,INJ034,"COMPLICATION OF GENITOURINARY DEVICE, IMPLANT OR GRAFT, INITIAL ENCOUNTER",,,466,"MALFUNCTION, REACTION, COMPLIC OF GENITOURINARY DEVICE OR PROC",11,DISEASES AND DISORDERS OF THE KIDNEY AND URINARY TRACT,2,Moderate,Minor,Medical,Private Health Insurance,Medicaid,,,,true,65340.93,14280.6
Long Island,Suffolk,5123000,000885,Long Island Community Hospital,50 to 69,117,M,White,Not Span/Hispanic,10,Emergency,Home or Self Care,2019,INJ033,"COMPLICATION OF CARDIOVASCULAR DEVICE, IMPLANT OR GRAFT, INITIAL ENCOUNTER",ESA001,HEMODIALYSIS,466,"MALFUNCTION, REACTION, COMPLIC OF GENITOURINARY DEVICE OR PROC",11,DISEASES AND DISORDERS OF THE KIDNEY AND URINARY TRACT,3,Major,Major,Medical,Private Health Insurance,Medicaid,,,,true,102959.6,16622.92
Long Island,Suffolk,5123000,000885,Long Island Community Hospital,70 or Older,117,M,White,Not Span/Hispanic,3,Emergency,Home w/ Home Health Services,2019,INJ034,"COMPLICATION OF GENITOURINARY DEVICE, IMPLANT OR GRAFT, INITIAL ENCOUNTER",,,466,"MALFUNCTION, REACTION, COMPLIC OF GENITOURINARY DEVICE OR PROC",11,DISEASES AND DISORDERS OF THE KIDNEY AND URINARY TRACT,3,Major,Major,Medical,Medicare,Medicare,Blue Cross/Blue Shield,,,true,40184.8,5768.82
Long Island,Suffolk,5123000,000885,Long Island Community Hospital,70 or Older,117,M,White,Not Span/Hispanic,6,Emergency,Home w/ Home Health Services,2019,INJ034,"COMPLICATION OF GENITOURINARY DEVICE, IMPLANT OR GRAFT, INITIAL ENCOUNTER",CAR024,VENOUS AND ARTERIAL CATHETER PLACEMENT,466,"MALFUNCTION, REACTION, COMPLIC OF GENITOURINARY DEVICE OR PROC",11,DISEASES AND DISORDERS OF THE KIDNEY AND URINARY TRACT,4,Extreme,Extreme,Medical,Medicare,Medicare,Private Health Insurance,,,true,53186.42,10013.31
Long Island,Suffolk,5123000,000885,Long Island Community Hospital,50 to 69,117,M,White,Not Span/Hispanic,5,Emergency,Home w/ Home Health Services,2019,INJ034,"COMPLICATION OF GENITOURINARY DEVICE, IMPLANT OR GRAFT, INITIAL ENCOUNTER",,,466,"MALFUNCTION, REACTION, COMPLIC OF GENITOURINARY DEVICE OR PROC",11,DISEASES AND DISORDERS OF THE KIDNEY AND URINARY TRACT,3,Major,Major,Medical,Medicare,Medicare,Private Health Insurance,,,true,36874.68,7716.74
Long Island,Suffolk,5123000,000885,Long Island Community Hospital,70 or Older,117,M,White,Not Span/Hispanic,4,Emergency,Skilled Nursing Home,2019,INJ034,"COMPLICATION OF GENITOURINARY DEVICE, IMPLANT OR GRAFT, INITIAL ENCOUNTER",,,466,"MALFUNCTION, REACTION, COMPLIC OF GENITOURINARY DEVICE OR PROC",11,DISEASES AND DISORDERS OF THE KIDNEY AND URINARY TRACT,3,Major,Major,Medical,Medicare,Medicare,Medicaid,,,true,30711.3,6220.81
Long Island,Suffolk,5123000,000885,Long Island Community Hospital,70 or Older,117,F,White,Not Span/Hispanic,5,Emergency,Skilled Nursing Home,2019,INJ034,"COMPLICATION OF GENITOURINARY DEVICE, IMPLANT OR GRAFT, INITIAL ENCOUNTER",,,466,"MALFUNCTION, REACTION, COMPLIC OF GENITOURINARY DEVICE OR PROC",11,DISEASES AND DISORDERS OF THE KIDNEY AND URINARY TRACT,4,Extreme,Extreme,Medical,Medicare,Medicare,Private Health Insurance,,,true,56893.78,8120.63
Long Island,Suffolk,5123000,000885,Long Island Community Hospital,50 to 69,117,M,White,Not Span/Hispanic,3,Emergency,Home w/ Home Health Services,2019,INJ034,"COMPLICATION OF GENITOURINARY DEVICE, IMPLANT OR GRAFT, INITIAL ENCOUNTER",MST002,BONE AND JOINT BIOPSY,466,"MALFUNCTION, REACTION, COMPLIC OF GENITOURINARY DEVICE OR PROC",11,DISEASES AND DISORDERS OF THE KIDNEY AND URINARY TRACT,2,Moderate,Moderate,Medical,Medicare,Medicare,Blue Cross/Blue Shield,,,true,48031.33,8296.1
Long Island,Suffolk,5123000,000885,Long Island Community Hospital,50 to 69,117,M,White,Not Span/Hispanic,4,Emergency,Home or Self Care,2019,INJ034,"COMPLICATION OF GENITOURINARY DEVICE, IMPLANT OR GRAFT, INITIAL ENCOUNTER",ADM018,IRRIGATION (DIAGNOSTIC AND THERAPEUTIC),466,"MALFUNCTION, REACTION, COMPLIC OF GENITOURINARY DEVICE OR PROC",11,DISEASES AND DISORDERS OF THE KIDNEY AND URINARY TRACT,2,Moderate,Moderate,Medical,Private Health Insurance,,,,,true,23942.73,5297.04
Long Island,Suffolk,5123000,000885,Long Island Community Hospital,50 to 69,119,M,White,Not Span/Hispanic,2,Emergency,Home w/ Home Health Services,2019,INJ034,"COMPLICATION OF GENITOURINARY DEVICE, IMPLANT OR GRAFT, INITIAL ENCOUNTER",URN006,BLADDER CATHETERIZATION AND DRAINAGE,466,"MALFUNCTION, REACTION, COMPLIC OF GENITOURINARY DEVICE OR PROC",11,DISEASES AND DISORDERS OF THE KIDNEY AND URINARY TRACT,3,Major,Moderate,Medical,Private Health Insurance,Medicaid,,,,true,25586.95,3092.42
Long Island,Suffolk,5123000,000885,Long Island Community Hospital,70 or Older,117,M,White,Not Span/Hispanic,7,Emergency,Skilled Nursing Home,2019,INJ034,"COMPLICATION OF GENITOURINARY DEVICE, IMPLANT OR GRAFT, INITIAL ENCOUNTER",ADM001,TRANSFUSION OF BLOOD AND BLOOD PRODUCTS,466,"MALFUNCTION, REACTION, COMPLIC OF GENITOURINARY DEVICE OR PROC",11,DISEASES AND DISORDERS OF THE KIDNEY AND URINARY TRACT,3,Major,Major,Medical,Medicare,Medicare,Medicaid,,,true,54245.81,11183.27
Long Island,Suffolk,5123000,000885,Long Island Community Hospital,70 or Older,117,M,White,Not Span/Hispanic,10,Emergency,Home or Self Care,2019,INJ034,"COMPLICATION OF GENITOURINARY DEVICE, IMPLANT OR GRAFT, INITIAL ENCOUNTER",URN006,BLADDER CATHETERIZATION AND DRAINAGE,466,"MALFUNCTION, REACTION, COMPLIC OF GENITOURINARY DEVICE OR PROC",11,DISEASES AND DISORDERS OF THE KIDNEY AND URINARY TRACT,3,Major,Major,Medical,Medicare,Medicare,,,,true,60961.3,13158.24
Long Island,Suffolk,5123000,000885,Long Island Community Hospital,50 to 69,117,M,White,Not Span/Hispanic,3,Emergency,Home or Self Care,2019,GEN026,POSTPROCEDURAL OR POSTOPERATIVE GENITOURINARY SYSTEM COMPLICATION,URN005,NEPHROSTOMY AND URETEROSTOMY PROCEDURES (INCLUDING STENTS),466,"MALFUNCTION, REACTION, COMPLIC OF GENITOURINARY DEVICE OR PROC",11,DISEASES AND DISORDERS OF THE KIDNEY AND URINARY TRACT,3,Major,Major,Medical,Medicare,Medicare,Blue Cross/Blue Shield,,,true,36444.21,6268.18
Long Island,Suffolk,5123000,000885,Long Island Community Hospital,70 or Older,117,M,White,Not Span/Hispanic,10,Emergency,Home w/ Home Health Services,2019,INJ034,"COMPLICATION OF GENITOURINARY DEVICE, IMPLANT OR GRAFT, INITIAL ENCOUNTER",,,466,"MALFUNCTION, REACTION, COMPLIC OF GENITOURINARY DEVICE OR PROC",11,DISEASES AND DISORDERS OF THE KIDNEY AND URINARY TRACT,3,Major,Major,Medical,Medicare,,,,,true,64822.26,13127.31
Long Island,Suffolk,5123000,000885,Long Island Community Hospital,70 or Older,119,M,White,Not Span/Hispanic,7,Emergency,Expired,2019,INJ034,"COMPLICATION OF GENITOURINARY DEVICE, IMPLANT OR GRAFT, INITIAL ENCOUNTER",URN006,BLADDER CATHETERIZATION AND DRAINAGE,466,"MALFUNCTION, REACTION, COMPLIC OF GENITOURINARY DEVICE OR PROC",11,DISEASES AND DISORDERS OF THE KIDNEY AND URINARY TRACT,4,Extreme,Extreme,Medical,Medicare,,,,,true,50053.58,10571.92
Long Island,Suffolk,5123000,000885,Long Island Community Hospital,70 or Older,117,M,White,Not Span/Hispanic,4,Emergency,Home w/ Home Health Services,2019,INJ034,"COMPLICATION OF GENITOURINARY DEVICE, IMPLANT OR GRAFT, INITIAL ENCOUNTER",,,466,"MALFUNCTION, REACTION, COMPLIC OF GENITOURINARY DEVICE OR PROC",11,DISEASES AND DISORDERS OF THE KIDNEY AND URINARY TRACT,3,Major,Moderate,Medical,Medicare,Medicare,Private Health Insurance,,,true,37736.56,7234.29
Long Island,Suffolk,5123000,000885,Long Island Community Hospital,70 or Older,117,M,White,Not Span/Hispanic,1,Emergency,Skilled Nursing Home,2019,INJ034,"COMPLICATION OF GENITOURINARY DEVICE, IMPLANT OR GRAFT, INITIAL ENCOUNTER",SKB010,"SKIN AND BREAST PROCEDURES, NEC",466,"MALFUNCTION, REACTION, COMPLIC OF GENITOURINARY DEVICE OR PROC",11,DISEASES AND DISORDERS OF THE KIDNEY AND URINARY TRACT,3,Major,Major,Medical,Medicare,Medicare,Blue Cross/Blue Shield,,,true,17757.74,1979.07
Long Island,Suffolk,5123000,000885,Long Island Community Hospital,18 to 29,117,F,White,Not Span/Hispanic,7,Emergency,Home or Self Care,2019,INJ034,"COMPLICATION OF GENITOURINARY DEVICE, IMPLANT OR GRAFT, INITIAL ENCOUNTER",,,466,"MALFUNCTION, REACTION, COMPLIC OF GENITOURINARY DEVICE OR PROC",11,DISEASES AND DISORDERS OF THE KIDNEY AND URINARY TRACT,2,Moderate,Minor,Medical,Private Health Insurance,Medicaid,,,,true,48180.13,8997.14
Long Island,Suffolk,5123000,000885,Long Island Community Hospital,50 to 69,117,M,White,Not Span/Hispanic,5,Emergency,Home or Self Care,2019,INJ034,"COMPLICATION OF GENITOURINARY DEVICE, IMPLANT OR GRAFT, INITIAL ENCOUNTER",,,466,"MALFUNCTION, REACTION, COMPLIC OF GENITOURINARY DEVICE OR PROC",11,DISEASES AND DISORDERS OF THE KIDNEY AND URINARY TRACT,3,Major,Major,Medical,Medicare,Medicare,Medicaid,,,true,39098.71,8293
Long Island,Suffolk,5123000,000885,Long Island Community Hospital,70 or Older,117,M,White,Not Span/Hispanic,6,Emergency,Skilled Nursing Home,2019,INJ034,"COMPLICATION OF GENITOURINARY DEVICE, IMPLANT OR GRAFT, INITIAL ENCOUNTER",OTR004,ISOLATION PROCEDURES,466,"MALFUNCTION, REACTION, COMPLIC OF GENITOURINARY DEVICE OR PROC",11,DISEASES AND DISORDERS OF THE KIDNEY AND URINARY TRACT,3,Major,Major,Medical,Medicare,Medicare,Private Health Insurance,,,true,36355.18,8014.67
Long Island,Suffolk,5123000,000885,Long Island Community Hospital,50 to 69,119,M,White,Not Span/Hispanic,6,Emergency,Skilled Nursing Home,2019,INJ034,"COMPLICATION OF GENITOURINARY DEVICE, IMPLANT OR GRAFT, INITIAL ENCOUNTER",,,466,"MALFUNCTION, REACTION, COMPLIC OF GENITOURINARY DEVICE OR PROC",11,DISEASES AND DISORDERS OF THE KIDNEY AND URINARY TRACT,3,Major,Extreme,Medical,Medicare,,,,,true,48264.86,8873.87
Long Island,Suffolk,5123000,000885,Long Island Community Hospital,50 to 69,117,M,White,Not Span/Hispanic,8,Emergency,Home w/ Home Health Services,2019,INJ034,"COMPLICATION OF GENITOURINARY DEVICE, IMPLANT OR GRAFT, INITIAL ENCOUNTER",ADM006,INFUSION OF VASOPRESSOR,466,"MALFUNCTION, REACTION, COMPLIC OF GENITOURINARY DEVICE OR PROC",11,DISEASES AND DISORDERS OF THE KIDNEY AND URINARY TRACT,4,Extreme,Extreme,Medical,Medicare,Medicare,Private Health Insurance,,,true,60485.15,12222.35
Long Island,Suffolk,5123000,000885,Long Island Community Hospital,70 or Older,117,M,White,Not Span/Hispanic,10,Emergency,Skilled Nursing Home,2019,INJ034,"COMPLICATION OF GENITOURINARY DEVICE, IMPLANT OR GRAFT, INITIAL ENCOUNTER",ADM006,INFUSION OF VASOPRESSOR,466,"MALFUNCTION, REACTION, COMPLIC OF GENITOURINARY DEVICE OR PROC",11,DISEASES AND DISORDERS OF THE KIDNEY AND URINARY TRACT,4,Extreme,Extreme,Medical,Medicare,Medicare,Private Health Insurance,,,true,64095.91,13876.19
Long Island,Suffolk,5123000,000885,Long Island Community Hospital,50 to 69,117,M,White,Not Span/Hispanic,12,Emergency,Skilled Nursing Home,2019,INJ034,"COMPLICATION OF GENITOURINARY DEVICE, IMPLANT OR GRAFT, INITIAL ENCOUNTER",,,466,"MALFUNCTION, REACTION, COMPLIC OF GENITOURINARY DEVICE OR PROC",11,DISEASES AND DISORDERS OF THE KIDNEY AND URINARY TRACT,3,Major,Major,Medical,Medicare,Medicaid,,,,true,81957.4,15759.04
Long Island,Suffolk,5123000,000885,Long Island Community Hospital,70 or Older,117,F,White,Not Span/Hispanic,2,Emergency,Home w/ Home Health Services,2019,INJ034,"COMPLICATION OF GENITOURINARY DEVICE, IMPLANT OR GRAFT, INITIAL ENCOUNTER",,,466,"MALFUNCTION, REACTION, COMPLIC OF GENITOURINARY DEVICE OR PROC",11,DISEASES AND DISORDERS OF THE KIDNEY AND URINARY TRACT,4,Extreme,Extreme,Medical,Medicare,Medicare,Medicaid,,,true,36501.48,4712.41
Long Island,Suffolk,5123000,000885,Long Island Community Hospital,70 or Older,117,F,White,Not Span/Hispanic,5,Emergency,Skilled Nursing Home,2019,INJ034,"COMPLICATION OF GENITOURINARY DEVICE, IMPLANT OR GRAFT, INITIAL ENCOUNTER",,,466,"MALFUNCTION, REACTION, COMPLIC OF GENITOURINARY DEVICE OR PROC",11,DISEASES AND DISORDERS OF THE KIDNEY AND URINARY TRACT,3,Major,Major,Medical,Medicare,Medicare,Blue Cross/Blue Shield,,,true,37166.76,7219.1
Long Island,Suffolk,5123000,000885,Long Island Community Hospital,70 or Older,117,F,White,Not Span/Hispanic,8,Emergency,Home or Self Care,2019,INJ034,"COMPLICATION OF GENITOURINARY DEVICE, IMPLANT OR GRAFT, INITIAL ENCOUNTER",URN003,URETER AND OTHER URINARY TRACT DILATION,466,"MALFUNCTION, REACTION, COMPLIC OF GENITOURINARY DEVICE OR PROC",11,DISEASES AND DISORDERS OF THE KIDNEY AND URINARY TRACT,3,Major,Major,Medical,Medicare,Medicare,Medicaid,,,true,71056.5,14688.01
Long Island,Suffolk,5123000,000885,Long Island Community Hospital,50 to 69,117,F,White,Not Span/Hispanic,6,Emergency,Skilled Nursing Home,2019,INJ034,"COMPLICATION OF GENITOURINARY DEVICE, IMPLANT OR GRAFT, INITIAL ENCOUNTER",,,466,"MALFUNCTION, REACTION, COMPLIC OF GENITOURINARY DEVICE OR PROC",11,DISEASES AND DISORDERS OF THE KIDNEY AND URINARY TRACT,3,Major,Major,Medical,Medicare,Medicare,Medicaid,,,true,69832.39,10987.25
Long Island,Suffolk,5123000,000885,Long Island Community Hospital,70 or Older,117,M,White,Not Span/Hispanic,15,Emergency,Home w/ Home Health Services,2019,INJ034,"COMPLICATION OF GENITOURINARY DEVICE, IMPLANT OR GRAFT, INITIAL ENCOUNTER",MST020,SUBCUTANEOUS TISSUE AND FASCIA EXCISION,466,"MALFUNCTION, REACTION, COMPLIC OF GENITOURINARY DEVICE OR PROC",11,DISEASES AND DISORDERS OF THE KIDNEY AND URINARY TRACT,3,Major,Extreme,Medical,Medicare,Medicare,,,,true,117322.34,23621.09
Long Island,Suffolk,5123000,000885,Long Island Community Hospital,30 to 49,117,M,White,Not Span/Hispanic,14,Emergency,Skilled Nursing Home,2019,INJ033,"COMPLICATION OF CARDIOVASCULAR DEVICE, IMPLANT OR GRAFT, INITIAL ENCOUNTER",CAR029,"CARDIOVASCULAR DEVICE PROCEDURES, NEC",466,"MALFUNCTION, REACTION, COMPLIC OF GENITOURINARY DEVICE OR PROC",11,DISEASES AND DISORDERS OF THE KIDNEY AND URINARY TRACT,4,Extreme,Major,Medical,Medicare,Medicare,Blue Cross/Blue Shield,,,true,139446.92,30185.59
Long Island,Suffolk,5123000,000885,Long Island Community Hospital,70 or Older,117,M,White,Not Span/Hispanic,13,Emergency,Skilled Nursing Home,2019,INJ033,"COMPLICATION OF CARDIOVASCULAR DEVICE, IMPLANT OR GRAFT, INITIAL ENCOUNTER",ESA001,HEMODIALYSIS,466,"MALFUNCTION, REACTION, COMPLIC OF GENITOURINARY DEVICE OR PROC",11,DISEASES AND DISORDERS OF THE KIDNEY AND URINARY TRACT,4,Extreme,Extreme,Medical,Medicare,Medicare,Blue Cross/Blue Shield,,,true,121701.52,23307.02
Long Island,Suffolk,5123000,000885,Long Island Community Hospital,70 or Older,117,F,Other Race,Not Span/Hispanic,2,Emergency,Home or Self Care,2019,INJ034,"COMPLICATION OF GENITOURINARY DEVICE, IMPLANT OR GRAFT, INITIAL ENCOUNTER",,,466,"MALFUNCTION, REACTION, COMPLIC OF GENITOURINARY DEVICE OR PROC",11,DISEASES AND DISORDERS OF THE KIDNEY AND URINARY TRACT,3,Major,Major,Medical,Medicare,Medicaid,,,,true,32257.54,4316.18
Long Island,Suffolk,5123000,000885,Long Island Community Hospital,50 to 69,117,M,White,Not Span/Hispanic,4,Emergency,Home w/ Home Health Services,2019,INJ034,"COMPLICATION OF GENITOURINARY DEVICE, IMPLANT OR GRAFT, INITIAL ENCOUNTER",,,466,"MALFUNCTION, REACTION, COMPLIC OF GENITOURINARY DEVICE OR PROC",11,DISEASES AND DISORDERS OF THE KIDNEY AND URINARY TRACT,2,Moderate,Minor,Medical,Medicare,Medicare,Medicaid,,,true,23950.09,5485.86
Long Island,Suffolk,5123000,000885,Long Island Community Hospital,70 or Older,119,M,White,Not Span/Hispanic,7,Emergency,Skilled Nursing Home,2019,INJ034,"COMPLICATION OF GENITOURINARY DEVICE, IMPLANT OR GRAFT, INITIAL ENCOUNTER",,,466,"MALFUNCTION, REACTION, COMPLIC OF GENITOURINARY DEVICE OR PROC",11,DISEASES AND DISORDERS OF THE KIDNEY AND URINARY TRACT,3,Major,Major,Medical,Medicare,,,,,true,59067.58,9816.81
Long Island,Suffolk,5123000,000885,Long Island Community Hospital,50 to 69,119,M,Black/African American,Not Span/Hispanic,4,Emergency,Home w/ Home Health Services,2019,INJ034,"COMPLICATION OF GENITOURINARY DEVICE, IMPLANT OR GRAFT, INITIAL ENCOUNTER",ESA001,HEMODIALYSIS,466,"MALFUNCTION, REACTION, COMPLIC OF GENITOURINARY DEVICE OR PROC",11,DISEASES AND DISORDERS OF THE KIDNEY AND URINARY TRACT,4,Extreme,Major,Medical,Medicare,Medicare,Medicaid,,,true,34953.16,6869.76
Long Island,Suffolk,5123000,000885,Long Island Community Hospital,70 or Older,119,M,Black/African American,Not Span/Hispanic,10,Emergency,Skilled Nursing Home,2019,INJ034,"COMPLICATION OF GENITOURINARY DEVICE, IMPLANT OR GRAFT, INITIAL ENCOUNTER",MST002,BONE AND JOINT BIOPSY,466,"MALFUNCTION, REACTION, COMPLIC OF GENITOURINARY DEVICE OR PROC",11,DISEASES AND DISORDERS OF THE KIDNEY AND URINARY TRACT,2,Moderate,Moderate,Medical,Medicare,Medicare,Medicaid,,,true,95446.8,17315.2