Hospital Service Area,Hospital County,Operating Certificate Number,Permanent Facility Id,Facility Name,Age Group,Zip Code - 3 digits,Gender,Race,Ethnicity,Length of Stay,Type of Admission,Patient Disposition,Discharge Year,CCS Diagnosis Code,CCS Diagnosis Description,CCS Procedure Code,CCS Procedure Description,APR DRG Code,APR DRG Description,APR MDC Code,APR MDC Description,APR Severity of Illness Code,APR Severity of Illness Description,APR Risk of Mortality,APR Medical Surgical Description,Payment Typology 1,Payment Typology 2,Payment Typology 3,Birth Weight,Abortion Edit Indicator,Emergency Department Indicator,Total Charges,Total Costs
New York City,Bronx,7000006,001169,Montefiore Medical Center - Henry & Lucy Moses Div,50 to 69,104,M,Black/African American,Not Span/Hispanic,4,Emergency,Home or Self Care,2020,INJ034,"COMPLICATION OF GENITOURINARY DEVICE, IMPLANT OR GRAFT, INITIAL ENCOUNTER",ADM015,ADMINISTRATION OF ANTIBIOTICS,466,"MALFUNCTION, REACTION, COMPLIC OF GENITOURINARY DEVICE OR PROC",11,DISEASES AND DISORDERS OF THE KIDNEY AND URINARY TRACT,2,Moderate,Minor,Medical,Medicare,,,,,Y,40846.37,7650.49
New York City,Bronx,7000006,003058,Montefiore Med Center - Jack D Weiler Hosp of A Einstein College Div,50 to 69,104,M,Other Race,Spanish/Hispanic,2,Emergency,Left Against Medical Advice,2020,INJ036,"COMPLICATION OF TRANSPLANTED ORGANS OR TISSUE, INITIAL ENCOUNTER",CAR024,VENOUS AND ARTERIAL CATHETER PLACEMENT,466,"MALFUNCTION, REACTION, COMPLIC OF GENITOURINARY DEVICE OR PROC",11,DISEASES AND DISORDERS OF THE KIDNEY AND URINARY TRACT,3,Major,Major,Medical,Medicaid,,,,,Y,42762.07,6891.26
New York City,Bronx,7000006,001169,Montefiore Medical Center - Henry & Lucy Moses Div,30 to 49,104,M,Black/African American,Not Span/Hispanic,11,Emergency,Home or Self Care,2020,INJ036,"COMPLICATION OF TRANSPLANTED ORGANS OR TISSUE, INITIAL ENCOUNTER",CAR025,PLACEMENT OF TUNNELED OR IMPLANTABLE PORTION OF A VASCULAR ACCESS DEVICE,466,"MALFUNCTION, REACTION, COMPLIC OF GENITOURINARY DEVICE OR PROC",11,DISEASES AND DISORDERS OF THE KIDNEY AND URINARY TRACT,3,Major,Major,Medical,Medicaid,,,,,Y,215408.65,39621.41
New York City,Bronx,7000006,001169,Montefiore Medical Center - Henry & Lucy Moses Div,50 to 69,104,M,Other Race,Spanish/Hispanic,3,Emergency,Home w/ Home Health Services,2020,INJ036,"COMPLICATION OF TRANSPLANTED ORGANS OR TISSUE, INITIAL ENCOUNTER",ADM017,ADMINISTRATION OF NUTRITIONAL AND ELECTROLYTIC SUBSTANCES,466,"MALFUNCTION, REACTION, COMPLIC OF GENITOURINARY DEVICE OR PROC",11,DISEASES AND DISORDERS OF THE KIDNEY AND URINARY TRACT,3,Major,Major,Medical,Medicare,Medicaid,,,,Y,50397.77,7841.47
New York City,Bronx,7000006,001169,Montefiore Medical Center - Henry & Lucy Moses Div,70 or Older,104,M,Other Race,Spanish/Hispanic,9,Emergency,Home w/ Home Health Services,2020,INJ034,"COMPLICATION OF GENITOURINARY DEVICE, IMPLANT OR GRAFT, INITIAL ENCOUNTER",URN005,NEPHROSTOMY AND URETEROSTOMY PROCEDURES (INCLUDING STENTS),466,"MALFUNCTION, REACTION, COMPLIC OF GENITOURINARY DEVICE OR PROC",11,DISEASES AND DISORDERS OF THE KIDNEY AND URINARY TRACT,3,Major,Major,Medical,Medicare,Medicaid,,,,Y,125161.23,22087.15
New York City,Bronx,7000006,001168,Montefiore Medical Center-Wakefield Hospital,70 or Older,104,M,Other Race,Spanish/Hispanic,9,Emergency,Skilled Nursing Home,2020,INJ034,"COMPLICATION OF GENITOURINARY DEVICE, IMPLANT OR GRAFT, INITIAL ENCOUNTER",URN003,URETER AND OTHER URINARY TRACT DILATION,466,"MALFUNCTION, REACTION, COMPLIC OF GENITOURINARY DEVICE OR PROC",11,DISEASES AND DISORDERS OF THE KIDNEY AND URINARY TRACT,2,Moderate,Major,Medical,Medicaid,,,,,Y,104729.61,19675.1
New York City,Bronx,7000006,003058,Montefiore Med Center - Jack D Weiler Hosp of A Einstein College Div,50 to 69,104,F,Black/African American,Not Span/Hispanic,5,Emergency,Skilled Nursing Home,2020,INJ033,"COMPLICATION OF CARDIOVASCULAR DEVICE, IMPLANT OR GRAFT, INITIAL ENCOUNTER",ESA001,HEMODIALYSIS,466,"MALFUNCTION, REACTION, COMPLIC OF GENITOURINARY DEVICE OR PROC",11,DISEASES AND DISORDERS OF THE KIDNEY AND URINARY TRACT,3,Major,Moderate,Medical,Medicare,Medicaid,,,,Y,103594.38,16848.4
New York City,Bronx,7000006,001168,Montefiore Medical Center-Wakefield Hospital,50 to 69,104,M,Other Race,Spanish/Hispanic,12,Emergency,Skilled Nursing Home,2020,GEN026,POSTPROCEDURAL OR POSTOPERATIVE GENITOURINARY SYSTEM COMPLICATION,URN005,NEPHROSTOMY AND URETEROSTOMY PROCEDURES (INCLUDING STENTS),466,"MALFUNCTION, REACTION, COMPLIC OF GENITOURINARY DEVICE OR PROC",11,DISEASES AND DISORDERS OF THE KIDNEY AND URINARY TRACT,4,Extreme,Major,Medical,Medicaid,,,,,Y,130601.28,24315.74
New York City,Bronx,7000006,001169,Montefiore Medical Center - Henry & Lucy Moses Div,0 to 17,104,M,Other Race,Spanish/Hispanic,2,Emergency,Home or Self Care,2020,INJ036,"COMPLICATION OF TRANSPLANTED ORGANS OR TISSUE, INITIAL ENCOUNTER",,,466,"MALFUNCTION, REACTION, COMPLIC OF GENITOURINARY DEVICE OR PROC",11,DISEASES AND DISORDERS OF THE KIDNEY AND URINARY TRACT,3,Major,Moderate,Medical,Medicaid,,,,,Y,22765.23,4387.87
New York City,Bronx,7000006,003058,Montefiore Med Center - Jack D Weiler Hosp of A Einstein College Div,70 or Older,104,F,Black/African American,Not Span/Hispanic,4,Emergency,Home or Self Care,2020,INJ033,"COMPLICATION OF CARDIOVASCULAR DEVICE, IMPLANT OR GRAFT, INITIAL ENCOUNTER",ADM017,ADMINISTRATION OF NUTRITIONAL AND ELECTROLYTIC SUBSTANCES,466,"MALFUNCTION, REACTION, COMPLIC OF GENITOURINARY DEVICE OR PROC",11,DISEASES AND DISORDERS OF THE KIDNEY AND URINARY TRACT,3,Major,Major,Medical,Medicare,,,,,Y,46758.77,7424.94
New York City,Bronx,7000006,001169,Montefiore Medical Center - Henry & Lucy Moses Div,50 to 69,112,F,Other Race,Unknown,3,Emergency,Home or Self Care,2020,INJ036,"COMPLICATION OF TRANSPLANTED ORGANS OR TISSUE, INITIAL ENCOUNTER",,,466,"MALFUNCTION, REACTION, COMPLIC OF GENITOURINARY DEVICE OR PROC",11,DISEASES AND DISORDERS OF THE KIDNEY AND URINARY TRACT,3,Major,Major,Medical,Private Health Insurance,,,,,N,77484.9,13855.56
New York City,Bronx,7000006,003058,Montefiore Med Center - Jack D Weiler Hosp of A Einstein College Div,70 or Older,104,F,White,Not Span/Hispanic,12,Emergency,Skilled Nursing Home,2020,INJ036,"COMPLICATION OF TRANSPLANTED ORGANS OR TISSUE, INITIAL ENCOUNTER",ADM015,ADMINISTRATION OF ANTIBIOTICS,466,"MALFUNCTION, REACTION, COMPLIC OF GENITOURINARY DEVICE OR PROC",11,DISEASES AND DISORDERS OF THE KIDNEY AND URINARY TRACT,3,Major,Major,Medical,Medicare,,,,,Y,149234.72,26687.57
Capital/Adirond,Otsego,3801000,000739,A.O. Fox Memorial Hospital,70 or Older,138,M,White,Not Span/Hispanic,6,Emergency,Home w/ Home Health Services,2020,INJ034,"COMPLICATION OF GENITOURINARY DEVICE, IMPLANT OR GRAFT, INITIAL ENCOUNTER",,,466,"MALFUNCTION, REACTION, COMPLIC OF GENITOURINARY DEVICE OR PROC",11,DISEASES AND DISORDERS OF THE KIDNEY AND URINARY TRACT,2,Moderate,Minor,Medical,Medicare,Private Health Insurance,,,,Y,13694.99,7747.23
Capital/Adirond,Otsego,3801000,000739,A.O. Fox Memorial Hospital,70 or Older,138,M,White,Not Span/Hispanic,4,Emergency,Home w/ Home Health Services,2020,INJ034,"COMPLICATION OF GENITOURINARY DEVICE, IMPLANT OR GRAFT, INITIAL ENCOUNTER",,,466,"MALFUNCTION, REACTION, COMPLIC OF GENITOURINARY DEVICE OR PROC",11,DISEASES AND DISORDERS OF THE KIDNEY AND URINARY TRACT,2,Moderate,Moderate,Medical,Medicare,,,,,Y,7215.06,5348.4
New York City,Bronx,7000006,001169,Montefiore Medical Center - Henry & Lucy Moses Div,30 to 49,104,F,Black/African American,Not Span/Hispanic,4,Emergency,Home or Self Care,2020,INJ036,"COMPLICATION OF TRANSPLANTED ORGANS OR TISSUE, INITIAL ENCOUNTER",,,466,"MALFUNCTION, REACTION, COMPLIC OF GENITOURINARY DEVICE OR PROC",11,DISEASES AND DISORDERS OF THE KIDNEY AND URINARY TRACT,4,Extreme,Major,Medical,Medicare,Medicaid,,,,Y,107607.84,16215.31
New York City,Bronx,7000006,001169,Montefiore Medical Center - Henry & Lucy Moses Div,30 to 49,104,F,Black/African American,Unknown,4,Emergency,Home or Self Care,2020,INJ036,"COMPLICATION OF TRANSPLANTED ORGANS OR TISSUE, INITIAL ENCOUNTER",,,466,"MALFUNCTION, REACTION, COMPLIC OF GENITOURINARY DEVICE OR PROC",11,DISEASES AND DISORDERS OF THE KIDNEY AND URINARY TRACT,3,Major,Moderate,Medical,Medicaid,,,,,Y,54447.66,9695.34
New York City,Bronx,7000006,003058,Montefiore Med Center - Jack D Weiler Hosp of A Einstein College Div,50 to 69,104,M,Black/African American,Not Span/Hispanic,8,Emergency,Home or Self Care,2020,GEN026,POSTPROCEDURAL OR POSTOPERATIVE GENITOURINARY SYSTEM COMPLICATION,URN005,NEPHROSTOMY AND URETEROSTOMY PROCEDURES (INCLUDING STENTS),466,"MALFUNCTION, REACTION, COMPLIC OF GENITOURINARY DEVICE OR PROC",11,DISEASES AND DISORDERS OF THE KIDNEY AND URINARY TRACT,3,Major,Major,Medical,Medicare,,,,,Y,125408.12,20927.49
Hudson Valley,Westchester,5904001,001072,Montefiore New Rochelle Hospital,70 or Older,104,M,White,Unknown,4,Emergency,Home w/ Home Health Services,2020,INJ034,"COMPLICATION OF GENITOURINARY DEVICE, IMPLANT OR GRAFT, INITIAL ENCOUNTER",ADM015,ADMINISTRATION OF ANTIBIOTICS,466,"MALFUNCTION, REACTION, COMPLIC OF GENITOURINARY DEVICE OR PROC",11,DISEASES AND DISORDERS OF THE KIDNEY AND URINARY TRACT,3,Major,Major,Medical,Medicare,Medicare,Medicaid,,,Y,44805.04,20339.13
Hudson Valley,Westchester,5903001,001061,Montefiore Mount Vernon Hospital,70 or Older,105,F,Black/African American,Multi-ethnic,3,Emergency,Home or Self Care,2020,INJ033,"COMPLICATION OF CARDIOVASCULAR DEVICE, IMPLANT OR GRAFT, INITIAL ENCOUNTER",CAR024,VENOUS AND ARTERIAL CATHETER PLACEMENT,466,"MALFUNCTION, REACTION, COMPLIC OF GENITOURINARY DEVICE OR PROC",11,DISEASES AND DISORDERS OF THE KIDNEY AND URINARY TRACT,2,Moderate,Moderate,Medical,Medicare,Medicare,Medicaid,,,Y,22807.97,8654.96
New York City,Bronx,7000006,003058,Montefiore Med Center - Jack D Weiler Hosp of A Einstein College Div,50 to 69,104,F,Multi-racial,Spanish/Hispanic,6,Emergency,Home w/ Home Health Services,2020,INJ036,"COMPLICATION OF TRANSPLANTED ORGANS OR TISSUE, INITIAL ENCOUNTER",ADM017,ADMINISTRATION OF NUTRITIONAL AND ELECTROLYTIC SUBSTANCES,466,"MALFUNCTION, REACTION, COMPLIC OF GENITOURINARY DEVICE OR PROC",11,DISEASES AND DISORDERS OF THE KIDNEY AND URINARY TRACT,3,Major,Major,Medical,Medicare,Medicaid,,,,Y,64276.46,10845.06
New York City,Bronx,7000006,001168,Montefiore Medical Center-Wakefield Hospital,70 or Older,104,F,Black/African American,Not Span/Hispanic,5,Emergency,Home or Self Care,2020,INJ036,"COMPLICATION OF TRANSPLANTED ORGANS OR TISSUE, INITIAL ENCOUNTER",ADM017,ADMINISTRATION OF NUTRITIONAL AND ELECTROLYTIC SUBSTANCES,466,"MALFUNCTION, REACTION, COMPLIC OF GENITOURINARY DEVICE OR PROC",11,DISEASES AND DISORDERS OF THE KIDNEY AND URINARY TRACT,3,Major,Major,Medical,Medicare,,,,,Y,81845.91,12844.55
New York City,Bronx,7000006,001169,Montefiore Medical Center - Henry & Lucy Moses Div,18 to 29,104,F,Other Race,Not Span/Hispanic,3,Emergency,Home or Self Care,2020,INJ036,"COMPLICATION OF TRANSPLANTED ORGANS OR TISSUE, INITIAL ENCOUNTER",,,466,"MALFUNCTION, REACTION, COMPLIC OF GENITOURINARY DEVICE OR PROC",11,DISEASES AND DISORDERS OF THE KIDNEY AND URINARY TRACT,3,Major,Moderate,Medical,Medicaid,,,,,Y,41782.83,7876.51
New York City,Bronx,7000006,001169,Montefiore Medical Center - Henry & Lucy Moses Div,30 to 49,104,F,Black/African American,Spanish/Hispanic,3,Emergency,Home or Self Care,2020,INJ036,"COMPLICATION OF TRANSPLANTED ORGANS OR TISSUE, INITIAL ENCOUNTER",URN002,KIDNEY AND OTHER URINARY TRACT BIOPSY (NON-ENDOSCOPIC),466,"MALFUNCTION, REACTION, COMPLIC OF GENITOURINARY DEVICE OR PROC",11,DISEASES AND DISORDERS OF THE KIDNEY AND URINARY TRACT,3,Major,Moderate,Medical,Medicare,Medicaid,,,,N,101265.24,16758.09
New York City,Manhattan,7002024,001456,Mount Sinai Hospital,30 to 49,103,M,White,Not Span/Hispanic,4,Elective,Home w/ Home Health Services,2020,INJ034,"COMPLICATION OF GENITOURINARY DEVICE, IMPLANT OR GRAFT, INITIAL ENCOUNTER",URN005,NEPHROSTOMY AND URETEROSTOMY PROCEDURES (INCLUDING STENTS),466,"MALFUNCTION, REACTION, COMPLIC OF GENITOURINARY DEVICE OR PROC",11,DISEASES AND DISORDERS OF THE KIDNEY AND URINARY TRACT,3,Major,Moderate,Medical,Medicaid,Medicaid,Self-Pay,,,N,47590.74,13213.76
New York City,Bronx,7000006,003058,Montefiore Med Center - Jack D Weiler Hosp of A Einstein College Div,30 to 49,104,M,Black/African American,Not Span/Hispanic,9,Emergency,Skilled Nursing Home,2020,INJ034,"COMPLICATION OF GENITOURINARY DEVICE, IMPLANT OR GRAFT, INITIAL ENCOUNTER",URN006,BLADDER CATHETERIZATION AND DRAINAGE,466,"MALFUNCTION, REACTION, COMPLIC OF GENITOURINARY DEVICE OR PROC",11,DISEASES AND DISORDERS OF THE KIDNEY AND URINARY TRACT,4,Extreme,Major,Medical,Medicaid,,,,,Y,148605.11,24689.9
New York City,Bronx,7000006,001169,Montefiore Medical Center - Henry & Lucy Moses Div,50 to 69,104,M,Black/African American,Not Span/Hispanic,2,Emergency,Home or Self Care,2020,INJ036,"COMPLICATION OF TRANSPLANTED ORGANS OR TISSUE, INITIAL ENCOUNTER",,,466,"MALFUNCTION, REACTION, COMPLIC OF GENITOURINARY DEVICE OR PROC",11,DISEASES AND DISORDERS OF THE KIDNEY AND URINARY TRACT,3,Major,Major,Medical,Medicare,Medicaid,,,,Y,53772.26,9428.32
New York City,Bronx,7000006,001168,Montefiore Medical Center-Wakefield Hospital,70 or Older,104,M,Other Race,Spanish/Hispanic,2,Emergency,Home w/ Home Health Services,2020,INJ034,"COMPLICATION OF GENITOURINARY DEVICE, IMPLANT OR GRAFT, INITIAL ENCOUNTER",,,466,"MALFUNCTION, REACTION, COMPLIC OF GENITOURINARY DEVICE OR PROC",11,DISEASES AND DISORDERS OF THE KIDNEY AND URINARY TRACT,2,Moderate,Moderate,Medical,Medicare,Medicaid,,,,Y,29052.38,3812.99
New York City,Bronx,7000006,001169,Montefiore Medical Center - Henry & Lucy Moses Div,50 to 69,104,F,Other Race,Spanish/Hispanic,3,Emergency,Home or Self Care,2020,INJ036,"COMPLICATION OF TRANSPLANTED ORGANS OR TISSUE, INITIAL ENCOUNTER",ADM021,"ADMINISTRATION OF THERAPEUTIC SUBSTANCES, NEC",466,"MALFUNCTION, REACTION, COMPLIC OF GENITOURINARY DEVICE OR PROC",11,DISEASES AND DISORDERS OF THE KIDNEY AND URINARY TRACT,3,Major,Major,Medical,Medicare,Private Health Insurance,,,,Y,50270.04,8052.22
New York City,Bronx,7000006,001169,Montefiore Medical Center - Henry & Lucy Moses Div,30 to 49,104,F,Black/African American,Not Span/Hispanic,2,Emergency,Home or Self Care,2020,INJ033,"COMPLICATION OF CARDIOVASCULAR DEVICE, IMPLANT OR GRAFT, INITIAL ENCOUNTER",,,466,"MALFUNCTION, REACTION, COMPLIC OF GENITOURINARY DEVICE OR PROC",11,DISEASES AND DISORDERS OF THE KIDNEY AND URINARY TRACT,3,Major,Moderate,Medical,Medicaid,,,,,Y,41546.46,7180.18
New York City,Bronx,7000006,001169,Montefiore Medical Center - Henry & Lucy Moses Div,50 to 69,104,F,Other Race,Not Span/Hispanic,4,Emergency,Home or Self Care,2020,INJ036,"COMPLICATION OF TRANSPLANTED ORGANS OR TISSUE, INITIAL ENCOUNTER",URN002,KIDNEY AND OTHER URINARY TRACT BIOPSY (NON-ENDOSCOPIC),466,"MALFUNCTION, REACTION, COMPLIC OF GENITOURINARY DEVICE OR PROC",11,DISEASES AND DISORDERS OF THE KIDNEY AND URINARY TRACT,3,Major,Major,Medical,Private Health Insurance,,,,,N,125515.82,21960.66
New York City,Bronx,7000006,003058,Montefiore Med Center - Jack D Weiler Hosp of A Einstein College Div,70 or Older,104,M,Other Race,Not Span/Hispanic,8,Emergency,Skilled Nursing Home,2020,INJ034,"COMPLICATION OF GENITOURINARY DEVICE, IMPLANT OR GRAFT, INITIAL ENCOUNTER",ADM015,ADMINISTRATION OF ANTIBIOTICS,466,"MALFUNCTION, REACTION, COMPLIC OF GENITOURINARY DEVICE OR PROC",11,DISEASES AND DISORDERS OF THE KIDNEY AND URINARY TRACT,4,Extreme,Extreme,Medical,Medicare,Medicaid,,,,Y,117200.63,20145.52
New York City,Kings,7002002,001324,Mount Sinai Brooklyn,70 or Older,112,M,White,Not Span/Hispanic,3,Emergency,Home w/ Home Health Services,2020,INJ034,"COMPLICATION OF GENITOURINARY DEVICE, IMPLANT OR GRAFT, INITIAL ENCOUNTER",URN006,BLADDER CATHETERIZATION AND DRAINAGE,466,"MALFUNCTION, REACTION, COMPLIC OF GENITOURINARY DEVICE OR PROC",11,DISEASES AND DISORDERS OF THE KIDNEY AND URINARY TRACT,3,Major,Moderate,Medical,Medicare,Medicaid,Self-Pay,,,Y,42950.45,6347.83
New York City,Manhattan,7002032,001469,Mount Sinai Morningside,70 or Older,100,F,White,Spanish/Hispanic,6,Emergency,Home or Self Care,2020,INJ034,"COMPLICATION OF GENITOURINARY DEVICE, IMPLANT OR GRAFT, INITIAL ENCOUNTER",ADM015,ADMINISTRATION OF ANTIBIOTICS,466,"MALFUNCTION, REACTION, COMPLIC OF GENITOURINARY DEVICE OR PROC",11,DISEASES AND DISORDERS OF THE KIDNEY AND URINARY TRACT,3,Major,Major,Medical,Medicare,Medicare,Medicaid,,,Y,80862.35,17290.01
New York City,Kings,7002002,001324,Mount Sinai Brooklyn,70 or Older,112,M,White,Unknown,19,Emergency,Expired,2020,INJ034,"COMPLICATION OF GENITOURINARY DEVICE, IMPLANT OR GRAFT, INITIAL ENCOUNTER",URN005,NEPHROSTOMY AND URETEROSTOMY PROCEDURES (INCLUDING STENTS),466,"MALFUNCTION, REACTION, COMPLIC OF GENITOURINARY DEVICE OR PROC",11,DISEASES AND DISORDERS OF THE KIDNEY AND URINARY TRACT,4,Extreme,Extreme,Medical,Medicare,Medicaid,Self-Pay,,,Y,230311.51,34175.78
New York City,Kings,7002002,001324,Mount Sinai Brooklyn,70 or Older,112,M,White,Not Span/Hispanic,11,Emergency,Skilled Nursing Home,2020,INJ034,"COMPLICATION OF GENITOURINARY DEVICE, IMPLANT OR GRAFT, INITIAL ENCOUNTER",URN006,BLADDER CATHETERIZATION AND DRAINAGE,466,"MALFUNCTION, REACTION, COMPLIC OF GENITOURINARY DEVICE OR PROC",11,DISEASES AND DISORDERS OF THE KIDNEY AND URINARY TRACT,2,Moderate,Major,Medical,Medicare,Private Health Insurance,Self-Pay,,,Y,125820.36,17967.35
New York City,Manhattan,7002032,001466,Mount Sinai West,50 to 69,103,M,White,Not Span/Hispanic,1,Emergency,Home or Self Care,2020,GEN026,POSTPROCEDURAL OR POSTOPERATIVE GENITOURINARY SYSTEM COMPLICATION,URN006,BLADDER CATHETERIZATION AND DRAINAGE,466,"MALFUNCTION, REACTION, COMPLIC OF GENITOURINARY DEVICE OR PROC",11,DISEASES AND DISORDERS OF THE KIDNEY AND URINARY TRACT,2,Moderate,Moderate,Medical,Medicare,Self-Pay,,,,Y,40015.47,9083.82
New York City,Manhattan,7002002,001439,Mount Sinai Beth Israel,70 or Older,100,M,Black/African American,Not Span/Hispanic,3,Emergency,Home or Self Care,2020,GEN026,POSTPROCEDURAL OR POSTOPERATIVE GENITOURINARY SYSTEM COMPLICATION,ADM021,"ADMINISTRATION OF THERAPEUTIC SUBSTANCES, NEC",466,"MALFUNCTION, REACTION, COMPLIC OF GENITOURINARY DEVICE OR PROC",11,DISEASES AND DISORDERS OF THE KIDNEY AND URINARY TRACT,3,Major,Moderate,Medical,Medicaid,Self-Pay,,,,N,33812.31,7106.67
Hudson Valley,Westchester,5901000,001039,NewYork-Presbyterian/Hudson Valley Hospital,70 or Older,105,M,White,Not Span/Hispanic,3,Emergency,Home or Self Care,2020,INJ034,"COMPLICATION OF GENITOURINARY DEVICE, IMPLANT OR GRAFT, INITIAL ENCOUNTER",ADM015,ADMINISTRATION OF ANTIBIOTICS,466,"MALFUNCTION, REACTION, COMPLIC OF GENITOURINARY DEVICE OR PROC",11,DISEASES AND DISORDERS OF THE KIDNEY AND URINARY TRACT,4,Extreme,Major,Medical,Medicare,,,,,Y,26227.1,8842.93
Hudson Valley,Westchester,5901000,001039,NewYork-Presbyterian/Hudson Valley Hospital,70 or Older,105,M,White,Not Span/Hispanic,13,Emergency,Home w/ Home Health Services,2020,INJ034,"COMPLICATION OF GENITOURINARY DEVICE, IMPLANT OR GRAFT, INITIAL ENCOUNTER",URN005,NEPHROSTOMY AND URETEROSTOMY PROCEDURES (INCLUDING STENTS),466,"MALFUNCTION, REACTION, COMPLIC OF GENITOURINARY DEVICE OR PROC",11,DISEASES AND DISORDERS OF THE KIDNEY AND URINARY TRACT,4,Extreme,Extreme,Medical,Medicare,,,,,Y,116287.18,35993.46
Hudson Valley,Westchester,5901000,001039,NewYork-Presbyterian/Hudson Valley Hospital,70 or Older,105,M,White,Not Span/Hispanic,5,Emergency,Skilled Nursing Home,2020,INJ034,"COMPLICATION OF GENITOURINARY DEVICE, IMPLANT OR GRAFT, INITIAL ENCOUNTER",URN006,BLADDER CATHETERIZATION AND DRAINAGE,466,"MALFUNCTION, REACTION, COMPLIC OF GENITOURINARY DEVICE OR PROC",11,DISEASES AND DISORDERS OF THE KIDNEY AND URINARY TRACT,4,Extreme,Extreme,Medical,Medicare,Private Health Insurance,,,,Y,43452.05,12003.82
Hudson Valley,Westchester,5901000,001039,NewYork-Presbyterian/Hudson Valley Hospital,70 or Older,105,F,White,Not Span/Hispanic,9,Emergency,Expired,2020,INJ034,"COMPLICATION OF GENITOURINARY DEVICE, IMPLANT OR GRAFT, INITIAL ENCOUNTER",ADM015,ADMINISTRATION OF ANTIBIOTICS,466,"MALFUNCTION, REACTION, COMPLIC OF GENITOURINARY DEVICE OR PROC",11,DISEASES AND DISORDERS OF THE KIDNEY AND URINARY TRACT,4,Extreme,Extreme,Medical,Medicare,Private Health Insurance,,,,Y,60389.87,28918.78
New York City,Manhattan,7002024,001456,Mount Sinai Hospital,50 to 69,100,F,White,Not Span/Hispanic,4,Emergency,Home or Self Care,2020,INJ034,"COMPLICATION OF GENITOURINARY DEVICE, IMPLANT OR GRAFT, INITIAL ENCOUNTER",,,466,"MALFUNCTION, REACTION, COMPLIC OF GENITOURINARY DEVICE OR PROC",11,DISEASES AND DISORDERS OF THE KIDNEY AND URINARY TRACT,2,Moderate,Minor,Medical,Medicare,Medicaid,Self-Pay,,,Y,45604.2,12285.23
New York City,Manhattan,7002024,001456,Mount Sinai Hospital,50 to 69,104,F,Other Race,Spanish/Hispanic,3,Elective,Home or Self Care,2020,INJ036,"COMPLICATION OF TRANSPLANTED ORGANS OR TISSUE, INITIAL ENCOUNTER",,,466,"MALFUNCTION, REACTION, COMPLIC OF GENITOURINARY DEVICE OR PROC",11,DISEASES AND DISORDERS OF THE KIDNEY AND URINARY TRACT,4,Extreme,Extreme,Medical,Medicaid,Medicaid,Self-Pay,,,N,40327.39,9221.23
New York City,Bronx,7000006,001169,Montefiore Medical Center - Henry & Lucy Moses Div,50 to 69,104,F,Other Race,Spanish/Hispanic,10,Emergency,Expired,2020,INJ036,"COMPLICATION OF TRANSPLANTED ORGANS OR TISSUE, INITIAL ENCOUNTER",LYM007,BONE MARROW BIOPSY,466,"MALFUNCTION, REACTION, COMPLIC OF GENITOURINARY DEVICE OR PROC",11,DISEASES AND DISORDERS OF THE KIDNEY AND URINARY TRACT,4,Extreme,Extreme,Medical,Medicare,Medicaid,,,,Y,188511.18,31961.69
New York City,Bronx,7000006,001169,Montefiore Medical Center - Henry & Lucy Moses Div,70 or Older,104,F,Other Race,Spanish/Hispanic,3,Emergency,Skilled Nursing Home,2020,INJ034,"COMPLICATION OF GENITOURINARY DEVICE, IMPLANT OR GRAFT, INITIAL ENCOUNTER",URN005,NEPHROSTOMY AND URETEROSTOMY PROCEDURES (INCLUDING STENTS),466,"MALFUNCTION, REACTION, COMPLIC OF GENITOURINARY DEVICE OR PROC",11,DISEASES AND DISORDERS OF THE KIDNEY AND URINARY TRACT,2,Moderate,Minor,Medical,Medicare,Medicaid,,,,Y,38658.59,5914.2
New York City,Bronx,7000006,003058,Montefiore Med Center - Jack D Weiler Hosp of A Einstein College Div,30 to 49,100,F,Other Race,Unknown,2,Emergency,Home or Self Care,2020,GEN026,POSTPROCEDURAL OR POSTOPERATIVE GENITOURINARY SYSTEM COMPLICATION,,,466,"MALFUNCTION, REACTION, COMPLIC OF GENITOURINARY DEVICE OR PROC",11,DISEASES AND DISORDERS OF THE KIDNEY AND URINARY TRACT,2,Moderate,Moderate,Medical,Blue Cross/Blue Shield,,,,,Y,41138.97,5336.26
New York City,Manhattan,7002024,001456,Mount Sinai Hospital,18 to 29,112,M,Other Race,Not Span/Hispanic,6,Emergency,Home or Self Care,2020,INJ034,"COMPLICATION OF GENITOURINARY DEVICE, IMPLANT OR GRAFT, INITIAL ENCOUNTER",MAM015,"MEASUREMENT AND MONITORING, NEC",466,"MALFUNCTION, REACTION, COMPLIC OF GENITOURINARY DEVICE OR PROC",11,DISEASES AND DISORDERS OF THE KIDNEY AND URINARY TRACT,3,Major,Moderate,Medical,Medicare,Medicaid,Self-Pay,,,Y,66508.38,18655.5
New York City,Manhattan,7002024,001456,Mount Sinai Hospital,70 or Older,104,F,Other Race,Spanish/Hispanic,10,Emergency,Home w/ Home Health Services,2020,INJ037,"COMPLICATION OF OTHER SURGICAL OR MEDICAL CARE, INJURY, INITIAL ENCOUNTER",ADM013,PERITONEAL DIALYSIS,466,"MALFUNCTION, REACTION, COMPLIC OF GENITOURINARY DEVICE OR PROC",11,DISEASES AND DISORDERS OF THE KIDNEY AND URINARY TRACT,3,Major,Major,Medical,Medicare,Medicaid,Self-Pay,,,Y,128607.27,32648.62
New York City,Bronx,7000006,001168,Montefiore Medical Center-Wakefield Hospital,70 or Older,104,M,Other Race,Spanish/Hispanic,10,Emergency,Skilled Nursing Home,2020,INJ034,"COMPLICATION OF GENITOURINARY DEVICE, IMPLANT OR GRAFT, INITIAL ENCOUNTER",URN006,BLADDER CATHETERIZATION AND DRAINAGE,466,"MALFUNCTION, REACTION, COMPLIC OF GENITOURINARY DEVICE OR PROC",11,DISEASES AND DISORDERS OF THE KIDNEY AND URINARY TRACT,2,Moderate,Major,Medical,Medicaid,,,,,Y,119705.11,22343.99