Hospital Service Area,Hospital County,Operating Certificate Number,Permanent Facility Id,Facility Name,Age Group,Zip Code - 3 digits,Gender,Race,Ethnicity,Length of Stay,Type of Admission,Patient Disposition,Discharge Year,CCS Diagnosis Code,CCS Diagnosis Description,CCS Procedure Code,CCS Procedure Description,APR DRG Code,APR DRG Description,APR MDC Code,APR MDC Description,APR Severity of Illness Code,APR Severity of Illness Description,APR Risk of Mortality,APR Medical Surgical Description,Payment Typology 1,Payment Typology 2,Payment Typology 3,Birth Weight,Abortion Edit Indicator,Emergency Department Indicator,Total Charges,Total Costs
New York City,Kings,7002002,001324,Mount Sinai Brooklyn,70 or Older,116,M,White,Not Span/Hispanic,6,Emergency,Skilled Nursing Home,2017,163,Genitourinary symptoms and ill-defined conditions,231,OTHER THERAPEUTIC PRCS,468,"Other kidney & urinary tract diagnoses, signs & symptoms",11,Diseases and Disorders of the Kidney and Urinary Tract,2,Moderate,Major,Medical,Medicare,Medicaid,Self-Pay,,N,Y,46708.48,7937.19
New York City,Manhattan,7002032,001466,Mount Sinai West,50 to 69,100,M,White,Not Span/Hispanic,3,Emergency,Home or Self Care,2017,163,Genitourinary symptoms and ill-defined conditions,231,OTHER THERAPEUTIC PRCS,468,"Other kidney & urinary tract diagnoses, signs & symptoms",11,Diseases and Disorders of the Kidney and Urinary Tract,3,Major,Moderate,Medical,Medicare,Private Health Insurance,Self-Pay,,N,Y,29287.14,7294.42
New York City,Manhattan,7002032,001469,Mount Sinai St. Luke's,50 to 69,100,F,Black/African American,Spanish/Hispanic,6,Emergency,Home w/ Home Health Services,2017,163,Genitourinary symptoms and ill-defined conditions,195,DX ULTRASOUND URINARY,468,"Other kidney & urinary tract diagnoses, signs & symptoms",11,Diseases and Disorders of the Kidney and Urinary Tract,2,Moderate,Minor,Medical,Medicaid,Medicaid,Self-Pay,,N,Y,43334.14,12041.45
New York City,Bronx,7000006,001169,Montefiore Medical Center - Henry & Lucy Moses Div,70 or Older,104,F,Black/African American,Not Span/Hispanic,6,Emergency,Home or Self Care,2017,234,Crushing injury or internal injury,191,ARTERIO/VENOGRAM-NOT HH,468,"Other kidney & urinary tract diagnoses, signs & symptoms",11,Diseases and Disorders of the Kidney and Urinary Tract,2,Moderate,Moderate,Medical,Medicare,,,,N,Y,121926.30,28316.82
New York City,Bronx,7000006,001169,Montefiore Medical Center - Henry & Lucy Moses Div,30 to 49,104,M,Other Race,Spanish/Hispanic,4,Emergency,Home or Self Care,2017,215,Genitourinary congenital anomalies,000,NO PROC,468,"Other kidney & urinary tract diagnoses, signs & symptoms",11,Diseases and Disorders of the Kidney and Urinary Tract,2,Moderate,Moderate,Medical,Medicaid,,,,N,Y,42479.48,7985.66
New York City,Bronx,7000006,001169,Montefiore Medical Center - Henry & Lucy Moses Div,50 to 69,104,F,Black/African American,Not Span/Hispanic,3,Emergency,Home or Self Care,2017,163,Genitourinary symptoms and ill-defined conditions,000,NO PROC,468,"Other kidney & urinary tract diagnoses, signs & symptoms",11,Diseases and Disorders of the Kidney and Urinary Tract,1,Minor,Minor,Medical,Medicaid,,,,N,Y,40173.58,6778.06
New York City,Bronx,7000006,001169,Montefiore Medical Center - Henry & Lucy Moses Div,50 to 69,104,F,Other Race,Not Span/Hispanic,2,Emergency,Home or Self Care,2017,163,Genitourinary symptoms and ill-defined conditions,000,NO PROC,468,"Other kidney & urinary tract diagnoses, signs & symptoms",11,Diseases and Disorders of the Kidney and Urinary Tract,1,Minor,Moderate,Medical,Medicaid,,,,N,Y,24953.92,4095.73
New York City,Bronx,7000011,001175,Calvary Hospital Inc,70 or Older,104,F,White,Not Span/Hispanic,4,Elective,Expired,2017,050,Diabetes mellitus with complications,000,NO PROC,468,"Other kidney & urinary tract diagnoses, signs & symptoms",11,Diseases and Disorders of the Kidney and Urinary Tract,3,Major,Major,Medical,Medicare,,,,N,N,8709.87,4721.32
New York City,Bronx,7000006,003058,Montefiore Med Center - Jack D Weiler Hosp of A Einstein College Div,50 to 69,104,F,Other Race,Not Span/Hispanic,2,Emergency,Home or Self Care,2017,163,Genitourinary symptoms and ill-defined conditions,231,OTHER THERAPEUTIC PRCS,468,"Other kidney & urinary tract diagnoses, signs & symptoms",11,Diseases and Disorders of the Kidney and Urinary Tract,1,Minor,Moderate,Medical,Medicaid,,,,N,Y,18343.98,3666.29
New York City,Kings,7001033,001315,Kingsbrook Jewish Medical Center,50 to 69,112,F,Black/African American,Not Span/Hispanic,9,Emergency,Home or Self Care,2017,163,Genitourinary symptoms and ill-defined conditions,111,OT NON-OR THER PRC URIN,468,"Other kidney & urinary tract diagnoses, signs & symptoms",11,Diseases and Disorders of the Kidney and Urinary Tract,2,Moderate,Moderate,Medical,Medicare,Medicare,Medicaid,,N,Y,65163.00,20701.28
New York City,Kings,7002002,001324,Mount Sinai Brooklyn,30 to 49,112,M,White,Not Span/Hispanic,15,Emergency,Home or Self Care,2017,050,Diabetes mellitus with complications,058,HEMODIALYSIS,468,"Other kidney & urinary tract diagnoses, signs & symptoms",11,Diseases and Disorders of the Kidney and Urinary Tract,3,Major,Major,Medical,Private Health Insurance,Self-Pay,,,N,Y,122016.83,25638.81
New York City,Kings,7002002,001324,Mount Sinai Brooklyn,50 to 69,112,M,Black/African American,Not Span/Hispanic,3,Emergency,Home or Self Care,2017,163,Genitourinary symptoms and ill-defined conditions,231,OTHER THERAPEUTIC PRCS,468,"Other kidney & urinary tract diagnoses, signs & symptoms",11,Diseases and Disorders of the Kidney and Urinary Tract,1,Minor,Minor,Medical,Private Health Insurance,Self-Pay,,,N,N,25366.07,3799.83
New York City,Manhattan,7002024,001456,Mount Sinai Hospital,70 or Older,112,F,White,Not Span/Hispanic,8,Emergency,Home w/ Home Health Services,2017,162,Other diseases of bladder and urethra,223,ENTERAL/PARENTERAL NUTR,468,"Other kidney & urinary tract diagnoses, signs & symptoms",11,Diseases and Disorders of the Kidney and Urinary Tract,4,Extreme,Extreme,Medical,Medicare,Private Health Insurance,Self-Pay,,N,Y,68869.32,22473.41
New York City,Manhattan,7002032,001469,Mount Sinai St. Luke's,50 to 69,100,F,Black/African American,Spanish/Hispanic,3,Emergency,Home or Self Care,2017,161,Other diseases of kidney and ureters,231,OTHER THERAPEUTIC PRCS,468,"Other kidney & urinary tract diagnoses, signs & symptoms",11,Diseases and Disorders of the Kidney and Urinary Tract,1,Minor,Minor,Medical,Private Health Insurance,Self-Pay,,,N,Y,27865.52,7430.61
Finger Lakes,Livingston,2527000,000393,Nicholas H Noyes Memorial Hospital,70 or Older,145,M,White,Not Span/Hispanic,2,Emergency,Skilled Nursing Home,2017,162,Other diseases of bladder and urethra,000,NO PROC,468,"Other kidney & urinary tract diagnoses, signs & symptoms",11,Diseases and Disorders of the Kidney and Urinary Tract,3,Major,Moderate,Medical,Medicare,Medicaid,,,N,Y,4512.85,2359.07
New York City,Bronx,7000006,001168,Montefiore Medical Center-Wakefield Hospital,70 or Older,104,M,Black/African American,Not Span/Hispanic,3,Emergency,Home or Self Care,2017,162,Other diseases of bladder and urethra,111,OT NON-OR THER PRC URIN,468,"Other kidney & urinary tract diagnoses, signs & symptoms",11,Diseases and Disorders of the Kidney and Urinary Tract,2,Moderate,Moderate,Medical,Medicare,,,,N,Y,38006.18,6320.74
New York City,Bronx,7000006,001168,Montefiore Medical Center-Wakefield Hospital,50 to 69,104,F,Other Race,Spanish/Hispanic,7,Emergency,Home w/ Home Health Services,2017,050,Diabetes mellitus with complications,058,HEMODIALYSIS,468,"Other kidney & urinary tract diagnoses, signs & symptoms",11,Diseases and Disorders of the Kidney and Urinary Tract,2,Moderate,Moderate,Medical,Medicaid,,,,N,Y,80035.67,18195.66
New York City,Kings,7002002,001324,Mount Sinai Brooklyn,50 to 69,112,F,Black/African American,Not Span/Hispanic,6,Emergency,Home or Self Care,2017,050,Diabetes mellitus with complications,193,DX ULTRASOUND HEART,468,"Other kidney & urinary tract diagnoses, signs & symptoms",11,Diseases and Disorders of the Kidney and Urinary Tract,2,Moderate,Moderate,Medical,Private Health Insurance,Self-Pay,,,N,Y,51250.46,9377.81
New York City,Kings,7002002,001324,Mount Sinai Brooklyn,70 or Older,112,M,White,Not Span/Hispanic,2,Emergency,Home w/ Home Health Services,2017,163,Genitourinary symptoms and ill-defined conditions,231,OTHER THERAPEUTIC PRCS,468,"Other kidney & urinary tract diagnoses, signs & symptoms",11,Diseases and Disorders of the Kidney and Urinary Tract,1,Minor,Major,Medical,Medicare,Medicaid,Self-Pay,,N,Y,21731.96,3313.59
New York City,Manhattan,7002032,001469,Mount Sinai St. Luke's,70 or Older,100,M,White,Not Span/Hispanic,4,Emergency,Short-term Hospital,2017,161,Other diseases of kidney and ureters,198,MAG RESONANCE IMAGING,468,"Other kidney & urinary tract diagnoses, signs & symptoms",11,Diseases and Disorders of the Kidney and Urinary Tract,3,Major,Moderate,Medical,Medicare,Blue Cross/Blue Shield,Self-Pay,,N,Y,48101.45,12486.07
New York City,Bronx,7000006,001168,Montefiore Medical Center-Wakefield Hospital,70 or Older,104,M,Other Race,Not Span/Hispanic,3,Emergency,Skilled Nursing Home,2017,163,Genitourinary symptoms and ill-defined conditions,231,OTHER THERAPEUTIC PRCS,468,"Other kidney & urinary tract diagnoses, signs & symptoms",11,Diseases and Disorders of the Kidney and Urinary Tract,3,Major,Moderate,Medical,Medicare,Private Health Insurance,,,N,Y,39920.68,6397.45
New York City,Bronx,7000006,003058,Montefiore Med Center - Jack D Weiler Hosp of A Einstein College Div,18 to 29,114,M,Other Race,Spanish/Hispanic,6,Emergency,Home or Self Care,2017,050,Diabetes mellitus with complications,193,DX ULTRASOUND HEART,468,"Other kidney & urinary tract diagnoses, signs & symptoms",11,Diseases and Disorders of the Kidney and Urinary Tract,2,Moderate,Moderate,Medical,Medicaid,,,,N,Y,60026.41,12815.93
New York City,Bronx,7000006,003058,Montefiore Med Center - Jack D Weiler Hosp of A Einstein College Div,30 to 49,104,M,Other Race,Not Span/Hispanic,5,Emergency,Home w/ Home Health Services,2017,050,Diabetes mellitus with complications,000,NO PROC,468,"Other kidney & urinary tract diagnoses, signs & symptoms",11,Diseases and Disorders of the Kidney and Urinary Tract,2,Moderate,Moderate,Medical,Medicaid,,,,N,Y,52680.89,10156.63
New York City,Kings,7001003,001288,Brooklyn Hospital Center - Downtown Campus,50 to 69,112,M,Black/African American,Unknown,9,Emergency,Home or Self Care,2017,163,Genitourinary symptoms and ill-defined conditions,109,PRCS ON THE URETHRA,468,"Other kidney & urinary tract diagnoses, signs & symptoms",11,Diseases and Disorders of the Kidney and Urinary Tract,2,Moderate,Moderate,Medical,Medicaid,Medicaid,Self-Pay,,N,Y,86875.39,14989.86
New York City,Kings,7002002,001324,Mount Sinai Brooklyn,70 or Older,112,M,Other Race,Not Span/Hispanic,5,Emergency,Skilled Nursing Home,2017,163,Genitourinary symptoms and ill-defined conditions,231,OTHER THERAPEUTIC PRCS,468,"Other kidney & urinary tract diagnoses, signs & symptoms",11,Diseases and Disorders of the Kidney and Urinary Tract,2,Moderate,Major,Medical,Medicare,Medicaid,Self-Pay,,N,Y,51579.38,10748.40
New York City,Manhattan,7002024,001456,Mount Sinai Hospital,30 to 49,100,F,Black/African American,Not Span/Hispanic,2,Emergency,Home or Self Care,2017,050,Diabetes mellitus with complications,000,NO PROC,468,"Other kidney & urinary tract diagnoses, signs & symptoms",11,Diseases and Disorders of the Kidney and Urinary Tract,3,Major,Moderate,Medical,Medicaid,Medicaid,Self-Pay,,N,Y,21608.97,7334.03
New York City,Manhattan,7002032,001466,Mount Sinai West,30 to 49,100,M,White,Spanish/Hispanic,6,Emergency,Home or Self Care,2017,050,Diabetes mellitus with complications,231,OTHER THERAPEUTIC PRCS,468,"Other kidney & urinary tract diagnoses, signs & symptoms",11,Diseases and Disorders of the Kidney and Urinary Tract,3,Major,Moderate,Medical,Medicaid,Medicaid,Self-Pay,,N,Y,52651.85,14285.37
New York City,Manhattan,7002032,001469,Mount Sinai St. Luke's,70 or Older,100,M,Black/African American,Spanish/Hispanic,12,Emergency,Skilled Nursing Home,2017,163,Genitourinary symptoms and ill-defined conditions,183,ROUTINE CHEST X-RAY,468,"Other kidney & urinary tract diagnoses, signs & symptoms",11,Diseases and Disorders of the Kidney and Urinary Tract,2,Moderate,Major,Medical,Medicare,Medicare,Medicaid,,N,Y,82470.67,23141.85
New York City,Kings,7001008,001293,"New York Community Hospital of Brooklyn, Inc",70 or Older,112,F,Black/African American,Not Span/Hispanic,8,Emergency,Home w/ Home Health Services,2017,161,Other diseases of kidney and ureters,177,COMP AXIAL TOMOGR (CT),468,"Other kidney & urinary tract diagnoses, signs & symptoms",11,Diseases and Disorders of the Kidney and Urinary Tract,3,Major,Major,Medical,Medicare,Medicaid,Self-Pay,,N,Y,26695.15,11498.41
New York City,Kings,7001008,001293,"New York Community Hospital of Brooklyn, Inc",50 to 69,112,F,White,Not Span/Hispanic,6,Emergency,Home or Self Care,2017,050,Diabetes mellitus with complications,202,ELECTROCARDIOGRAM,468,"Other kidney & urinary tract diagnoses, signs & symptoms",11,Diseases and Disorders of the Kidney and Urinary Tract,3,Major,Major,Medical,Medicare,Medicaid,Self-Pay,,N,Y,37080.37,14902.61
New York City,Kings,7001021,001306,New York - Presbyterian Brooklyn Methodist Hospital,70 or Older,112,F,Black/African American,Not Span/Hispanic,6,Emergency,Home w/ Home Health Services,2017,050,Diabetes mellitus with complications,222,BLOOD TRANSFUSION,468,"Other kidney & urinary tract diagnoses, signs & symptoms",11,Diseases and Disorders of the Kidney and Urinary Tract,2,Moderate,Moderate,Medical,Medicare,Medicaid,Self-Pay,,N,Y,38116.94,14437.76
New York City,Kings,7001021,001306,New York - Presbyterian Brooklyn Methodist Hospital,50 to 69,112,F,Black/African American,Not Span/Hispanic,5,Emergency,Skilled Nursing Home,2017,050,Diabetes mellitus with complications,000,NO PROC,468,"Other kidney & urinary tract diagnoses, signs & symptoms",11,Diseases and Disorders of the Kidney and Urinary Tract,3,Major,Moderate,Medical,Medicare,Medicare,Medicaid,,N,Y,24703.44,7866.83
New York City,Kings,7001021,001306,New York - Presbyterian Brooklyn Methodist Hospital,30 to 49,112,F,White,Multi-ethnic,4,Emergency,Skilled Nursing Home,2017,050,Diabetes mellitus with complications,222,BLOOD TRANSFUSION,468,"Other kidney & urinary tract diagnoses, signs & symptoms",11,Diseases and Disorders of the Kidney and Urinary Tract,3,Major,Moderate,Medical,Medicaid,Self-Pay,,,N,Y,31189.01,9611.53
New York City,Kings,7001021,001306,New York - Presbyterian Brooklyn Methodist Hospital,50 to 69,112,F,Black/African American,Not Span/Hispanic,3,Emergency,Left Against Medical Advice,2017,050,Diabetes mellitus with complications,058,HEMODIALYSIS,468,"Other kidney & urinary tract diagnoses, signs & symptoms",11,Diseases and Disorders of the Kidney and Urinary Tract,2,Moderate,Minor,Medical,Medicaid,Self-Pay,,,N,Y,17578.24,6798.48
New York City,Kings,7001021,001306,New York - Presbyterian Brooklyn Methodist Hospital,70 or Older,112,M,White,Not Span/Hispanic,2,Emergency,Home or Self Care,2017,163,Genitourinary symptoms and ill-defined conditions,227,"OT DX PRC (INTERVW,EVAL",468,"Other kidney & urinary tract diagnoses, signs & symptoms",11,Diseases and Disorders of the Kidney and Urinary Tract,1,Minor,Moderate,Medical,Medicare,Blue Cross/Blue Shield,Self-Pay,,N,Y,14547.25,4079.74
New York City,Kings,7001021,001306,New York - Presbyterian Brooklyn Methodist Hospital,50 to 69,112,M,Other Race,Not Span/Hispanic,1,Emergency,Home or Self Care,2017,161,Other diseases of kidney and ureters,000,NO PROC,468,"Other kidney & urinary tract diagnoses, signs & symptoms",11,Diseases and Disorders of the Kidney and Urinary Tract,2,Moderate,Minor,Medical,Private Health Insurance,Medicaid,Self-Pay,,N,Y,11767.45,2652.61
New York City,Kings,7001021,001306,New York - Presbyterian Brooklyn Methodist Hospital,50 to 69,112,M,Black/African American,Not Span/Hispanic,1,Emergency,Home or Self Care,2017,050,Diabetes mellitus with complications,000,NO PROC,468,"Other kidney & urinary tract diagnoses, signs & symptoms",11,Diseases and Disorders of the Kidney and Urinary Tract,3,Major,Moderate,Medical,Medicaid,Medicaid,Self-Pay,,N,Y,5987.05,1861.84
New York City,Kings,7001021,001306,New York - Presbyterian Brooklyn Methodist Hospital,30 to 49,112,F,Black/African American,Not Span/Hispanic,6,Emergency,Home or Self Care,2017,050,Diabetes mellitus with complications,222,BLOOD TRANSFUSION,468,"Other kidney & urinary tract diagnoses, signs & symptoms",11,Diseases and Disorders of the Kidney and Urinary Tract,3,Major,Major,Medical,Medicaid,Medicaid,Self-Pay,,N,Y,47270.46,17527.72
New York City,Kings,7002002,001324,Mount Sinai Brooklyn,30 to 49,112,M,Black/African American,Not Span/Hispanic,16,Emergency,Home or Self Care,2017,162,Other diseases of bladder and urethra,197,OTHER DX ULTRASOUND,468,"Other kidney & urinary tract diagnoses, signs & symptoms",11,Diseases and Disorders of the Kidney and Urinary Tract,3,Major,Moderate,Medical,Medicaid,Medicaid,Self-Pay,,N,Y,108945.95,20127.35
New York City,Kings,7002002,001324,Mount Sinai Brooklyn,70 or Older,112,M,White,Not Span/Hispanic,5,Emergency,Home w/ Home Health Services,2017,050,Diabetes mellitus with complications,183,ROUTINE CHEST X-RAY,468,"Other kidney & urinary tract diagnoses, signs & symptoms",11,Diseases and Disorders of the Kidney and Urinary Tract,3,Major,Moderate,Medical,Medicare,Medicaid,Self-Pay,,N,Y,39701.52,7372.80
New York City,Manhattan,7002054,001458,New York Presbyterian Hospital - New York Weill Cornell Center,18 to 29,OOS,F,Other Race,Not Span/Hispanic,1,Emergency,Home or Self Care,2017,162,Other diseases of bladder and urethra,109,PRCS ON THE URETHRA,468,"Other kidney & urinary tract diagnoses, signs & symptoms",11,Diseases and Disorders of the Kidney and Urinary Tract,1,Minor,Minor,Medical,Blue Cross/Blue Shield,Self-Pay,,,N,N,19045.24,5821.89
New York City,Manhattan,7002054,001464,New York Presbyterian Hospital - Columbia Presbyterian Center,0 to 17,105,F,Other Race,Not Span/Hispanic,9,Emergency,Home or Self Care,2017,163,Genitourinary symptoms and ill-defined conditions,173,OT DX PRC SKIN/SUBCUTAN,468,"Other kidney & urinary tract diagnoses, signs & symptoms",11,Diseases and Disorders of the Kidney and Urinary Tract,1,Minor,Minor,Medical,Blue Cross/Blue Shield,Self-Pay,,,N,Y,94216.58,23920.00
New York City,Manhattan,7002054,001464,New York Presbyterian Hospital - Columbia Presbyterian Center,50 to 69,100,M,Black/African American,Not Span/Hispanic,4,Emergency,Home or Self Care,2017,215,Genitourinary congenital anomalies,058,HEMODIALYSIS,468,"Other kidney & urinary tract diagnoses, signs & symptoms",11,Diseases and Disorders of the Kidney and Urinary Tract,3,Major,Major,Medical,Medicare,Medicaid,Self-Pay,,N,Y,78935.12,40858.34
New York City,Manhattan,7002054,001464,New York Presbyterian Hospital - Columbia Presbyterian Center,70 or Older,104,M,Other Race,Not Span/Hispanic,2,Emergency,Home w/ Home Health Services,2017,163,Genitourinary symptoms and ill-defined conditions,108,INDWELLING CATHETER,468,"Other kidney & urinary tract diagnoses, signs & symptoms",11,Diseases and Disorders of the Kidney and Urinary Tract,2,Moderate,Major,Medical,Medicare,Medicare,Medicaid,,N,Y,22651.90,5760.41
New York City,Manhattan,7002032,001466,Mount Sinai West,50 to 69,100,M,Black/African American,Not Span/Hispanic,5,Emergency,Home w/ Home Health Services,2017,159,Urinary tract infections,211,THERAPEUTIC RADIOLOGY,468,"Other kidney & urinary tract diagnoses, signs & symptoms",11,Diseases and Disorders of the Kidney and Urinary Tract,3,Major,Moderate,Medical,Medicaid,Medicaid,Self-Pay,,N,Y,52831.82,12837.70
New York City,Manhattan,7002054,003975,New York Presbyterian Hospital - Allen Hospital,50 to 69,100,M,Other Race,Multi-ethnic,9,Emergency,Home w/ Home Health Services,2017,050,Diabetes mellitus with complications,227,"OT DX PRC (INTERVW,EVAL",468,"Other kidney & urinary tract diagnoses, signs & symptoms",11,Diseases and Disorders of the Kidney and Urinary Tract,3,Major,Major,Medical,Private Health Insurance,Medicaid,Self-Pay,,N,Y,97742.13,23989.71
New York City,Queens,7003010,001637,New York - Presbyterian/Queens,70 or Older,113,M,Other Race,Spanish/Hispanic,3,Emergency,Home w/ Home Health Services,2017,163,Genitourinary symptoms and ill-defined conditions,111,OT NON-OR THER PRC URIN,468,"Other kidney & urinary tract diagnoses, signs & symptoms",11,Diseases and Disorders of the Kidney and Urinary Tract,1,Minor,Moderate,Medical,Medicare,Medicaid,Self-Pay,,N,N,22376.38,6360.63
New York City,Queens,7003010,001637,New York - Presbyterian/Queens,50 to 69,114,M,Multi-racial,Not Span/Hispanic,3,Emergency,Home or Self Care,2017,163,Genitourinary symptoms and ill-defined conditions,111,OT NON-OR THER PRC URIN,468,"Other kidney & urinary tract diagnoses, signs & symptoms",11,Diseases and Disorders of the Kidney and Urinary Tract,3,Major,Minor,Medical,Medicare,Medicaid,Self-Pay,,N,Y,22597.31,7096.00
New York City,Queens,7003010,001637,New York - Presbyterian/Queens,50 to 69,113,M,White,Not Span/Hispanic,17,Emergency,Home w/ Home Health Services,2017,163,Genitourinary symptoms and ill-defined conditions,211,THERAPEUTIC RADIOLOGY,468,"Other kidney & urinary tract diagnoses, signs & symptoms",11,Diseases and Disorders of the Kidney and Urinary Tract,1,Minor,Moderate,Medical,Medicare,Blue Cross/Blue Shield,Self-Pay,,N,N,104610.17,31131.20
New York City,Queens,7003010,001637,New York - Presbyterian/Queens,70 or Older,113,M,White,Not Span/Hispanic,5,Emergency,Home w/ Home Health Services,2017,050,Diabetes mellitus with complications,054,OT VASC CATH; NOT HEART,468,"Other kidney & urinary tract diagnoses, signs & symptoms",11,Diseases and Disorders of the Kidney and Urinary Tract,2,Moderate,Moderate,Medical,Medicare,Blue Cross/Blue Shield,Self-Pay,,N,Y,45402.51,14031.30
New York City,Queens,7003010,001637,New York - Presbyterian/Queens,50 to 69,113,F,Other Race,Not Span/Hispanic,2,Emergency,Home or Self Care,2017,162,Other diseases of bladder and urethra,179,CT SCAN ABDOMEN,468,"Other kidney & urinary tract diagnoses, signs & symptoms",11,Diseases and Disorders of the Kidney and Urinary Tract,2,Moderate,Minor,Medical,Medicaid,Medicaid,Self-Pay,,N,Y,21557.58,4688.91
New York City,Queens,7003010,001637,New York - Presbyterian/Queens,70 or Older,110,F,White,Not Span/Hispanic,3,Emergency,Home w/ Home Health Services,2017,161,Other diseases of kidney and ureters,179,CT SCAN ABDOMEN,468,"Other kidney & urinary tract diagnoses, signs & symptoms",11,Diseases and Disorders of the Kidney and Urinary Tract,3,Major,Moderate,Medical,Medicare,Private Health Insurance,Self-Pay,,N,Y,26008.73,7422.69
Finger Lakes,Steuben,5002001,000870,St James Mercy Hospital,50 to 69,148,M,White,Not Span/Hispanic,8,Emergency,Skilled Nursing Home,2017,163,Genitourinary symptoms and ill-defined conditions,101,TRANSURETHRAL EXCISION,468,"Other kidney & urinary tract diagnoses, signs & symptoms",11,Diseases and Disorders of the Kidney and Urinary Tract,1,Minor,Moderate,Medical,Medicare,,,,N,Y,15402.60,6919.47
Hudson Valley,Orange,3535001,000708,Bon Secours Community Hospital,70 or Older,OOS,F,White,Not Span/Hispanic,2,Emergency,Home w/ Home Health Services,2017,163,Genitourinary symptoms and ill-defined conditions,000,NO PROC,468,"Other kidney & urinary tract diagnoses, signs & symptoms",11,Diseases and Disorders of the Kidney and Urinary Tract,2,Moderate,Major,Medical,Medicare,Private Health Insurance,,,N,Y,24868.49,6527.56