Hospital Service Area,Hospital County,Operating Certificate Number,Permanent Facility Id,Facility Name,Age Group,Zip Code - 3 digits,Gender,Race,Ethnicity,Length of Stay,Type of Admission,Patient Disposition,Discharge Year,CCS Diagnosis Code,CCS Diagnosis Description,CCS Procedure Code,CCS Procedure Description,APR DRG Code,APR DRG Description,APR MDC Code,APR MDC Description,APR Severity of Illness Code,APR Severity of Illness Description,APR Risk of Mortality,APR Medical Surgical Description,Payment Typology 1,Payment Typology 2,Payment Typology 3,Birth Weight,Abortion Edit Indicator,Emergency Department Indicator,Total Charges,Total Costs
New York City,Kings,7002053,001304,NYU Langone Hospital-Brooklyn,70 or Older,112,M,White,Not Span/Hispanic,3,Emergency,Skilled Nursing Home,2019,GEN004,URINARY TRACT INFECTIONS,ADM001,TRANSFUSION OF BLOOD AND BLOOD PRODUCTS,468,"OTHER KIDNEY & URINARY TRACT DIAGNOSES, SIGNS & SYMPTOMS",11,DISEASES AND DISORDERS OF THE KIDNEY AND URINARY TRACT,3,Major,Major,Medical,Medicare,Private Health Insurance,,,,true,49414.55,18390.19
New York City,Kings,7002053,001304,NYU Langone Hospital-Brooklyn,70 or Older,112,F,White,Spanish/Hispanic,10,Emergency,Home w/ Home Health Services,2019,GEN006,OTHER SPECIFIED AND UNSPECIFIED DISEASES OF KIDNEY AND URETERS,,,468,"OTHER KIDNEY & URINARY TRACT DIAGNOSES, SIGNS & SYMPTOMS",11,DISEASES AND DISORDERS OF THE KIDNEY AND URINARY TRACT,3,Major,Moderate,Medical,Medicare,Medicaid,,,,true,122291.24,39353.46
New York City,Kings,7002053,001304,NYU Langone Hospital-Brooklyn,70 or Older,112,M,White,Not Span/Hispanic,1,Elective,Home or Self Care,2019,NEO072,NEOPLASMS OF UNSPECIFIED NATURE OR UNCERTAIN BEHAVIOR,URN003,URETER AND OTHER URINARY TRACT DILATION,468,"OTHER KIDNEY & URINARY TRACT DIAGNOSES, SIGNS & SYMPTOMS",11,DISEASES AND DISORDERS OF THE KIDNEY AND URINARY TRACT,2,Moderate,Minor,Medical,Medicare,Blue Cross/Blue Shield,,,,false,60209.91,10783.35
New York City,Kings,7002053,001304,NYU Langone Hospital-Brooklyn,50 to 69,112,M,Black/African American,Not Span/Hispanic,4,Emergency,Home or Self Care,2019,GEN006,OTHER SPECIFIED AND UNSPECIFIED DISEASES OF KIDNEY AND URETERS,,,468,"OTHER KIDNEY & URINARY TRACT DIAGNOSES, SIGNS & SYMPTOMS",11,DISEASES AND DISORDERS OF THE KIDNEY AND URINARY TRACT,3,Major,Minor,Medical,Medicaid,,,,,true,66461.38,19162.81
New York City,Kings,7002053,001304,NYU Langone Hospital-Brooklyn,30 to 49,112,M,Other Race,Spanish/Hispanic,1,Emergency,Home or Self Care,2019,GEN007,OTHER SPECIFIED AND UNSPECIFIED DISEASES OF BLADDER AND URETHRA,URN003,URETER AND OTHER URINARY TRACT DILATION,468,"OTHER KIDNEY & URINARY TRACT DIAGNOSES, SIGNS & SYMPTOMS",11,DISEASES AND DISORDERS OF THE KIDNEY AND URINARY TRACT,1,Minor,Minor,Medical,Medicaid,,,,,true,36806.35,7776.83
New York City,Kings,7002053,001304,NYU Langone Hospital-Brooklyn,70 or Older,112,M,White,Not Span/Hispanic,1,Emergency,Home or Self Care,2019,GEN009,HEMATURIA,ADM021,"ADMINISTRATION OF THERAPEUTIC SUBSTANCES, NEC",468,"OTHER KIDNEY & URINARY TRACT DIAGNOSES, SIGNS & SYMPTOMS",11,DISEASES AND DISORDERS OF THE KIDNEY AND URINARY TRACT,3,Major,Major,Medical,Medicare,Medicare,,,,true,30714.26,6838.33
New York City,Kings,7002053,001304,NYU Langone Hospital-Brooklyn,70 or Older,112,M,Other Race,Not Span/Hispanic,6,Emergency,Skilled Nursing Home,2019,INJ010,"INTERNAL ORGAN INJURY, INITIAL ENCOUNTER",ADM015,ADMINISTRATION OF ANTIBIOTICS,468,"OTHER KIDNEY & URINARY TRACT DIAGNOSES, SIGNS & SYMPTOMS",11,DISEASES AND DISORDERS OF THE KIDNEY AND URINARY TRACT,4,Extreme,Extreme,Medical,Medicare,Medicaid,,,,true,71082.71,23564.11
New York City,Kings,7002053,001304,NYU Langone Hospital-Brooklyn,30 to 49,112,F,White,Spanish/Hispanic,1,Emergency,Home or Self Care,2019,SYM011,GENITOURINARY SIGNS AND SYMPTOMS,URN006,BLADDER CATHETERIZATION AND DRAINAGE,468,"OTHER KIDNEY & URINARY TRACT DIAGNOSES, SIGNS & SYMPTOMS",11,DISEASES AND DISORDERS OF THE KIDNEY AND URINARY TRACT,1,Minor,Minor,Medical,Medicaid,,,,,true,22718.96,5760.42
New York City,Kings,7002053,001304,NYU Langone Hospital-Brooklyn,50 to 69,112,F,Other Race,Not Span/Hispanic,1,Emergency,Home or Self Care,2019,END003,DIABETES MELLITUS WITH COMPLICATION,,,468,"OTHER KIDNEY & URINARY TRACT DIAGNOSES, SIGNS & SYMPTOMS",11,DISEASES AND DISORDERS OF THE KIDNEY AND URINARY TRACT,2,Moderate,Major,Medical,Medicaid,,,,,true,19679.55,4996.52
New York City,Kings,7002053,001304,NYU Langone Hospital-Brooklyn,50 to 69,112,M,White,Not Span/Hispanic,2,Emergency,Home or Self Care,2019,GEN009,HEMATURIA,,,468,"OTHER KIDNEY & URINARY TRACT DIAGNOSES, SIGNS & SYMPTOMS",11,DISEASES AND DISORDERS OF THE KIDNEY AND URINARY TRACT,3,Major,Major,Medical,Private Health Insurance,Medicare,,,,true,27349.5,8120.85
New York City,Kings,7002053,001304,NYU Langone Hospital-Brooklyn,50 to 69,112,M,White,Not Span/Hispanic,8,Emergency,Home or Self Care,2019,GEN006,OTHER SPECIFIED AND UNSPECIFIED DISEASES OF KIDNEY AND URETERS,,,468,"OTHER KIDNEY & URINARY TRACT DIAGNOSES, SIGNS & SYMPTOMS",11,DISEASES AND DISORDERS OF THE KIDNEY AND URINARY TRACT,3,Major,Moderate,Medical,Medicare,,,,,true,89705.32,30130.49
New York City,Kings,7002053,001304,NYU Langone Hospital-Brooklyn,30 to 49,112,F,White,Not Span/Hispanic,1,Emergency,Home or Self Care,2019,GEN006,OTHER SPECIFIED AND UNSPECIFIED DISEASES OF KIDNEY AND URETERS,ADM021,"ADMINISTRATION OF THERAPEUTIC SUBSTANCES, NEC",468,"OTHER KIDNEY & URINARY TRACT DIAGNOSES, SIGNS & SYMPTOMS",11,DISEASES AND DISORDERS OF THE KIDNEY AND URINARY TRACT,2,Moderate,Minor,Medical,Blue Cross/Blue Shield,,,,,true,26519.54,6320.73
New York City,Kings,7002053,001304,NYU Langone Hospital-Brooklyn,70 or Older,112,F,White,Spanish/Hispanic,1,Emergency,Home w/ Home Health Services,2019,SYM011,GENITOURINARY SIGNS AND SYMPTOMS,,,468,"OTHER KIDNEY & URINARY TRACT DIAGNOSES, SIGNS & SYMPTOMS",11,DISEASES AND DISORDERS OF THE KIDNEY AND URINARY TRACT,1,Minor,Moderate,Medical,Medicare,Medicaid,,,,true,20183.39,5501.03
New York City,Kings,7002053,001304,NYU Langone Hospital-Brooklyn,70 or Older,112,F,White,Not Span/Hispanic,1,Emergency,Home or Self Care,2019,GEN006,OTHER SPECIFIED AND UNSPECIFIED DISEASES OF KIDNEY AND URETERS,,,468,"OTHER KIDNEY & URINARY TRACT DIAGNOSES, SIGNS & SYMPTOMS",11,DISEASES AND DISORDERS OF THE KIDNEY AND URINARY TRACT,3,Major,Major,Medical,Medicare,Blue Cross/Blue Shield,,,,true,23765.59,5950.47
New York City,Kings,7002053,001304,NYU Langone Hospital-Brooklyn,50 to 69,112,M,White,Not Span/Hispanic,1,Emergency,Home or Self Care,2019,SYM011,GENITOURINARY SIGNS AND SYMPTOMS,URN006,BLADDER CATHETERIZATION AND DRAINAGE,468,"OTHER KIDNEY & URINARY TRACT DIAGNOSES, SIGNS & SYMPTOMS",11,DISEASES AND DISORDERS OF THE KIDNEY AND URINARY TRACT,1,Minor,Minor,Medical,Medicaid,,,,,true,15785,4523.59
New York City,Kings,7002053,001304,NYU Langone Hospital-Brooklyn,70 or Older,112,F,Other Race,Not Span/Hispanic,3,Emergency,Home or Self Care,2019,GEN006,OTHER SPECIFIED AND UNSPECIFIED DISEASES OF KIDNEY AND URETERS,IMG008,ULTRASONOGRAPHY,468,"OTHER KIDNEY & URINARY TRACT DIAGNOSES, SIGNS & SYMPTOMS",11,DISEASES AND DISORDERS OF THE KIDNEY AND URINARY TRACT,3,Major,Minor,Medical,Medicare,Medicare,,,,true,55318.38,14736.22
New York City,Kings,7002053,001304,NYU Langone Hospital-Brooklyn,30 to 49,112,M,White,Not Span/Hispanic,1,Emergency,Home or Self Care,2019,SYM011,GENITOURINARY SIGNS AND SYMPTOMS,ADM015,ADMINISTRATION OF ANTIBIOTICS,468,"OTHER KIDNEY & URINARY TRACT DIAGNOSES, SIGNS & SYMPTOMS",11,DISEASES AND DISORDERS OF THE KIDNEY AND URINARY TRACT,2,Moderate,Moderate,Medical,Private Health Insurance,,,,,true,16761.93,4369.77
New York City,Kings,7002053,001304,NYU Langone Hospital-Brooklyn,70 or Older,112,M,White,Not Span/Hispanic,1,Emergency,Home or Self Care,2019,GEN009,HEMATURIA,ADM001,TRANSFUSION OF BLOOD AND BLOOD PRODUCTS,468,"OTHER KIDNEY & URINARY TRACT DIAGNOSES, SIGNS & SYMPTOMS",11,DISEASES AND DISORDERS OF THE KIDNEY AND URINARY TRACT,3,Major,Major,Medical,Medicare,Medicaid,,,,true,33945.59,10293.4
New York City,Kings,7002053,001304,NYU Langone Hospital-Brooklyn,70 or Older,112,F,White,Not Span/Hispanic,2,Emergency,Short-term Hospital,2019,END003,DIABETES MELLITUS WITH COMPLICATION,GIS006,PARACENTESIS,468,"OTHER KIDNEY & URINARY TRACT DIAGNOSES, SIGNS & SYMPTOMS",11,DISEASES AND DISORDERS OF THE KIDNEY AND URINARY TRACT,4,Extreme,Extreme,Medical,Medicare,Medicare,,,,true,45080.68,10827.55
New York City,Kings,7002053,001304,NYU Langone Hospital-Brooklyn,30 to 49,112,F,Other Race,Not Span/Hispanic,3,Emergency,Home w/ Home Health Services,2019,END003,DIABETES MELLITUS WITH COMPLICATION,ESA001,HEMODIALYSIS,468,"OTHER KIDNEY & URINARY TRACT DIAGNOSES, SIGNS & SYMPTOMS",11,DISEASES AND DISORDERS OF THE KIDNEY AND URINARY TRACT,2,Moderate,Major,Medical,Medicaid,,,,,true,55117.53,14039.08
New York City,Kings,7002053,001304,NYU Langone Hospital-Brooklyn,70 or Older,112,M,Other Race,Spanish/Hispanic,1,Emergency,Home w/ Home Health Services,2019,SYM011,GENITOURINARY SIGNS AND SYMPTOMS,,,468,"OTHER KIDNEY & URINARY TRACT DIAGNOSES, SIGNS & SYMPTOMS",11,DISEASES AND DISORDERS OF THE KIDNEY AND URINARY TRACT,3,Major,Moderate,Medical,Medicaid,,,,,true,18008.06,4645.16
New York City,Kings,7002053,001304,NYU Langone Hospital-Brooklyn,70 or Older,115,M,White,Not Span/Hispanic,3,Emergency,Home or Self Care,2019,GEN009,HEMATURIA,ADM018,IRRIGATION (DIAGNOSTIC AND THERAPEUTIC),468,"OTHER KIDNEY & URINARY TRACT DIAGNOSES, SIGNS & SYMPTOMS",11,DISEASES AND DISORDERS OF THE KIDNEY AND URINARY TRACT,3,Major,Major,Medical,Medicare,Private Health Insurance,,,,true,33712.16,11246.7
New York City,Kings,7002053,001304,NYU Langone Hospital-Brooklyn,50 to 69,112,F,White,Not Span/Hispanic,8,Emergency,Home or Self Care,2019,GEN006,OTHER SPECIFIED AND UNSPECIFIED DISEASES OF KIDNEY AND URETERS,,,468,"OTHER KIDNEY & URINARY TRACT DIAGNOSES, SIGNS & SYMPTOMS",11,DISEASES AND DISORDERS OF THE KIDNEY AND URINARY TRACT,2,Moderate,Minor,Medical,Private Health Insurance,Medicaid,,,,true,86342.99,29471.23
New York City,Kings,7002053,001304,NYU Langone Hospital-Brooklyn,30 to 49,112,F,Other Race,Spanish/Hispanic,5,Emergency,Home or Self Care,2019,GEN007,OTHER SPECIFIED AND UNSPECIFIED DISEASES OF BLADDER AND URETHRA,,,468,"OTHER KIDNEY & URINARY TRACT DIAGNOSES, SIGNS & SYMPTOMS",11,DISEASES AND DISORDERS OF THE KIDNEY AND URINARY TRACT,2,Moderate,Moderate,Medical,Private Health Insurance,,,,,true,77832.83,19555.54
New York City,Kings,7002053,001304,NYU Langone Hospital-Brooklyn,70 or Older,112,F,Other Race,Not Span/Hispanic,1,Emergency,Left Against Medical Advice,2019,SYM011,GENITOURINARY SIGNS AND SYMPTOMS,,,468,"OTHER KIDNEY & URINARY TRACT DIAGNOSES, SIGNS & SYMPTOMS",11,DISEASES AND DISORDERS OF THE KIDNEY AND URINARY TRACT,2,Moderate,Moderate,Medical,Medicare,Medicaid,,,,true,14576.29,4518.28
New York City,Kings,7002053,001304,NYU Langone Hospital-Brooklyn,50 to 69,112,M,White,Not Span/Hispanic,7,Emergency,Home or Self Care,2019,GEN007,OTHER SPECIFIED AND UNSPECIFIED DISEASES OF BLADDER AND URETHRA,,,468,"OTHER KIDNEY & URINARY TRACT DIAGNOSES, SIGNS & SYMPTOMS",11,DISEASES AND DISORDERS OF THE KIDNEY AND URINARY TRACT,3,Major,Major,Medical,Medicare,,,,,true,97006.57,26987.2
New York City,Kings,7002053,001304,NYU Langone Hospital-Brooklyn,50 to 69,112,M,Other Race,Spanish/Hispanic,6,Emergency,Home or Self Care,2019,GEN006,OTHER SPECIFIED AND UNSPECIFIED DISEASES OF KIDNEY AND URETERS,IMG002,FLUOROSCOPIC ANGIOGRAPHY (EXCLUDING CORONARY),468,"OTHER KIDNEY & URINARY TRACT DIAGNOSES, SIGNS & SYMPTOMS",11,DISEASES AND DISORDERS OF THE KIDNEY AND URINARY TRACT,3,Major,Major,Medical,Medicaid,,,,,true,168536.44,46988.34
New York City,Kings,7002053,001304,NYU Langone Hospital-Brooklyn,70 or Older,112,M,White,Not Span/Hispanic,8,Emergency,Skilled Nursing Home,2019,GEN004,URINARY TRACT INFECTIONS,HEP001,LIVER BIOPSY,468,"OTHER KIDNEY & URINARY TRACT DIAGNOSES, SIGNS & SYMPTOMS",11,DISEASES AND DISORDERS OF THE KIDNEY AND URINARY TRACT,2,Moderate,Major,Medical,Medicare,Medicare,,,,true,146876.1,48540.05
New York City,Kings,7002053,001304,NYU Langone Hospital-Brooklyn,50 to 69,112,M,Black/African American,Not Span/Hispanic,4,Emergency,Home or Self Care,2019,MUS033,GOUT,,,468,"OTHER KIDNEY & URINARY TRACT DIAGNOSES, SIGNS & SYMPTOMS",11,DISEASES AND DISORDERS OF THE KIDNEY AND URINARY TRACT,3,Major,Moderate,Medical,Medicare,Medicaid,,,,true,50709.6,14727.48
New York City,Kings,7002053,001304,NYU Langone Hospital-Brooklyn,50 to 69,112,M,White,Not Span/Hispanic,1,Emergency,Home or Self Care,2019,MUS033,GOUT,MST001,ARTHROCENTESIS,468,"OTHER KIDNEY & URINARY TRACT DIAGNOSES, SIGNS & SYMPTOMS",11,DISEASES AND DISORDERS OF THE KIDNEY AND URINARY TRACT,3,Major,Major,Medical,Medicare,Medicaid,,,,true,40752.21,13469.06
New York City,Kings,7002053,001304,NYU Langone Hospital-Brooklyn,18 to 29,OOS,M,White,Not Span/Hispanic,1,Emergency,Home or Self Care,2019,INJ010,"INTERNAL ORGAN INJURY, INITIAL ENCOUNTER",,,468,"OTHER KIDNEY & URINARY TRACT DIAGNOSES, SIGNS & SYMPTOMS",11,DISEASES AND DISORDERS OF THE KIDNEY AND URINARY TRACT,2,Moderate,Minor,Medical,Medicaid,,,,,true,31398.73,7865.88
New York City,Kings,7002053,001304,NYU Langone Hospital-Brooklyn,70 or Older,112,M,Other Race,Spanish/Hispanic,4,Emergency,Home or Self Care,2019,GEN004,URINARY TRACT INFECTIONS,ADM018,IRRIGATION (DIAGNOSTIC AND THERAPEUTIC),468,"OTHER KIDNEY & URINARY TRACT DIAGNOSES, SIGNS & SYMPTOMS",11,DISEASES AND DISORDERS OF THE KIDNEY AND URINARY TRACT,3,Major,Major,Medical,Medicare,,,,,true,47775.8,15276.31
New York City,Kings,7002053,001304,NYU Langone Hospital-Brooklyn,70 or Older,112,M,Other Race,Spanish/Hispanic,3,Emergency,Home or Self Care,2019,GEN004,URINARY TRACT INFECTIONS,,,468,"OTHER KIDNEY & URINARY TRACT DIAGNOSES, SIGNS & SYMPTOMS",11,DISEASES AND DISORDERS OF THE KIDNEY AND URINARY TRACT,3,Major,Major,Medical,Medicare,,,,,true,47382.92,14319.01
