Hospital Service Area,Hospital County,Operating Certificate Number,Permanent Facility Id,Facility Name,Age Group,Zip Code - 3 digits,Gender,Race,Ethnicity,Length of Stay,Type of Admission,Patient Disposition,Discharge Year,CCS Diagnosis Code,CCS Diagnosis Description,CCS Procedure Code,CCS Procedure Description,APR DRG Code,APR DRG Description,APR MDC Code,APR MDC Description,APR Severity of Illness Code,APR Severity of Illness Description,APR Risk of Mortality,APR Medical Surgical Description,Payment Typology 1,Payment Typology 2,Payment Typology 3,Birth Weight,Abortion Edit Indicator,Emergency Department Indicator,Total Charges,Total Costs
Long Island,Suffolk,5123000,000885,Long Island Community Hospital,70 or Older,119,F,White,Not Span/Hispanic,3,Emergency,Home w/ Home Health Services,2019,INJ010,"INTERNAL ORGAN INJURY, INITIAL ENCOUNTER",URN006,BLADDER CATHETERIZATION AND DRAINAGE,468,"OTHER KIDNEY & URINARY TRACT DIAGNOSES, SIGNS & SYMPTOMS",11,DISEASES AND DISORDERS OF THE KIDNEY AND URINARY TRACT,1,Minor,Moderate,Medical,Medicare,Medicare,,,,true,29799.66,4253.99
Long Island,Suffolk,5123000,000885,Long Island Community Hospital,70 or Older,119,M,White,Not Span/Hispanic,2,Emergency,Home or Self Care,2019,GEN009,HEMATURIA,ADM018,IRRIGATION (DIAGNOSTIC AND THERAPEUTIC),468,"OTHER KIDNEY & URINARY TRACT DIAGNOSES, SIGNS & SYMPTOMS",11,DISEASES AND DISORDERS OF THE KIDNEY AND URINARY TRACT,1,Minor,Moderate,Medical,Medicare,,,,,true,27805.05,5352.45
Long Island,Suffolk,5123000,000885,Long Island Community Hospital,50 to 69,117,F,White,Not Span/Hispanic,28,Emergency,Home w/ Home Health Services,2019,GEN006,OTHER SPECIFIED AND UNSPECIFIED DISEASES OF KIDNEY AND URETERS,,,468,"OTHER KIDNEY & URINARY TRACT DIAGNOSES, SIGNS & SYMPTOMS",11,DISEASES AND DISORDERS OF THE KIDNEY AND URINARY TRACT,4,Extreme,Extreme,Medical,Medicare,Medicare,Medicaid,,,true,176894.64,38770.55
Long Island,Suffolk,5123000,000885,Long Island Community Hospital,70 or Older,117,M,Black/African American,Not Span/Hispanic,6,Emergency,Skilled Nursing Home,2019,GEN006,OTHER SPECIFIED AND UNSPECIFIED DISEASES OF KIDNEY AND URETERS,URN006,BLADDER CATHETERIZATION AND DRAINAGE,468,"OTHER KIDNEY & URINARY TRACT DIAGNOSES, SIGNS & SYMPTOMS",11,DISEASES AND DISORDERS OF THE KIDNEY AND URINARY TRACT,3,Major,Major,Medical,Medicare,Medicare,Medicaid,,,true,47412.77,8023.64
Long Island,Suffolk,5123000,000885,Long Island Community Hospital,50 to 69,119,F,Other Race,Not Span/Hispanic,1,Emergency,Home or Self Care,2019,END003,DIABETES MELLITUS WITH COMPLICATION,ESA001,HEMODIALYSIS,468,"OTHER KIDNEY & URINARY TRACT DIAGNOSES, SIGNS & SYMPTOMS",11,DISEASES AND DISORDERS OF THE KIDNEY AND URINARY TRACT,4,Extreme,Major,Medical,Medicare,Medicare,Medicaid,,,true,22726.12,4233.56
Long Island,Suffolk,5123000,000885,Long Island Community Hospital,50 to 69,119,M,White,Not Span/Hispanic,2,Emergency,Home or Self Care,2019,INJ010,"INTERNAL ORGAN INJURY, INITIAL ENCOUNTER",,,468,"OTHER KIDNEY & URINARY TRACT DIAGNOSES, SIGNS & SYMPTOMS",11,DISEASES AND DISORDERS OF THE KIDNEY AND URINARY TRACT,2,Moderate,Moderate,Medical,Private Health Insurance,Medicare,,,,true,53748.28,4081.19
Long Island,Suffolk,5123000,000885,Long Island Community Hospital,50 to 69,119,M,White,Not Span/Hispanic,11,Emergency,Home or Self Care,2019,INJ010,"INTERNAL ORGAN INJURY, INITIAL ENCOUNTER",URN006,BLADDER CATHETERIZATION AND DRAINAGE,468,"OTHER KIDNEY & URINARY TRACT DIAGNOSES, SIGNS & SYMPTOMS",11,DISEASES AND DISORDERS OF THE KIDNEY AND URINARY TRACT,3,Major,Major,Medical,Private Health Insurance,Medicaid,,,,true,143035.67,20544.54
Long Island,Suffolk,5123000,000885,Long Island Community Hospital,70 or Older,117,M,White,Not Span/Hispanic,4,Emergency,Home or Self Care,2019,GEN006,OTHER SPECIFIED AND UNSPECIFIED DISEASES OF KIDNEY AND URETERS,MST028,"SUBCUTANEOUS TISSUE AND FASCIA PROCEDURES, NEC",468,"OTHER KIDNEY & URINARY TRACT DIAGNOSES, SIGNS & SYMPTOMS",11,DISEASES AND DISORDERS OF THE KIDNEY AND URINARY TRACT,3,Major,Moderate,Medical,Medicare,,,,,true,140390.85,19472.65
Long Island,Suffolk,5123000,000885,Long Island Community Hospital,70 or Older,117,M,White,Not Span/Hispanic,6,Emergency,Skilled Nursing Home,2019,SYM011,GENITOURINARY SIGNS AND SYMPTOMS,,,468,"OTHER KIDNEY & URINARY TRACT DIAGNOSES, SIGNS & SYMPTOMS",11,DISEASES AND DISORDERS OF THE KIDNEY AND URINARY TRACT,2,Moderate,Major,Medical,Medicare,,,,,true,46525.66,8899.39
Long Island,Suffolk,5123000,000885,Long Island Community Hospital,70 or Older,117,M,White,Not Span/Hispanic,3,Emergency,Skilled Nursing Home,2019,GEN006,OTHER SPECIFIED AND UNSPECIFIED DISEASES OF KIDNEY AND URETERS,ADM018,IRRIGATION (DIAGNOSTIC AND THERAPEUTIC),468,"OTHER KIDNEY & URINARY TRACT DIAGNOSES, SIGNS & SYMPTOMS",11,DISEASES AND DISORDERS OF THE KIDNEY AND URINARY TRACT,4,Extreme,Extreme,Medical,Medicare,,,,,true,34430.38,4769.54
Long Island,Suffolk,5123000,000885,Long Island Community Hospital,30 to 49,117,F,White,Not Span/Hispanic,2,Emergency,Home or Self Care,2019,MAL003,GENITOURINARY CONGENITAL ANOMALIES,,,468,"OTHER KIDNEY & URINARY TRACT DIAGNOSES, SIGNS & SYMPTOMS",11,DISEASES AND DISORDERS OF THE KIDNEY AND URINARY TRACT,2,Moderate,Minor,Medical,Self-Pay,,,,,true,35163.7,4787.64
Long Island,Suffolk,5123000,000885,Long Island Community Hospital,50 to 69,119,M,White,Not Span/Hispanic,4,Emergency,Home or Self Care,2019,GEN007,OTHER SPECIFIED AND UNSPECIFIED DISEASES OF BLADDER AND URETHRA,URN003,URETER AND OTHER URINARY TRACT DILATION,468,"OTHER KIDNEY & URINARY TRACT DIAGNOSES, SIGNS & SYMPTOMS",11,DISEASES AND DISORDERS OF THE KIDNEY AND URINARY TRACT,3,Major,Major,Medical,Medicare,,,,,true,31438.74,5369.58
Long Island,Suffolk,5123000,000885,Long Island Community Hospital,70 or Older,117,F,Black/African American,Not Span/Hispanic,10,Emergency,Skilled Nursing Home,2019,GEN009,HEMATURIA,ESA001,HEMODIALYSIS,468,"OTHER KIDNEY & URINARY TRACT DIAGNOSES, SIGNS & SYMPTOMS",11,DISEASES AND DISORDERS OF THE KIDNEY AND URINARY TRACT,3,Major,Major,Medical,Medicare,Medicare,Medicaid,,,true,78228.94,15691.01
Long Island,Suffolk,5123000,000885,Long Island Community Hospital,18 to 29,117,M,Black/African American,Not Span/Hispanic,3,Emergency,Home or Self Care,2019,GEN006,OTHER SPECIFIED AND UNSPECIFIED DISEASES OF KIDNEY AND URETERS,IMG008,ULTRASONOGRAPHY,468,"OTHER KIDNEY & URINARY TRACT DIAGNOSES, SIGNS & SYMPTOMS",11,DISEASES AND DISORDERS OF THE KIDNEY AND URINARY TRACT,3,Major,Moderate,Medical,Blue Cross/Blue Shield,,,,,true,50383.65,5577.33
Long Island,Suffolk,5123000,000885,Long Island Community Hospital,70 or Older,119,M,White,Not Span/Hispanic,13,Emergency,Skilled Nursing Home,2019,INJ010,"INTERNAL ORGAN INJURY, INITIAL ENCOUNTER",GIS007,GI SYSTEM DRAINAGE (EXCLUDING PARACENTESIS),468,"OTHER KIDNEY & URINARY TRACT DIAGNOSES, SIGNS & SYMPTOMS",11,DISEASES AND DISORDERS OF THE KIDNEY AND URINARY TRACT,3,Major,Moderate,Medical,Medicare,Medicare,Private Health Insurance,,,true,91481.1,17124.61
Long Island,Suffolk,5123000,000885,Long Island Community Hospital,70 or Older,117,M,Other Race,Not Span/Hispanic,4,Emergency,Home or Self Care,2019,GEN007,OTHER SPECIFIED AND UNSPECIFIED DISEASES OF BLADDER AND URETHRA,,,468,"OTHER KIDNEY & URINARY TRACT DIAGNOSES, SIGNS & SYMPTOMS",11,DISEASES AND DISORDERS OF THE KIDNEY AND URINARY TRACT,3,Major,Major,Medical,Medicare,Medicare,,,,true,42011.96,6933.54
Long Island,Suffolk,5123000,000885,Long Island Community Hospital,30 to 49,117,F,Black/African American,Not Span/Hispanic,2,Emergency,Home or Self Care,2019,GEN006,OTHER SPECIFIED AND UNSPECIFIED DISEASES OF KIDNEY AND URETERS,,,468,"OTHER KIDNEY & URINARY TRACT DIAGNOSES, SIGNS & SYMPTOMS",11,DISEASES AND DISORDERS OF THE KIDNEY AND URINARY TRACT,2,Moderate,Moderate,Medical,Private Health Insurance,,,,,true,24372.17,4548.74
Long Island,Suffolk,5123000,000885,Long Island Community Hospital,18 to 29,117,M,Other Race,Not Span/Hispanic,1,Emergency,Court/Law Enforcement,2019,INJ010,"INTERNAL ORGAN INJURY, INITIAL ENCOUNTER",PLC001,IMMOBILIZATION BY SPLINT OR OTHER EXTERNAL DEVICE,468,"OTHER KIDNEY & URINARY TRACT DIAGNOSES, SIGNS & SYMPTOMS",11,DISEASES AND DISORDERS OF THE KIDNEY AND URINARY TRACT,2,Moderate,Minor,Medical,Medicaid,,,,,true,44798.52,3504.51
Long Island,Suffolk,5123000,000885,Long Island Community Hospital,70 or Older,117,M,White,Not Span/Hispanic,1,Emergency,Home or Self Care,2019,SYM011,GENITOURINARY SIGNS AND SYMPTOMS,URN006,BLADDER CATHETERIZATION AND DRAINAGE,468,"OTHER KIDNEY & URINARY TRACT DIAGNOSES, SIGNS & SYMPTOMS",11,DISEASES AND DISORDERS OF THE KIDNEY AND URINARY TRACT,2,Moderate,Major,Medical,Medicare,Medicare,,,,true,18882.13,2040.96
Long Island,Suffolk,5123000,000885,Long Island Community Hospital,30 to 49,117,F,Black/African American,Not Span/Hispanic,1,Emergency,Home or Self Care,2019,GEN006,OTHER SPECIFIED AND UNSPECIFIED DISEASES OF KIDNEY AND URETERS,,,468,"OTHER KIDNEY & URINARY TRACT DIAGNOSES, SIGNS & SYMPTOMS",11,DISEASES AND DISORDERS OF THE KIDNEY AND URINARY TRACT,2,Moderate,Moderate,Medical,Private Health Insurance,,,,,true,17768.63,3332.61
Long Island,Suffolk,5123000,000885,Long Island Community Hospital,30 to 49,117,M,Black/African American,Not Span/Hispanic,1,Emergency,Home or Self Care,2019,INJ010,"INTERNAL ORGAN INJURY, INITIAL ENCOUNTER",,,468,"OTHER KIDNEY & URINARY TRACT DIAGNOSES, SIGNS & SYMPTOMS",11,DISEASES AND DISORDERS OF THE KIDNEY AND URINARY TRACT,1,Minor,Minor,Medical,Private Health Insurance,Private Health Insurance,Private Health Insurance,,,true,39105.74,2932.34
