Hospital Service Area,Hospital County,Operating Certificate Number,Permanent Facility Id,Facility Name,Age Group,Zip Code - 3 digits,Gender,Race,Ethnicity,Length of Stay,Type of Admission,Patient Disposition,Discharge Year,CCS Diagnosis Code,CCS Diagnosis Description,CCS Procedure Code,CCS Procedure Description,APR DRG Code,APR DRG Description,APR MDC Code,APR MDC Description,APR Severity of Illness Code,APR Severity of Illness Description,APR Risk of Mortality,APR Medical Surgical Description,Payment Typology 1,Payment Typology 2,Payment Typology 3,Birth Weight,Abortion Edit Indicator,Emergency Department Indicator,Total Charges,Total Costs
New York City,Bronx,7000006,003058,Montefiore Med Center - Jack D Weiler Hosp of A Einstein College Div,70 or Older,104,F,Black/African American,Not Span/Hispanic,6,Emergency,Home or Self Care,2020,END003,DIABETES MELLITUS WITH COMPLICATION,,,468,"OTHER KIDNEY & URINARY TRACT DIAGNOSES, SIGNS & SYMPTOMS",11,DISEASES AND DISORDERS OF THE KIDNEY AND URINARY TRACT,3,Major,Major,Medical,Medicare,Private Health Insurance,,,,Y,101708.44,18136.36
New York City,Manhattan,7002024,001456,Mount Sinai Hospital,0 to 17,112,M,Other Race,Not Span/Hispanic,5,Emergency,Home or Self Care,2020,GEN009,HEMATURIA,ADM001,TRANSFUSION OF BLOOD AND BLOOD PRODUCTS,468,"OTHER KIDNEY & URINARY TRACT DIAGNOSES, SIGNS & SYMPTOMS",11,DISEASES AND DISORDERS OF THE KIDNEY AND URINARY TRACT,3,Major,Major,Medical,Medicaid,Medicaid,Self-Pay,,,Y,72706.66,37377.06
New York City,Bronx,7000006,001169,Montefiore Medical Center - Henry & Lucy Moses Div,50 to 69,104,M,Other Race,Spanish/Hispanic,3,Emergency,Home or Self Care,2020,GEN007,OTHER SPECIFIED AND UNSPECIFIED DISEASES OF BLADDER AND URETHRA,,,468,"OTHER KIDNEY & URINARY TRACT DIAGNOSES, SIGNS & SYMPTOMS",11,DISEASES AND DISORDERS OF THE KIDNEY AND URINARY TRACT,1,Minor,Minor,Medical,Medicare,,,,,Y,50945.97,7590.69
New York City,Bronx,7000006,003058,Montefiore Med Center - Jack D Weiler Hosp of A Einstein College Div,30 to 49,104,F,White,Not Span/Hispanic,2,Emergency,Home w/ Home Health Services,2020,NEO072,NEOPLASMS OF UNSPECIFIED NATURE OR UNCERTAIN BEHAVIOR,,,468,"OTHER KIDNEY & URINARY TRACT DIAGNOSES, SIGNS & SYMPTOMS",11,DISEASES AND DISORDERS OF THE KIDNEY AND URINARY TRACT,2,Moderate,Minor,Medical,Medicaid,,,,,Y,35863.04,5290.9
New York City,Bronx,7000006,001168,Montefiore Medical Center-Wakefield Hospital,70 or Older,104,F,Other Race,Spanish/Hispanic,1,Emergency,Home w/ Home Health Services,2020,GEN009,HEMATURIA,,,468,"OTHER KIDNEY & URINARY TRACT DIAGNOSES, SIGNS & SYMPTOMS",11,DISEASES AND DISORDERS OF THE KIDNEY AND URINARY TRACT,1,Minor,Moderate,Medical,Medicare,Medicaid,,,,Y,22114.61,3293.77
New York City,Bronx,7000006,001169,Montefiore Medical Center - Henry & Lucy Moses Div,50 to 69,104,M,Other Race,Unknown,1,Emergency,Home or Self Care,2020,GEN007,OTHER SPECIFIED AND UNSPECIFIED DISEASES OF BLADDER AND URETHRA,ADM017,ADMINISTRATION OF NUTRITIONAL AND ELECTROLYTIC SUBSTANCES,468,"OTHER KIDNEY & URINARY TRACT DIAGNOSES, SIGNS & SYMPTOMS",11,DISEASES AND DISORDERS OF THE KIDNEY AND URINARY TRACT,3,Major,Moderate,Medical,Private Health Insurance,,,,,Y,23782.02,2986.28
New York City,Bronx,7000006,003058,Montefiore Med Center - Jack D Weiler Hosp of A Einstein College Div,50 to 69,104,M,White,Not Span/Hispanic,7,Emergency,Home w/ Home Health Services,2020,END003,DIABETES MELLITUS WITH COMPLICATION,SUD002,PHARMACOTHERAPY FOR SUBSTANCE USE,468,"OTHER KIDNEY & URINARY TRACT DIAGNOSES, SIGNS & SYMPTOMS",11,DISEASES AND DISORDERS OF THE KIDNEY AND URINARY TRACT,3,Major,Extreme,Medical,Medicare,Private Health Insurance,,,,Y,99388.33,18344.8
New York City,Bronx,7000006,001169,Montefiore Medical Center - Henry & Lucy Moses Div,70 or Older,100,F,Black/African American,Not Span/Hispanic,8,Emergency,Skilled Nursing Home,2020,GEN004,URINARY TRACT INFECTIONS,,,468,"OTHER KIDNEY & URINARY TRACT DIAGNOSES, SIGNS & SYMPTOMS",11,DISEASES AND DISORDERS OF THE KIDNEY AND URINARY TRACT,2,Moderate,Moderate,Medical,Medicare,Medicaid,,,,Y,85563.9,16037.83
New York City,Manhattan,7002032,001469,Mount Sinai Morningside,70 or Older,100,M,Black/African American,Not Span/Hispanic,18,Emergency,Home w/ Home Health Services,2020,GEN006,OTHER SPECIFIED AND UNSPECIFIED DISEASES OF KIDNEY AND URETERS,ADM017,ADMINISTRATION OF NUTRITIONAL AND ELECTROLYTIC SUBSTANCES,468,"OTHER KIDNEY & URINARY TRACT DIAGNOSES, SIGNS & SYMPTOMS",11,DISEASES AND DISORDERS OF THE KIDNEY AND URINARY TRACT,2,Moderate,Moderate,Medical,Medicare,Medicare,Medicaid,,,Y,199053.2,41138.55
New York City,Manhattan,7002032,001469,Mount Sinai Morningside,18 to 29,104,F,Other Race,Not Span/Hispanic,3,Urgent,Home or Self Care,2020,GEN006,OTHER SPECIFIED AND UNSPECIFIED DISEASES OF KIDNEY AND URETERS,IMG008,ULTRASONOGRAPHY,468,"OTHER KIDNEY & URINARY TRACT DIAGNOSES, SIGNS & SYMPTOMS",11,DISEASES AND DISORDERS OF THE KIDNEY AND URINARY TRACT,3,Major,Moderate,Medical,Private Health Insurance,Self-Pay,,,,N,35927.54,7410.49
New York City,Manhattan,7002002,001439,Mount Sinai Beth Israel,50 to 69,100,F,Other Race,Unknown,6,Emergency,Home w/ Home Health Services,2020,END003,DIABETES MELLITUS WITH COMPLICATION,IMG008,ULTRASONOGRAPHY,468,"OTHER KIDNEY & URINARY TRACT DIAGNOSES, SIGNS & SYMPTOMS",11,DISEASES AND DISORDERS OF THE KIDNEY AND URINARY TRACT,3,Major,Major,Medical,Medicaid,Medicaid,Self-Pay,,,Y,73462.39,17062.53
New York City,Manhattan,7002002,001439,Mount Sinai Beth Israel,70 or Older,100,M,White,Unknown,2,Emergency,Home or Self Care,2020,GEN006,OTHER SPECIFIED AND UNSPECIFIED DISEASES OF KIDNEY AND URETERS,ADM017,ADMINISTRATION OF NUTRITIONAL AND ELECTROLYTIC SUBSTANCES,468,"OTHER KIDNEY & URINARY TRACT DIAGNOSES, SIGNS & SYMPTOMS",11,DISEASES AND DISORDERS OF THE KIDNEY AND URINARY TRACT,2,Moderate,Major,Medical,Medicare,Medicaid,Self-Pay,,,Y,29134.22,6054.84
New York City,Bronx,7000006,003058,Montefiore Med Center - Jack D Weiler Hosp of A Einstein College Div,70 or Older,104,F,White,Not Span/Hispanic,5,Emergency,Skilled Nursing Home,2020,GEN007,OTHER SPECIFIED AND UNSPECIFIED DISEASES OF BLADDER AND URETHRA,URN006,BLADDER CATHETERIZATION AND DRAINAGE,468,"OTHER KIDNEY & URINARY TRACT DIAGNOSES, SIGNS & SYMPTOMS",11,DISEASES AND DISORDERS OF THE KIDNEY AND URINARY TRACT,1,Minor,Minor,Medical,Medicare,,,,,Y,57849.14,9313.42
New York City,Bronx,7000006,001169,Montefiore Medical Center - Henry & Lucy Moses Div,0 to 17,112,M,Other Race,Unknown,4,Elective,Home or Self Care,2020,GEN008,URINARY INCONTINENCE,MAM011,ELECTROENCEPHALOGRAM (EEG),468,"OTHER KIDNEY & URINARY TRACT DIAGNOSES, SIGNS & SYMPTOMS",11,DISEASES AND DISORDERS OF THE KIDNEY AND URINARY TRACT,1,Minor,Minor,Medical,Medicaid,,,,,N,45159,11956.17
New York City,Manhattan,7002024,001456,Mount Sinai Hospital,30 to 49,112,F,White,Not Span/Hispanic,1,Urgent,Home or Self Care,2020,END003,DIABETES MELLITUS WITH COMPLICATION,,,468,"OTHER KIDNEY & URINARY TRACT DIAGNOSES, SIGNS & SYMPTOMS",11,DISEASES AND DISORDERS OF THE KIDNEY AND URINARY TRACT,2,Moderate,Minor,Medical,Private Health Insurance,Medicare,Self-Pay,,,N,15481,3702.45
New York City,Manhattan,7002024,001456,Mount Sinai Hospital,50 to 69,104,F,White,Not Span/Hispanic,4,Emergency,Home or Self Care,2020,END003,DIABETES MELLITUS WITH COMPLICATION,,,468,"OTHER KIDNEY & URINARY TRACT DIAGNOSES, SIGNS & SYMPTOMS",11,DISEASES AND DISORDERS OF THE KIDNEY AND URINARY TRACT,3,Major,Major,Medical,Medicare,Medicare,Self-Pay,,,Y,52997.22,13668.77
New York City,Bronx,7000006,003058,Montefiore Med Center - Jack D Weiler Hosp of A Einstein College Div,50 to 69,104,M,Black/African American,Not Span/Hispanic,5,Emergency,Home or Self Care,2020,END003,DIABETES MELLITUS WITH COMPLICATION,ADM017,ADMINISTRATION OF NUTRITIONAL AND ELECTROLYTIC SUBSTANCES,468,"OTHER KIDNEY & URINARY TRACT DIAGNOSES, SIGNS & SYMPTOMS",11,DISEASES AND DISORDERS OF THE KIDNEY AND URINARY TRACT,3,Major,Major,Medical,Medicare,Medicaid,,,,Y,75845.37,12444.1
New York City,Bronx,7000006,003058,Montefiore Med Center - Jack D Weiler Hosp of A Einstein College Div,70 or Older,104,M,Black/African American,Not Span/Hispanic,21,Emergency,Skilled Nursing Home,2020,GEN004,URINARY TRACT INFECTIONS,ADM015,ADMINISTRATION OF ANTIBIOTICS,468,"OTHER KIDNEY & URINARY TRACT DIAGNOSES, SIGNS & SYMPTOMS",11,DISEASES AND DISORDERS OF THE KIDNEY AND URINARY TRACT,2,Moderate,Major,Medical,Medicare,,,,,Y,180419.91,33052.08
New York City,Bronx,7000006,001169,Montefiore Medical Center - Henry & Lucy Moses Div,50 to 69,104,M,Black/African American,Not Span/Hispanic,1,Emergency,Home or Self Care,2020,END003,DIABETES MELLITUS WITH COMPLICATION,,,468,"OTHER KIDNEY & URINARY TRACT DIAGNOSES, SIGNS & SYMPTOMS",11,DISEASES AND DISORDERS OF THE KIDNEY AND URINARY TRACT,3,Major,Moderate,Medical,Private Health Insurance,Private Health Insurance,,,,N,24663,4434.11
New York City,Bronx,7000006,001169,Montefiore Medical Center - Henry & Lucy Moses Div,50 to 69,104,M,Black/African American,Not Span/Hispanic,1,Emergency,Home or Self Care,2020,GEN004,URINARY TRACT INFECTIONS,,,468,"OTHER KIDNEY & URINARY TRACT DIAGNOSES, SIGNS & SYMPTOMS",11,DISEASES AND DISORDERS OF THE KIDNEY AND URINARY TRACT,2,Moderate,Major,Medical,Medicare,Medicaid,,,,Y,23767.95,3272.14
New York City,Manhattan,7002054,001464,New York-Presbyterian Hospital - Columbia Presbyterian Center,70 or Older,104,F,Multi-racial,Spanish/Hispanic,2,Emergency,Home w/ Home Health Services,2020,END003,DIABETES MELLITUS WITH COMPLICATION,ESA001,HEMODIALYSIS,468,"OTHER KIDNEY & URINARY TRACT DIAGNOSES, SIGNS & SYMPTOMS",11,DISEASES AND DISORDERS OF THE KIDNEY AND URINARY TRACT,3,Major,Major,Medical,Medicare,Medicaid,Self-Pay,,,Y,36960.04,8542.03
New York City,Manhattan,7002054,001464,New York-Presbyterian Hospital - Columbia Presbyterian Center,50 to 69,100,M,Black/African American,Spanish/Hispanic,1,Emergency,Home or Self Care,2020,GEN009,HEMATURIA,URN006,BLADDER CATHETERIZATION AND DRAINAGE,468,"OTHER KIDNEY & URINARY TRACT DIAGNOSES, SIGNS & SYMPTOMS",11,DISEASES AND DISORDERS OF THE KIDNEY AND URINARY TRACT,1,Minor,Minor,Medical,Medicaid,Medicaid,Self-Pay,,,Y,15359.17,3466.38
New York City,Manhattan,7002054,001464,New York-Presbyterian Hospital - Columbia Presbyterian Center,70 or Older,104,F,White,Not Span/Hispanic,3,Urgent,Skilled Nursing Home,2020,GEN007,OTHER SPECIFIED AND UNSPECIFIED DISEASES OF BLADDER AND URETHRA,URN006,BLADDER CATHETERIZATION AND DRAINAGE,468,"OTHER KIDNEY & URINARY TRACT DIAGNOSES, SIGNS & SYMPTOMS",11,DISEASES AND DISORDERS OF THE KIDNEY AND URINARY TRACT,2,Moderate,Minor,Medical,Medicare,Medicare,Self-Pay,,,N,62978.55,16706.14
New York City,Manhattan,7002024,001456,Mount Sinai Hospital,50 to 69,112,M,Black/African American,Not Span/Hispanic,10,Urgent,Home w/ Home Health Services,2020,END003,DIABETES MELLITUS WITH COMPLICATION,URN002,KIDNEY AND OTHER URINARY TRACT BIOPSY (NON-ENDOSCOPIC),468,"OTHER KIDNEY & URINARY TRACT DIAGNOSES, SIGNS & SYMPTOMS",11,DISEASES AND DISORDERS OF THE KIDNEY AND URINARY TRACT,3,Major,Major,Medical,Private Health Insurance,Self-Pay,,,,N,123682.96,31166.95
New York City,Queens,7003010,001637,New York - Presbyterian/Queens,50 to 69,113,M,Other Race,Not Span/Hispanic,4,Emergency,Home or Self Care,2020,GEN009,HEMATURIA,ADM015,ADMINISTRATION OF ANTIBIOTICS,468,"OTHER KIDNEY & URINARY TRACT DIAGNOSES, SIGNS & SYMPTOMS",11,DISEASES AND DISORDERS OF THE KIDNEY AND URINARY TRACT,1,Minor,Minor,Medical,Medicare,Medicare,Medicaid,,,Y,30747.51,7612.14
New York City,Queens,7003010,001637,New York - Presbyterian/Queens,50 to 69,113,M,White,Not Span/Hispanic,2,Emergency,Home or Self Care,2020,GEN009,HEMATURIA,ADM018,IRRIGATION (DIAGNOSTIC AND THERAPEUTIC),468,"OTHER KIDNEY & URINARY TRACT DIAGNOSES, SIGNS & SYMPTOMS",11,DISEASES AND DISORDERS OF THE KIDNEY AND URINARY TRACT,1,Minor,Minor,Medical,Blue Cross/Blue Shield,Self-Pay,,,,Y,18335.47,4478.83
New York City,Queens,7003010,001637,New York - Presbyterian/Queens,70 or Older,113,M,White,Not Span/Hispanic,3,Emergency,Home or Self Care,2020,GEN009,HEMATURIA,ADM021,"ADMINISTRATION OF THERAPEUTIC SUBSTANCES, NEC",468,"OTHER KIDNEY & URINARY TRACT DIAGNOSES, SIGNS & SYMPTOMS",11,DISEASES AND DISORDERS OF THE KIDNEY AND URINARY TRACT,1,Minor,Minor,Medical,Medicare,Medicaid,Self-Pay,,,Y,27917.3,6170.09
New York City,Kings,7002053,001304,NYU Langone Hospital-Brooklyn,70 or Older,112,F,White,Not Span/Hispanic,1,Emergency,Home w/ Home Health Services,2020,SYM011,GENITOURINARY SIGNS AND SYMPTOMS,,,468,"OTHER KIDNEY & URINARY TRACT DIAGNOSES, SIGNS & SYMPTOMS",11,DISEASES AND DISORDERS OF THE KIDNEY AND URINARY TRACT,2,Moderate,Moderate,Medical,Medicare,Blue Cross/Blue Shield,,,,Y,54355.53,14463.02
New York City,Manhattan,7002054,001458,New York-Presbyterian Hospital - New York Weill Cornell Center,70 or Older,113,M,Other Race,Not Span/Hispanic,1,Emergency,Home or Self Care,2020,GEN006,OTHER SPECIFIED AND UNSPECIFIED DISEASES OF KIDNEY AND URETERS,URN005,NEPHROSTOMY AND URETEROSTOMY PROCEDURES (INCLUDING STENTS),468,"OTHER KIDNEY & URINARY TRACT DIAGNOSES, SIGNS & SYMPTOMS",11,DISEASES AND DISORDERS OF THE KIDNEY AND URINARY TRACT,1,Minor,Minor,Medical,Medicare,Medicare,Self-Pay,,,N,33731.56,10214.84
New York City,Queens,7003010,001637,New York - Presbyterian/Queens,50 to 69,114,F,White,Not Span/Hispanic,10,Emergency,Home or Self Care,2020,END003,DIABETES MELLITUS WITH COMPLICATION,CAR024,VENOUS AND ARTERIAL CATHETER PLACEMENT,468,"OTHER KIDNEY & URINARY TRACT DIAGNOSES, SIGNS & SYMPTOMS",11,DISEASES AND DISORDERS OF THE KIDNEY AND URINARY TRACT,3,Major,Major,Medical,Private Health Insurance,,,,,Y,110615.97,27480.31
New York City,Manhattan,7002054,001458,New York-Presbyterian Hospital - New York Weill Cornell Center,70 or Older,100,M,Other Race,Not Span/Hispanic,4,Emergency,Home or Self Care,2020,GEN009,HEMATURIA,ADM010,VACCINATIONS,468,"OTHER KIDNEY & URINARY TRACT DIAGNOSES, SIGNS & SYMPTOMS",11,DISEASES AND DISORDERS OF THE KIDNEY AND URINARY TRACT,1,Minor,Moderate,Medical,Medicare,Private Health Insurance,Self-Pay,,,N,42554.26,9148.41
New York City,Manhattan,7002054,001458,New York-Presbyterian Hospital - New York Weill Cornell Center,70 or Older,101,F,White,Not Span/Hispanic,8,Emergency,Skilled Nursing Home,2020,GEN006,OTHER SPECIFIED AND UNSPECIFIED DISEASES OF KIDNEY AND URETERS,ADM015,ADMINISTRATION OF ANTIBIOTICS,468,"OTHER KIDNEY & URINARY TRACT DIAGNOSES, SIGNS & SYMPTOMS",11,DISEASES AND DISORDERS OF THE KIDNEY AND URINARY TRACT,3,Major,Major,Medical,Medicare,Private Health Insurance,Self-Pay,,,Y,110790.03,23632.87
New York City,Manhattan,7002054,001458,New York-Presbyterian Hospital - New York Weill Cornell Center,70 or Older,111,F,Other Race,Not Span/Hispanic,9,Emergency,Skilled Nursing Home,2020,GEN006,OTHER SPECIFIED AND UNSPECIFIED DISEASES OF KIDNEY AND URETERS,URN006,BLADDER CATHETERIZATION AND DRAINAGE,468,"OTHER KIDNEY & URINARY TRACT DIAGNOSES, SIGNS & SYMPTOMS",11,DISEASES AND DISORDERS OF THE KIDNEY AND URINARY TRACT,4,Extreme,Major,Medical,Blue Cross/Blue Shield,Medicare,Self-Pay,,,Y,132437.13,27949.92
New York City,Kings,7001021,001306,New York - Presbyterian Brooklyn Methodist Hospital,50 to 69,112,M,Black/African American,Not Span/Hispanic,3,Emergency,Home or Self Care,2020,GEN009,HEMATURIA,,,468,"OTHER KIDNEY & URINARY TRACT DIAGNOSES, SIGNS & SYMPTOMS",11,DISEASES AND DISORDERS OF THE KIDNEY AND URINARY TRACT,3,Major,Moderate,Medical,Medicare,Medicare,Self-Pay,,,Y,24564.42,5833.69
New York City,Kings,7001021,001306,New York - Presbyterian Brooklyn Methodist Hospital,70 or Older,112,M,Black/African American,Not Span/Hispanic,37,Emergency,Home w/ Home Health Services,2020,GEN006,OTHER SPECIFIED AND UNSPECIFIED DISEASES OF KIDNEY AND URETERS,MST020,SUBCUTANEOUS TISSUE AND FASCIA EXCISION,468,"OTHER KIDNEY & URINARY TRACT DIAGNOSES, SIGNS & SYMPTOMS",11,DISEASES AND DISORDERS OF THE KIDNEY AND URINARY TRACT,4,Extreme,Major,Medical,Medicare,Blue Cross/Blue Shield,Self-Pay,,,Y,244965.73,72852.1
New York City,Kings,7001021,001306,New York - Presbyterian Brooklyn Methodist Hospital,70 or Older,112,F,Black/African American,Not Span/Hispanic,2,Emergency,Home or Self Care,2020,GEN006,OTHER SPECIFIED AND UNSPECIFIED DISEASES OF KIDNEY AND URETERS,,,468,"OTHER KIDNEY & URINARY TRACT DIAGNOSES, SIGNS & SYMPTOMS",11,DISEASES AND DISORDERS OF THE KIDNEY AND URINARY TRACT,3,Major,Moderate,Medical,Blue Cross/Blue Shield,Medicare,Self-Pay,,,N,19904.18,3553.31
New York City,Manhattan,7002054,001458,New York-Presbyterian Hospital - New York Weill Cornell Center,70 or Older,112,M,White,Spanish/Hispanic,1,Elective,Home or Self Care,2020,GEN007,OTHER SPECIFIED AND UNSPECIFIED DISEASES OF BLADDER AND URETHRA,GIS004,GI SYSTEM ENDOSCOPY WITHOUT BIOPSY (DIAGNOSTIC),468,"OTHER KIDNEY & URINARY TRACT DIAGNOSES, SIGNS & SYMPTOMS",11,DISEASES AND DISORDERS OF THE KIDNEY AND URINARY TRACT,1,Minor,Minor,Medical,Medicare,Medicare,Self-Pay,,,N,25824.72,7512.58
New York City,Kings,7001021,001306,New York - Presbyterian Brooklyn Methodist Hospital,30 to 49,,M,Black/African American,Not Span/Hispanic,2,Emergency,Left Against Medical Advice,2020,SYM011,GENITOURINARY SIGNS AND SYMPTOMS,,,468,"OTHER KIDNEY & URINARY TRACT DIAGNOSES, SIGNS & SYMPTOMS",11,DISEASES AND DISORDERS OF THE KIDNEY AND URINARY TRACT,1,Minor,Minor,Medical,Medicare,Medicaid,Self-Pay,,,Y,20646.95,4331.95
New York City,Kings,7001021,001306,New York - Presbyterian Brooklyn Methodist Hospital,70 or Older,112,M,Black/African American,Not Span/Hispanic,26,Emergency,Skilled Nursing Home,2020,GEN004,URINARY TRACT INFECTIONS,URN004,REMOVAL OF CALCULI AND OTHER MATTER FROM URINARY TRACT,468,"OTHER KIDNEY & URINARY TRACT DIAGNOSES, SIGNS & SYMPTOMS",11,DISEASES AND DISORDERS OF THE KIDNEY AND URINARY TRACT,2,Moderate,Moderate,Medical,Medicare,Medicaid,Self-Pay,,,Y,169303.34,52284.7
New York City,Manhattan,7002024,001456,Mount Sinai Hospital,30 to 49,104,F,Other Race,Not Span/Hispanic,1,Emergency,Home or Self Care,2020,END003,DIABETES MELLITUS WITH COMPLICATION,ESA001,HEMODIALYSIS,468,"OTHER KIDNEY & URINARY TRACT DIAGNOSES, SIGNS & SYMPTOMS",11,DISEASES AND DISORDERS OF THE KIDNEY AND URINARY TRACT,3,Major,Major,Medical,Medicaid,Medicaid,Self-Pay,,,Y,20157.1,4658.29
New York City,Bronx,7000006,001169,Montefiore Medical Center - Henry & Lucy Moses Div,50 to 69,104,F,Other Race,Spanish/Hispanic,4,Emergency,Home or Self Care,2020,GEN007,OTHER SPECIFIED AND UNSPECIFIED DISEASES OF BLADDER AND URETHRA,,,468,"OTHER KIDNEY & URINARY TRACT DIAGNOSES, SIGNS & SYMPTOMS",11,DISEASES AND DISORDERS OF THE KIDNEY AND URINARY TRACT,2,Moderate,Minor,Medical,Blue Cross/Blue Shield,,,,,Y,57123.09,9957.21
New York City,Bronx,7000006,001169,Montefiore Medical Center - Henry & Lucy Moses Div,50 to 69,108,F,Black/African American,Not Span/Hispanic,8,Emergency,Left Against Medical Advice,2020,END003,DIABETES MELLITUS WITH COMPLICATION,ADM021,"ADMINISTRATION OF THERAPEUTIC SUBSTANCES, NEC",468,"OTHER KIDNEY & URINARY TRACT DIAGNOSES, SIGNS & SYMPTOMS",11,DISEASES AND DISORDERS OF THE KIDNEY AND URINARY TRACT,3,Major,Major,Medical,Medicare,Medicaid,,,,N,112006.22,21689.37
Long Island,Nassau,2950002,000528,Nassau University Medical Center,18 to 29,117,M,White,Not Span/Hispanic,12,Emergency,Home w/ Home Health Services,2020,INJ010,"INTERNAL ORGAN INJURY, INITIAL ENCOUNTER",URN003,URETER AND OTHER URINARY TRACT DILATION,468,"OTHER KIDNEY & URINARY TRACT DIAGNOSES, SIGNS & SYMPTOMS",11,DISEASES AND DISORDERS OF THE KIDNEY AND URINARY TRACT,1,Minor,Minor,Medical,Blue Cross/Blue Shield,Self-Pay,,,,Y,122695.03,45905.32
New York City,Bronx,7000006,001169,Montefiore Medical Center - Henry & Lucy Moses Div,70 or Older,104,F,Black/African American,Not Span/Hispanic,3,Emergency,Home w/ Home Health Services,2020,END003,DIABETES MELLITUS WITH COMPLICATION,,,468,"OTHER KIDNEY & URINARY TRACT DIAGNOSES, SIGNS & SYMPTOMS",11,DISEASES AND DISORDERS OF THE KIDNEY AND URINARY TRACT,3,Major,Major,Medical,Medicare,,,,,Y,44535.8,7693.3
Western NY,Erie,1401005,000210,Erie County Medical Center,50 to 69,142,F,Black/African American,Not Span/Hispanic,2,Emergency,Home or Self Care,2020,MAL003,GENITOURINARY CONGENITAL ANOMALIES,,,468,"OTHER KIDNEY & URINARY TRACT DIAGNOSES, SIGNS & SYMPTOMS",11,DISEASES AND DISORDERS OF THE KIDNEY AND URINARY TRACT,2,Moderate,Moderate,Medical,Medicaid,Medicaid,,,,Y,12207.8,4939.85
Western NY,Erie,1401005,000210,Erie County Medical Center,50 to 69,142,M,Black/African American,Not Span/Hispanic,9,Emergency,Home or Self Care,2020,MUS033,GOUT,MST001,ARTHROCENTESIS,468,"OTHER KIDNEY & URINARY TRACT DIAGNOSES, SIGNS & SYMPTOMS",11,DISEASES AND DISORDERS OF THE KIDNEY AND URINARY TRACT,3,Major,Major,Medical,Blue Cross/Blue Shield,Medicare,,,,Y,24121.8,14886.52
Western NY,Erie,1401005,000210,Erie County Medical Center,50 to 69,142,M,Black/African American,Not Span/Hispanic,3,Emergency,Skilled Nursing Home,2020,GEN007,OTHER SPECIFIED AND UNSPECIFIED DISEASES OF BLADDER AND URETHRA,,,468,"OTHER KIDNEY & URINARY TRACT DIAGNOSES, SIGNS & SYMPTOMS",11,DISEASES AND DISORDERS OF THE KIDNEY AND URINARY TRACT,3,Major,Moderate,Medical,Medicaid,Medicaid,,,,Y,12561.89,6600.05
New York City,Manhattan,7002002,001439,Mount Sinai Beth Israel,70 or Older,103,M,Other Race,Not Span/Hispanic,3,Emergency,Home or Self Care,2020,GEN007,OTHER SPECIFIED AND UNSPECIFIED DISEASES OF BLADDER AND URETHRA,IMG007,COMPUTERIZED TOMOGRAPHY (CT) WITHOUT CONTRAST,468,"OTHER KIDNEY & URINARY TRACT DIAGNOSES, SIGNS & SYMPTOMS",11,DISEASES AND DISORDERS OF THE KIDNEY AND URINARY TRACT,1,Minor,Minor,Medical,Medicaid,Self-Pay,,,,N,37673.86,7234.37
New York City,Manhattan,7002032,001466,Mount Sinai West,50 to 69,100,M,Other Race,Not Span/Hispanic,3,Emergency,Home or Self Care,2020,GEN006,OTHER SPECIFIED AND UNSPECIFIED DISEASES OF KIDNEY AND URETERS,IMG008,ULTRASONOGRAPHY,468,"OTHER KIDNEY & URINARY TRACT DIAGNOSES, SIGNS & SYMPTOMS",11,DISEASES AND DISORDERS OF THE KIDNEY AND URINARY TRACT,2,Moderate,Moderate,Medical,Private Health Insurance,Self-Pay,,,,Y,43578.67,9077.99
New York City,Manhattan,7002032,001466,Mount Sinai West,70 or Older,100,M,White,Not Span/Hispanic,3,Emergency,Left Against Medical Advice,2020,GEN009,HEMATURIA,IMG007,COMPUTERIZED TOMOGRAPHY (CT) WITHOUT CONTRAST,468,"OTHER KIDNEY & URINARY TRACT DIAGNOSES, SIGNS & SYMPTOMS",11,DISEASES AND DISORDERS OF THE KIDNEY AND URINARY TRACT,1,Minor,Minor,Medical,Medicare,Medicare,Medicaid,,,Y,37414.83,8080.6
New York City,Manhattan,7002012,001447,Hospital for Special Surgery,70 or Older,100,M,White,Not Span/Hispanic,7,Urgent,Home w/ Home Health Services,2020,MUS033,GOUT,CAR024,VENOUS AND ARTERIAL CATHETER PLACEMENT,468,"OTHER KIDNEY & URINARY TRACT DIAGNOSES, SIGNS & SYMPTOMS",11,DISEASES AND DISORDERS OF THE KIDNEY AND URINARY TRACT,3,Major,Major,Medical,Private Health Insurance,Medicare,,,,N,67128,36199.36
New York City,Manhattan,7002024,001456,Mount Sinai Hospital,30 to 49,100,M,Other Race,Unknown,4,Emergency,Home or Self Care,2020,END003,DIABETES MELLITUS WITH COMPLICATION,URN002,KIDNEY AND OTHER URINARY TRACT BIOPSY (NON-ENDOSCOPIC),468,"OTHER KIDNEY & URINARY TRACT DIAGNOSES, SIGNS & SYMPTOMS",11,DISEASES AND DISORDERS OF THE KIDNEY AND URINARY TRACT,3,Major,Major,Medical,Medicaid,Medicaid,Self-Pay,,,Y,71292.19,20602.25
New York City,Manhattan,7002053,001463,NYU Langone Hospitals,50 to 69,117,M,White,Not Span/Hispanic,5,Emergency,Home w/ Home Health Services,2020,GEN007,OTHER SPECIFIED AND UNSPECIFIED DISEASES OF BLADDER AND URETHRA,ADM001,TRANSFUSION OF BLOOD AND BLOOD PRODUCTS,468,"OTHER KIDNEY & URINARY TRACT DIAGNOSES, SIGNS & SYMPTOMS",11,DISEASES AND DISORDERS OF THE KIDNEY AND URINARY TRACT,2,Moderate,Moderate,Medical,Blue Cross/Blue Shield,,,,,Y,59569.53,18233.8