Hospital Service Area,Hospital County,Operating Certificate Number,Permanent Facility Id,Facility Name,Age Group,Zip Code - 3 digits,Gender,Race,Ethnicity,Length of Stay,Type of Admission,Patient Disposition,Discharge Year,CCS Diagnosis Code,CCS Diagnosis Description,CCS Procedure Code,CCS Procedure Description,APR DRG Code,APR DRG Description,APR MDC Code,APR MDC Description,APR Severity of Illness Code,APR Severity of Illness Description,APR Risk of Mortality,APR Medical Surgical Description,Payment Typology 1,Payment Typology 2,Payment Typology 3,Birth Weight,Abortion Edit Indicator,Emergency Department Indicator,Total Charges,Total Costs
Long Island,Suffolk,5123000,000885,Brookhaven Memorial Hospital Medical Center Inc,50 to 69,117,M,Black/African American,Not Span/Hispanic,7,Emergency,Home w/ Home Health Services,2017,157,Acute and unspecified renal failure,000,NO PROC,469,Acute Kidney Injury,11,Diseases and Disorders of the Kidney and Urinary Tract,3,Major,Major,Medical,Private Health Insurance,Medicaid,,,N,Y,50621.33,9944.15
Long Island,Suffolk,5123000,000885,Brookhaven Memorial Hospital Medical Center Inc,18 to 29,117,M,White,Not Span/Hispanic,3,Emergency,Home or Self Care,2017,157,Acute and unspecified renal failure,000,NO PROC,469,Acute Kidney Injury,11,Diseases and Disorders of the Kidney and Urinary Tract,2,Moderate,Minor,Medical,Blue Cross/Blue Shield,,,,N,Y,34105.42,4822.47
Long Island,Suffolk,5123000,000885,Brookhaven Memorial Hospital Medical Center Inc,70 or Older,117,F,White,Not Span/Hispanic,4,Emergency,Home w/ Home Health Services,2017,157,Acute and unspecified renal failure,000,NO PROC,469,Acute Kidney Injury,11,Diseases and Disorders of the Kidney and Urinary Tract,3,Major,Major,Medical,Medicare,Medicare,Blue Cross/Blue Shield,,N,Y,50095.29,7625.59
Long Island,Suffolk,5123000,000885,Brookhaven Memorial Hospital Medical Center Inc,50 to 69,119,F,White,Not Span/Hispanic,3,Emergency,Skilled Nursing Home,2017,157,Acute and unspecified renal failure,000,NO PROC,469,Acute Kidney Injury,11,Diseases and Disorders of the Kidney and Urinary Tract,3,Major,Moderate,Medical,Medicare,Private Health Insurance,,,N,Y,31670.53,4587.39
Long Island,Suffolk,5123000,000885,Brookhaven Memorial Hospital Medical Center Inc,70 or Older,117,F,White,Not Span/Hispanic,1,Emergency,Short-term Hospital,2017,157,Acute and unspecified renal failure,000,NO PROC,469,Acute Kidney Injury,11,Diseases and Disorders of the Kidney and Urinary Tract,2,Moderate,Moderate,Medical,Medicare,Medicare,Private Health Insurance,,N,Y,12807.62,2024.27
Long Island,Suffolk,5123000,000885,Brookhaven Memorial Hospital Medical Center Inc,50 to 69,117,F,White,Not Span/Hispanic,8,Emergency,Skilled Nursing Home,2017,157,Acute and unspecified renal failure,000,NO PROC,469,Acute Kidney Injury,11,Diseases and Disorders of the Kidney and Urinary Tract,3,Major,Moderate,Medical,Medicare,Medicare,,,N,Y,49060.38,10502.50
Long Island,Suffolk,5123000,000885,Brookhaven Memorial Hospital Medical Center Inc,50 to 69,117,M,White,Not Span/Hispanic,8,Emergency,Home w/ Home Health Services,2017,157,Acute and unspecified renal failure,000,NO PROC,469,Acute Kidney Injury,11,Diseases and Disorders of the Kidney and Urinary Tract,2,Moderate,Moderate,Medical,Medicare,Medicaid,,,N,Y,45459.33,9756.89
Long Island,Suffolk,5123000,000885,Brookhaven Memorial Hospital Medical Center Inc,30 to 49,119,M,White,Not Span/Hispanic,3,Emergency,Home or Self Care,2017,157,Acute and unspecified renal failure,219,ALCO/DRUG REHAB/DETOX,469,Acute Kidney Injury,11,Diseases and Disorders of the Kidney and Urinary Tract,2,Moderate,Minor,Medical,Private Health Insurance,Medicaid,,,N,Y,22671.67,4288.90
Long Island,Suffolk,5123000,000885,Brookhaven Memorial Hospital Medical Center Inc,50 to 69,117,M,White,Not Span/Hispanic,1,Emergency,Home or Self Care,2017,157,Acute and unspecified renal failure,000,NO PROC,469,Acute Kidney Injury,11,Diseases and Disorders of the Kidney and Urinary Tract,2,Moderate,Moderate,Medical,Private Health Insurance,,,,N,Y,9925.71,1782.48
Long Island,Suffolk,5123000,000885,Brookhaven Memorial Hospital Medical Center Inc,50 to 69,117,M,White,Not Span/Hispanic,1,Emergency,Home w/ Home Health Services,2017,157,Acute and unspecified renal failure,000,NO PROC,469,Acute Kidney Injury,11,Diseases and Disorders of the Kidney and Urinary Tract,1,Minor,Minor,Medical,Private Health Insurance,Medicaid,,,N,Y,13341.41,2132.33
Long Island,Suffolk,5123000,000885,Brookhaven Memorial Hospital Medical Center Inc,50 to 69,117,M,White,Not Span/Hispanic,10,Emergency,Home or Self Care,2017,157,Acute and unspecified renal failure,108,INDWELLING CATHETER,469,Acute Kidney Injury,11,Diseases and Disorders of the Kidney and Urinary Tract,3,Major,Moderate,Medical,Self-Pay,,,,N,Y,91876.12,18464.43
Long Island,Suffolk,5123000,000885,Brookhaven Memorial Hospital Medical Center Inc,50 to 69,117,F,White,Not Span/Hispanic,6,Emergency,Home or Self Care,2017,157,Acute and unspecified renal failure,000,NO PROC,469,Acute Kidney Injury,11,Diseases and Disorders of the Kidney and Urinary Tract,2,Moderate,Moderate,Medical,Private Health Insurance,,,,N,Y,40398.38,8251.52
Long Island,Suffolk,5123000,000885,Brookhaven Memorial Hospital Medical Center Inc,30 to 49,117,F,White,Not Span/Hispanic,2,Emergency,Home w/ Home Health Services,2017,157,Acute and unspecified renal failure,000,NO PROC,469,Acute Kidney Injury,11,Diseases and Disorders of the Kidney and Urinary Tract,2,Moderate,Moderate,Medical,Medicare,Medicare,Medicaid,,N,Y,18670.66,3278.97
Long Island,Suffolk,5123000,000885,Brookhaven Memorial Hospital Medical Center Inc,70 or Older,117,M,White,Not Span/Hispanic,5,Emergency,Home w/ Home Health Services,2017,157,Acute and unspecified renal failure,000,NO PROC,469,Acute Kidney Injury,11,Diseases and Disorders of the Kidney and Urinary Tract,2,Moderate,Moderate,Medical,Medicare,Medicare,Private Health Insurance,,N,Y,39181.60,6656.10
Long Island,Suffolk,5123000,000885,Brookhaven Memorial Hospital Medical Center Inc,70 or Older,117,F,White,Not Span/Hispanic,10,Emergency,Skilled Nursing Home,2017,157,Acute and unspecified renal failure,000,NO PROC,469,Acute Kidney Injury,11,Diseases and Disorders of the Kidney and Urinary Tract,3,Major,Major,Medical,Medicare,Medicare,,,N,Y,62963.18,12781.45
Long Island,Suffolk,5123000,000885,Brookhaven Memorial Hospital Medical Center Inc,70 or Older,117,F,White,Not Span/Hispanic,2,Emergency,Home or Self Care,2017,157,Acute and unspecified renal failure,000,NO PROC,469,Acute Kidney Injury,11,Diseases and Disorders of the Kidney and Urinary Tract,2,Moderate,Moderate,Medical,Medicare,Medicare,Private Health Insurance,,N,Y,21507.80,4303.77
Long Island,Suffolk,5123000,000885,Brookhaven Memorial Hospital Medical Center Inc,70 or Older,117,M,White,Not Span/Hispanic,5,Emergency,Skilled Nursing Home,2017,157,Acute and unspecified renal failure,000,NO PROC,469,Acute Kidney Injury,11,Diseases and Disorders of the Kidney and Urinary Tract,3,Major,Major,Medical,Medicare,Medicare,Blue Cross/Blue Shield,,N,Y,34875.64,6910.79
Long Island,Suffolk,5123000,000885,Brookhaven Memorial Hospital Medical Center Inc,70 or Older,117,F,White,Not Span/Hispanic,3,Emergency,Home or Self Care,2017,157,Acute and unspecified renal failure,000,NO PROC,469,Acute Kidney Injury,11,Diseases and Disorders of the Kidney and Urinary Tract,2,Moderate,Moderate,Medical,Medicare,Medicare,,,N,Y,33737.21,5457.14
Long Island,Suffolk,5123000,000885,Brookhaven Memorial Hospital Medical Center Inc,70 or Older,119,F,White,Not Span/Hispanic,4,Emergency,Home or Self Care,2017,157,Acute and unspecified renal failure,000,NO PROC,469,Acute Kidney Injury,11,Diseases and Disorders of the Kidney and Urinary Tract,2,Moderate,Moderate,Medical,Medicare,,,,N,Y,38187.66,5725.52
Long Island,Suffolk,5123000,000885,Brookhaven Memorial Hospital Medical Center Inc,30 to 49,117,M,White,Not Span/Hispanic,9,Emergency,Home w/ Home Health Services,2017,157,Acute and unspecified renal failure,000,NO PROC,469,Acute Kidney Injury,11,Diseases and Disorders of the Kidney and Urinary Tract,3,Major,Minor,Medical,Medicare,Medicare,,,N,Y,98121.96,15200.78
Long Island,Suffolk,5123000,000885,Brookhaven Memorial Hospital Medical Center Inc,70 or Older,119,M,White,Not Span/Hispanic,6,Emergency,Home w/ Home Health Services,2017,157,Acute and unspecified renal failure,222,BLOOD TRANSFUSION,469,Acute Kidney Injury,11,Diseases and Disorders of the Kidney and Urinary Tract,3,Major,Major,Medical,Medicare,Medicare,Blue Cross/Blue Shield,,N,Y,51814.89,9033.78
Long Island,Suffolk,5123000,000885,Brookhaven Memorial Hospital Medical Center Inc,50 to 69,117,M,White,Not Span/Hispanic,1,Emergency,Home w/ Home Health Services,2017,157,Acute and unspecified renal failure,000,NO PROC,469,Acute Kidney Injury,11,Diseases and Disorders of the Kidney and Urinary Tract,2,Moderate,Moderate,Medical,Self-Pay,,,,N,Y,14831.96,2253.61
Long Island,Suffolk,5123000,000885,Brookhaven Memorial Hospital Medical Center Inc,70 or Older,119,F,White,Not Span/Hispanic,3,Emergency,Skilled Nursing Home,2017,157,Acute and unspecified renal failure,000,NO PROC,469,Acute Kidney Injury,11,Diseases and Disorders of the Kidney and Urinary Tract,2,Moderate,Moderate,Medical,Medicare,Medicare,Private Health Insurance,,N,Y,38102.71,5894.05
Long Island,Suffolk,5123000,000885,Brookhaven Memorial Hospital Medical Center Inc,50 to 69,119,M,White,Not Span/Hispanic,5,Emergency,Skilled Nursing Home,2017,157,Acute and unspecified renal failure,000,NO PROC,469,Acute Kidney Injury,11,Diseases and Disorders of the Kidney and Urinary Tract,2,Moderate,Moderate,Medical,Medicare,Blue Cross/Blue Shield,Medicare,,N,Y,45448.95,7120.38
Long Island,Suffolk,5123000,000885,Brookhaven Memorial Hospital Medical Center Inc,70 or Older,117,F,White,Not Span/Hispanic,5,Emergency,Skilled Nursing Home,2017,157,Acute and unspecified renal failure,000,NO PROC,469,Acute Kidney Injury,11,Diseases and Disorders of the Kidney and Urinary Tract,2,Moderate,Moderate,Medical,Medicare,Medicare,Medicaid,,N,Y,55435.21,8318.37
Long Island,Suffolk,5123000,000885,Brookhaven Memorial Hospital Medical Center Inc,70 or Older,117,F,White,Not Span/Hispanic,6,Emergency,Skilled Nursing Home,2017,157,Acute and unspecified renal failure,231,OTHER THERAPEUTIC PRCS,469,Acute Kidney Injury,11,Diseases and Disorders of the Kidney and Urinary Tract,3,Major,Major,Medical,Medicare,Medicare,Medicaid,,N,Y,79178.87,12092.46
Long Island,Suffolk,5123000,000885,Brookhaven Memorial Hospital Medical Center Inc,70 or Older,119,F,Black/African American,Not Span/Hispanic,8,Emergency,Home w/ Home Health Services,2017,157,Acute and unspecified renal failure,222,BLOOD TRANSFUSION,469,Acute Kidney Injury,11,Diseases and Disorders of the Kidney and Urinary Tract,3,Major,Extreme,Medical,Medicare,Medicare,Medicaid,,N,Y,84904.98,14587.08
Long Island,Suffolk,5123000,000885,Brookhaven Memorial Hospital Medical Center Inc,70 or Older,117,F,White,Not Span/Hispanic,8,Emergency,Expired,2017,157,Acute and unspecified renal failure,000,NO PROC,469,Acute Kidney Injury,11,Diseases and Disorders of the Kidney and Urinary Tract,4,Extreme,Major,Medical,Medicare,,,,N,Y,55054.10,10155.31
Long Island,Suffolk,5123000,000885,Brookhaven Memorial Hospital Medical Center Inc,70 or Older,117,F,White,Not Span/Hispanic,2,Emergency,Home or Self Care,2017,157,Acute and unspecified renal failure,000,NO PROC,469,Acute Kidney Injury,11,Diseases and Disorders of the Kidney and Urinary Tract,2,Moderate,Moderate,Medical,Medicare,Medicare,Private Health Insurance,,N,Y,22312.03,3926.22
Long Island,Suffolk,5123000,000885,Brookhaven Memorial Hospital Medical Center Inc,30 to 49,117,M,White,Not Span/Hispanic,2,Emergency,Home or Self Care,2017,157,Acute and unspecified renal failure,000,NO PROC,469,Acute Kidney Injury,11,Diseases and Disorders of the Kidney and Urinary Tract,2,Moderate,Minor,Medical,Medicare,Medicare,Medicaid,,N,Y,14520.92,2945.28
Long Island,Suffolk,5123000,000885,Brookhaven Memorial Hospital Medical Center Inc,50 to 69,119,F,White,Not Span/Hispanic,5,Emergency,Skilled Nursing Home,2017,157,Acute and unspecified renal failure,108,INDWELLING CATHETER,469,Acute Kidney Injury,11,Diseases and Disorders of the Kidney and Urinary Tract,2,Moderate,Moderate,Medical,Medicare,Medicare,Medicaid,,N,Y,38430.20,7214.65
Long Island,Suffolk,5123000,000885,Brookhaven Memorial Hospital Medical Center Inc,70 or Older,117,M,White,Not Span/Hispanic,5,Emergency,Skilled Nursing Home,2017,157,Acute and unspecified renal failure,000,NO PROC,469,Acute Kidney Injury,11,Diseases and Disorders of the Kidney and Urinary Tract,3,Major,Moderate,Medical,Medicare,Medicare,Private Health Insurance,,N,Y,47582.41,7446.63
Long Island,Suffolk,5123000,000885,Brookhaven Memorial Hospital Medical Center Inc,70 or Older,117,F,Black/African American,Not Span/Hispanic,5,Emergency,Skilled Nursing Home,2017,157,Acute and unspecified renal failure,000,NO PROC,469,Acute Kidney Injury,11,Diseases and Disorders of the Kidney and Urinary Tract,3,Major,Major,Medical,Medicare,Medicare,Medicaid,,N,Y,36787.83,7232.01
Long Island,Suffolk,5123000,000885,Brookhaven Memorial Hospital Medical Center Inc,50 to 69,119,M,White,Not Span/Hispanic,9,Emergency,Skilled Nursing Home,2017,157,Acute and unspecified renal failure,174,OT NON-OR THER PRC SKIN,469,Acute Kidney Injury,11,Diseases and Disorders of the Kidney and Urinary Tract,2,Moderate,Moderate,Medical,Medicare,Medicare,Blue Cross/Blue Shield,,N,Y,59829.23,11702.03
Long Island,Suffolk,5123000,000885,Brookhaven Memorial Hospital Medical Center Inc,70 or Older,117,M,White,Not Span/Hispanic,7,Emergency,Skilled Nursing Home,2017,157,Acute and unspecified renal failure,000,NO PROC,469,Acute Kidney Injury,11,Diseases and Disorders of the Kidney and Urinary Tract,3,Major,Major,Medical,Medicare,Medicare,Private Health Insurance,,N,Y,39152.81,8497.10
Long Island,Suffolk,5123000,000885,Brookhaven Memorial Hospital Medical Center Inc,30 to 49,117,F,White,Not Span/Hispanic,4,Emergency,Home or Self Care,2017,157,Acute and unspecified renal failure,216,RESP INTUB/MECH VENTIL,469,Acute Kidney Injury,11,Diseases and Disorders of the Kidney and Urinary Tract,2,Moderate,Moderate,Medical,Medicare,Medicare,Medicaid,,N,Y,44803.33,7074.17
Long Island,Suffolk,5123000,000885,Brookhaven Memorial Hospital Medical Center Inc,70 or Older,117,F,White,Not Span/Hispanic,8,Emergency,Skilled Nursing Home,2017,157,Acute and unspecified renal failure,000,NO PROC,469,Acute Kidney Injury,11,Diseases and Disorders of the Kidney and Urinary Tract,3,Major,Moderate,Medical,Medicare,Medicare,Medicaid,,N,Y,56903.35,10432.69
Long Island,Suffolk,5123000,000885,Brookhaven Memorial Hospital Medical Center Inc,70 or Older,117,F,White,Not Span/Hispanic,5,Emergency,Skilled Nursing Home,2017,157,Acute and unspecified renal failure,000,NO PROC,469,Acute Kidney Injury,11,Diseases and Disorders of the Kidney and Urinary Tract,3,Major,Major,Medical,Medicare,Medicare,Private Health Insurance,,N,Y,43688.17,7079.23
Long Island,Suffolk,5123000,000885,Brookhaven Memorial Hospital Medical Center Inc,50 to 69,117,M,White,Not Span/Hispanic,4,Emergency,Home or Self Care,2017,157,Acute and unspecified renal failure,054,OT VASC CATH; NOT HEART,469,Acute Kidney Injury,11,Diseases and Disorders of the Kidney and Urinary Tract,2,Moderate,Minor,Medical,Blue Cross/Blue Shield,,,,N,Y,45824.18,9589.73
Long Island,Suffolk,5123000,000885,Brookhaven Memorial Hospital Medical Center Inc,70 or Older,117,F,White,Not Span/Hispanic,11,Emergency,Skilled Nursing Home,2017,157,Acute and unspecified renal failure,000,NO PROC,469,Acute Kidney Injury,11,Diseases and Disorders of the Kidney and Urinary Tract,3,Major,Major,Medical,Medicare,,,,N,Y,92981.27,15875.70
Long Island,Suffolk,5123000,000885,Brookhaven Memorial Hospital Medical Center Inc,70 or Older,119,M,Other Race,Not Span/Hispanic,4,Emergency,Home or Self Care,2017,157,Acute and unspecified renal failure,000,NO PROC,469,Acute Kidney Injury,11,Diseases and Disorders of the Kidney and Urinary Tract,3,Major,Moderate,Medical,Medicare,Medicare,Private Health Insurance,,N,Y,36156.12,5760.55
Long Island,Suffolk,5123000,000885,Brookhaven Memorial Hospital Medical Center Inc,70 or Older,117,F,White,Not Span/Hispanic,8,Emergency,Expired,2017,157,Acute and unspecified renal failure,000,NO PROC,469,Acute Kidney Injury,11,Diseases and Disorders of the Kidney and Urinary Tract,3,Major,Major,Medical,Medicare,Private Health Insurance,,,N,Y,68162.89,11460.64
Long Island,Suffolk,5123000,000885,Brookhaven Memorial Hospital Medical Center Inc,70 or Older,117,F,White,Not Span/Hispanic,4,Emergency,Skilled Nursing Home,2017,157,Acute and unspecified renal failure,000,NO PROC,469,Acute Kidney Injury,11,Diseases and Disorders of the Kidney and Urinary Tract,3,Major,Major,Medical,Medicare,Medicare,Private Health Insurance,,N,Y,25351.39,5258.80
Long Island,Suffolk,5123000,000885,Brookhaven Memorial Hospital Medical Center Inc,70 or Older,117,F,Other Race,Not Span/Hispanic,5,Emergency,Skilled Nursing Home,2017,157,Acute and unspecified renal failure,000,NO PROC,469,Acute Kidney Injury,11,Diseases and Disorders of the Kidney and Urinary Tract,4,Extreme,Major,Medical,Medicare,Medicaid,,,N,Y,48626.30,7620.38
Long Island,Suffolk,5123000,000885,Brookhaven Memorial Hospital Medical Center Inc,70 or Older,119,F,White,Not Span/Hispanic,2,Emergency,Home w/ Home Health Services,2017,157,Acute and unspecified renal failure,000,NO PROC,469,Acute Kidney Injury,11,Diseases and Disorders of the Kidney and Urinary Tract,2,Moderate,Moderate,Medical,Medicare,Medicare,Medicaid,,N,Y,19051.36,3330.13
Long Island,Suffolk,5123000,000885,Brookhaven Memorial Hospital Medical Center Inc,30 to 49,119,M,Other Race,Not Span/Hispanic,1,Emergency,Left Against Medical Advice,2017,157,Acute and unspecified renal failure,222,BLOOD TRANSFUSION,469,Acute Kidney Injury,11,Diseases and Disorders of the Kidney and Urinary Tract,2,Moderate,Moderate,Medical,Private Health Insurance,,,,N,Y,13749.19,2531.04
Long Island,Suffolk,5123000,000885,Brookhaven Memorial Hospital Medical Center Inc,50 to 69,117,M,Black/African American,Not Span/Hispanic,11,Emergency,Skilled Nursing Home,2017,157,Acute and unspecified renal failure,222,BLOOD TRANSFUSION,469,Acute Kidney Injury,11,Diseases and Disorders of the Kidney and Urinary Tract,4,Extreme,Extreme,Medical,Private Health Insurance,,,,N,Y,95955.06,18674.78
Long Island,Suffolk,5123000,000885,Brookhaven Memorial Hospital Medical Center Inc,70 or Older,113,M,White,Not Span/Hispanic,8,Emergency,Skilled Nursing Home,2017,157,Acute and unspecified renal failure,000,NO PROC,469,Acute Kidney Injury,11,Diseases and Disorders of the Kidney and Urinary Tract,3,Major,Major,Medical,Medicare,Medicare,,,N,Y,58397.32,10979.00
Long Island,Suffolk,5123000,000885,Brookhaven Memorial Hospital Medical Center Inc,50 to 69,119,M,White,Not Span/Hispanic,3,Emergency,Home or Self Care,2017,157,Acute and unspecified renal failure,000,NO PROC,469,Acute Kidney Injury,11,Diseases and Disorders of the Kidney and Urinary Tract,3,Major,Major,Medical,Medicare,,,,N,Y,31524.90,4727.69
Long Island,Suffolk,5123000,000885,Brookhaven Memorial Hospital Medical Center Inc,70 or Older,117,F,White,Not Span/Hispanic,6,Emergency,Expired,2017,157,Acute and unspecified renal failure,061,OT OR PRCS VES NOT HEAD,469,Acute Kidney Injury,11,Diseases and Disorders of the Kidney and Urinary Tract,2,Moderate,Major,Medical,Medicare,Medicare,Private Health Insurance,,N,Y,82216.17,13365.12
Long Island,Suffolk,5123000,000885,Brookhaven Memorial Hospital Medical Center Inc,70 or Older,117,F,White,Not Span/Hispanic,4,Emergency,Home or Self Care,2017,157,Acute and unspecified renal failure,054,OT VASC CATH; NOT HEART,469,Acute Kidney Injury,11,Diseases and Disorders of the Kidney and Urinary Tract,3,Major,Major,Medical,Medicare,,,,N,Y,36978.74,6815.70
Long Island,Suffolk,5123000,000885,Brookhaven Memorial Hospital Medical Center Inc,70 or Older,117,M,White,Not Span/Hispanic,8,Emergency,Skilled Nursing Home,2017,157,Acute and unspecified renal failure,000,NO PROC,469,Acute Kidney Injury,11,Diseases and Disorders of the Kidney and Urinary Tract,2,Moderate,Major,Medical,Medicare,,,,N,Y,73649.72,11384.83
Long Island,Suffolk,5123000,000885,Brookhaven Memorial Hospital Medical Center Inc,70 or Older,117,F,White,Not Span/Hispanic,4,Emergency,Home or Self Care,2017,157,Acute and unspecified renal failure,199,ELECTROENCEPHALOGRAM,469,Acute Kidney Injury,11,Diseases and Disorders of the Kidney and Urinary Tract,3,Major,Major,Medical,Medicare,,,,N,Y,56621.82,7421.06
Long Island,Suffolk,5123000,000885,Brookhaven Memorial Hospital Medical Center Inc,70 or Older,117,F,White,Not Span/Hispanic,16,Emergency,Skilled Nursing Home,2017,157,Acute and unspecified renal failure,000,NO PROC,469,Acute Kidney Injury,11,Diseases and Disorders of the Kidney and Urinary Tract,3,Major,Major,Medical,Medicare,Medicare,Blue Cross/Blue Shield,,N,Y,89097.42,19046.45
Long Island,Suffolk,5123000,000885,Brookhaven Memorial Hospital Medical Center Inc,50 to 69,117,M,Other Race,Not Span/Hispanic,1,Emergency,Home or Self Care,2017,157,Acute and unspecified renal failure,000,NO PROC,469,Acute Kidney Injury,11,Diseases and Disorders of the Kidney and Urinary Tract,1,Minor,Minor,Medical,Medicare,Medicare,Medicaid,,N,Y,11280.20,1895.54
Long Island,Suffolk,5123000,000885,Brookhaven Memorial Hospital Medical Center Inc,50 to 69,119,M,White,Not Span/Hispanic,2,Urgent,Home or Self Care,2017,157,Acute and unspecified renal failure,100,ENDOSCOPY URINARY TRACT,469,Acute Kidney Injury,11,Diseases and Disorders of the Kidney and Urinary Tract,2,Moderate,Minor,Medical,Medicare,Medicare,Blue Cross/Blue Shield,,N,N,33677.55,5963.17
Long Island,Suffolk,5123000,000885,Brookhaven Memorial Hospital Medical Center Inc,70 or Older,117,M,White,Not Span/Hispanic,10,Emergency,Skilled Nursing Home,2017,157,Acute and unspecified renal failure,108,INDWELLING CATHETER,469,Acute Kidney Injury,11,Diseases and Disorders of the Kidney and Urinary Tract,3,Major,Major,Medical,Medicare,Medicare,Private Health Insurance,,N,Y,75404.50,14077.34
Long Island,Suffolk,5123000,000885,Brookhaven Memorial Hospital Medical Center Inc,70 or Older,119,F,White,Not Span/Hispanic,6,Emergency,Skilled Nursing Home,2017,157,Acute and unspecified renal failure,000,NO PROC,469,Acute Kidney Injury,11,Diseases and Disorders of the Kidney and Urinary Tract,2,Moderate,Moderate,Medical,Medicare,Medicare,Medicaid,,N,Y,43546.12,8956.43
Long Island,Suffolk,5123000,000885,Brookhaven Memorial Hospital Medical Center Inc,50 to 69,119,F,Other Race,Not Span/Hispanic,8,Emergency,Home or Self Care,2017,157,Acute and unspecified renal failure,000,NO PROC,469,Acute Kidney Injury,11,Diseases and Disorders of the Kidney and Urinary Tract,3,Major,Moderate,Medical,Private Health Insurance,,,,N,Y,56417.73,10342.38
Long Island,Suffolk,5123000,000885,Brookhaven Memorial Hospital Medical Center Inc,70 or Older,117,F,Other Race,Not Span/Hispanic,6,Emergency,Home w/ Home Health Services,2017,157,Acute and unspecified renal failure,000,NO PROC,469,Acute Kidney Injury,11,Diseases and Disorders of the Kidney and Urinary Tract,2,Moderate,Moderate,Medical,Medicare,Medicare,Medicaid,,N,Y,48059.04,8282.71
Long Island,Suffolk,5123000,000885,Brookhaven Memorial Hospital Medical Center Inc,70 or Older,117,M,White,Not Span/Hispanic,4,Emergency,Skilled Nursing Home,2017,157,Acute and unspecified renal failure,216,RESP INTUB/MECH VENTIL,469,Acute Kidney Injury,11,Diseases and Disorders of the Kidney and Urinary Tract,3,Major,Major,Medical,Medicare,Medicare,Medicaid,,N,Y,40345.48,7079.84