Hospital Service Area,Hospital County,Operating Certificate Number,Permanent Facility Id,Facility Name,Age Group,Zip Code - 3 digits,Gender,Race,Ethnicity,Length of Stay,Type of Admission,Patient Disposition,Discharge Year,CCS Diagnosis Code,CCS Diagnosis Description,CCS Procedure Code,CCS Procedure Description,APR DRG Code,APR DRG Description,APR MDC Code,APR MDC Description,APR Severity of Illness Code,APR Severity of Illness Description,APR Risk of Mortality,APR Medical Surgical Description,Payment Typology 1,Payment Typology 2,Payment Typology 3,Birth Weight,Abortion Edit Indicator,Emergency Department Indicator,Total Charges,Total Costs
Long Island,Suffolk,5123000,000885,Long Island Community Hospital,70 or Older,117,M,White,Not Span/Hispanic,3,Emergency,Skilled Nursing Home,2020,NVS012,TRANSIENT CEREBRAL ISCHEMIA,,,047,TRANSIENT ISCHEMIA,01,DISEASES AND DISORDERS OF THE NERVOUS SYSTEM,2,Moderate,Moderate,Medical,Medicare,Medicare,Private Health Insurance,,,Y,54467.7,6062.04
Long Island,Suffolk,5123000,000885,Long Island Community Hospital,30 to 49,119,F,White,Not Span/Hispanic,1,Emergency,Home or Self Care,2020,NVS012,TRANSIENT CEREBRAL ISCHEMIA,,,047,TRANSIENT ISCHEMIA,01,DISEASES AND DISORDERS OF THE NERVOUS SYSTEM,1,Minor,Minor,Medical,Medicare,Medicaid,,,,Y,44188.27,5115.21
Long Island,Suffolk,5123000,000885,Long Island Community Hospital,50 to 69,117,M,White,Not Span/Hispanic,2,Emergency,Home or Self Care,2020,NVS012,TRANSIENT CEREBRAL ISCHEMIA,,,047,TRANSIENT ISCHEMIA,01,DISEASES AND DISORDERS OF THE NERVOUS SYSTEM,1,Minor,Minor,Medical,Private Health Insurance,Blue Cross/Blue Shield,,,,Y,40602.99,5024.17
Long Island,Suffolk,5123000,000885,Long Island Community Hospital,70 or Older,117,F,Black/African American,Not Span/Hispanic,3,Emergency,Skilled Nursing Home,2020,NVS012,TRANSIENT CEREBRAL ISCHEMIA,,,047,TRANSIENT ISCHEMIA,01,DISEASES AND DISORDERS OF THE NERVOUS SYSTEM,1,Minor,Minor,Medical,Medicare,Medicare,Medicaid,,,Y,60915.53,7813.5
Long Island,Suffolk,5123000,000885,Long Island Community Hospital,50 to 69,117,F,White,Not Span/Hispanic,4,Emergency,Home w/ Home Health Services,2020,NVS012,TRANSIENT CEREBRAL ISCHEMIA,ESA001,HEMODIALYSIS,047,TRANSIENT ISCHEMIA,01,DISEASES AND DISORDERS OF THE NERVOUS SYSTEM,4,Extreme,Extreme,Medical,Medicare,Medicare,Private Health Insurance,,,Y,48660.04,8162.34
Long Island,Suffolk,5123000,000885,Long Island Community Hospital,50 to 69,119,F,White,Not Span/Hispanic,1,Emergency,Short-term Hospital,2020,NVS012,TRANSIENT CEREBRAL ISCHEMIA,,,047,TRANSIENT ISCHEMIA,01,DISEASES AND DISORDERS OF THE NERVOUS SYSTEM,2,Moderate,Moderate,Medical,Medicare,Medicare,Private Health Insurance,,,Y,53994.82,4797.43
Long Island,Suffolk,5123000,000885,Long Island Community Hospital,70 or Older,117,F,Other Race,Not Span/Hispanic,3,Emergency,Home w/ Home Health Services,2020,NVS012,TRANSIENT CEREBRAL ISCHEMIA,,,047,TRANSIENT ISCHEMIA,01,DISEASES AND DISORDERS OF THE NERVOUS SYSTEM,1,Minor,Minor,Medical,Medicare,Medicare,Medicaid,,,Y,51980.43,6715.64
Long Island,Suffolk,5123000,000885,Long Island Community Hospital,50 to 69,117,F,Black/African American,Not Span/Hispanic,2,Emergency,Home w/ Home Health Services,2020,NVS012,TRANSIENT CEREBRAL ISCHEMIA,,,047,TRANSIENT ISCHEMIA,01,DISEASES AND DISORDERS OF THE NERVOUS SYSTEM,2,Moderate,Minor,Medical,Medicaid,,,,,Y,68802.37,5624.6
Long Island,Suffolk,5123000,000885,Long Island Community Hospital,30 to 49,117,M,White,Not Span/Hispanic,1,Emergency,Home or Self Care,2020,NVS012,TRANSIENT CEREBRAL ISCHEMIA,,,047,TRANSIENT ISCHEMIA,01,DISEASES AND DISORDERS OF THE NERVOUS SYSTEM,1,Minor,Moderate,Medical,Medicare,Medicare,Medicaid,,,Y,23268.85,3871.59
Long Island,Suffolk,5123000,000885,Long Island Community Hospital,70 or Older,117,F,White,Not Span/Hispanic,3,Emergency,Home or Self Care,2020,NVS012,TRANSIENT CEREBRAL ISCHEMIA,,,047,TRANSIENT ISCHEMIA,01,DISEASES AND DISORDERS OF THE NERVOUS SYSTEM,2,Moderate,Moderate,Medical,Medicare,,,,,Y,53318.5,6706.62
Long Island,Suffolk,5123000,000885,Long Island Community Hospital,50 to 69,117,F,White,Not Span/Hispanic,2,Emergency,Home or Self Care,2020,NVS012,TRANSIENT CEREBRAL ISCHEMIA,ADM005,ADMINISTRATION OF THROMBOLYTICS AND PLATELET INHIBITORS,047,TRANSIENT ISCHEMIA,01,DISEASES AND DISORDERS OF THE NERVOUS SYSTEM,1,Minor,Minor,Medical,Blue Cross/Blue Shield,,,,,Y,102963.86,17967.71
Long Island,Suffolk,5123000,000885,Long Island Community Hospital,70 or Older,117,M,White,Not Span/Hispanic,1,Emergency,Home or Self Care,2020,NVS012,TRANSIENT CEREBRAL ISCHEMIA,,,047,TRANSIENT ISCHEMIA,01,DISEASES AND DISORDERS OF THE NERVOUS SYSTEM,2,Moderate,Minor,Medical,Medicare,,,,,Y,44403.3,4194.41
Long Island,Suffolk,5123000,000885,Long Island Community Hospital,30 to 49,117,F,Black/African American,Not Span/Hispanic,4,Emergency,Home w/ Home Health Services,2020,NVS012,TRANSIENT CEREBRAL ISCHEMIA,MST028,"SUBCUTANEOUS TISSUE AND FASCIA PROCEDURES, NEC",047,TRANSIENT ISCHEMIA,01,DISEASES AND DISORDERS OF THE NERVOUS SYSTEM,2,Moderate,Moderate,Medical,Private Health Insurance,Medicaid,,,,Y,226529.39,35275.24
Long Island,Suffolk,5123000,000885,Long Island Community Hospital,50 to 69,119,M,Other Race,Not Span/Hispanic,3,Emergency,Home or Self Care,2020,NVS012,TRANSIENT CEREBRAL ISCHEMIA,IMG008,ULTRASONOGRAPHY,047,TRANSIENT ISCHEMIA,01,DISEASES AND DISORDERS OF THE NERVOUS SYSTEM,3,Major,Major,Medical,Medicaid,,,,,Y,55327.99,7324.83
Long Island,Suffolk,5123000,000885,Long Island Community Hospital,70 or Older,117,M,White,Not Span/Hispanic,3,Emergency,Skilled Nursing Home,2020,NVS012,TRANSIENT CEREBRAL ISCHEMIA,,,047,TRANSIENT ISCHEMIA,01,DISEASES AND DISORDERS OF THE NERVOUS SYSTEM,2,Moderate,Moderate,Medical,Medicare,Medicaid,,,,Y,50441.34,6639.65
Long Island,Suffolk,5123000,000885,Long Island Community Hospital,70 or Older,117,M,White,Not Span/Hispanic,1,Emergency,Home or Self Care,2020,NVS012,TRANSIENT CEREBRAL ISCHEMIA,,,047,TRANSIENT ISCHEMIA,01,DISEASES AND DISORDERS OF THE NERVOUS SYSTEM,2,Moderate,Moderate,Medical,Blue Cross/Blue Shield,Medicare,,,,Y,40484.61,4219.31
Long Island,Suffolk,5123000,000885,Long Island Community Hospital,50 to 69,117,M,Other Race,Not Span/Hispanic,3,Emergency,Home or Self Care,2020,NVS012,TRANSIENT CEREBRAL ISCHEMIA,IMG008,ULTRASONOGRAPHY,047,TRANSIENT ISCHEMIA,01,DISEASES AND DISORDERS OF THE NERVOUS SYSTEM,1,Minor,Minor,Medical,Private Health Insurance,,,,,Y,116105.08,18181.78
Long Island,Suffolk,5123000,000885,Long Island Community Hospital,30 to 49,117,M,Other Race,Not Span/Hispanic,2,Emergency,Home or Self Care,2020,NVS012,TRANSIENT CEREBRAL ISCHEMIA,,,047,TRANSIENT ISCHEMIA,01,DISEASES AND DISORDERS OF THE NERVOUS SYSTEM,2,Moderate,Minor,Medical,Self-Pay,,,,,Y,75932.84,8569.29
Long Island,Suffolk,5123000,000885,Long Island Community Hospital,50 to 69,119,M,White,Not Span/Hispanic,2,Emergency,Home or Self Care,2020,NVS012,TRANSIENT CEREBRAL ISCHEMIA,,,047,TRANSIENT ISCHEMIA,01,DISEASES AND DISORDERS OF THE NERVOUS SYSTEM,2,Moderate,Moderate,Medical,Medicare,Private Health Insurance,,,,Y,43029.09,5297.51
Long Island,Suffolk,5123000,000885,Long Island Community Hospital,50 to 69,117,F,Black/African American,Not Span/Hispanic,2,Emergency,Skilled Nursing Home,2020,NVS012,TRANSIENT CEREBRAL ISCHEMIA,CNS002,LUMBAR PUNCTURE,047,TRANSIENT ISCHEMIA,01,DISEASES AND DISORDERS OF THE NERVOUS SYSTEM,2,Moderate,Minor,Medical,Medicare,Medicare,Medicaid,,,Y,57435.01,7448.92
Long Island,Suffolk,5123000,000885,Long Island Community Hospital,50 to 69,117,F,White,Not Span/Hispanic,3,Emergency,Home w/ Home Health Services,2020,NVS012,TRANSIENT CEREBRAL ISCHEMIA,,,047,TRANSIENT ISCHEMIA,01,DISEASES AND DISORDERS OF THE NERVOUS SYSTEM,2,Moderate,Moderate,Medical,Medicare,Medicare,Private Health Insurance,,,Y,51777.47,7396.04
Long Island,Suffolk,5123000,000885,Long Island Community Hospital,70 or Older,117,F,White,Not Span/Hispanic,1,Emergency,Skilled Nursing Home,2020,NVS012,TRANSIENT CEREBRAL ISCHEMIA,,,047,TRANSIENT ISCHEMIA,01,DISEASES AND DISORDERS OF THE NERVOUS SYSTEM,2,Moderate,Minor,Medical,Medicare,Medicare,Medicaid,,,Y,31987.29,2312.98
Long Island,Suffolk,5123000,000885,Long Island Community Hospital,70 or Older,117,M,White,Not Span/Hispanic,3,Emergency,Home or Self Care,2020,NVS012,TRANSIENT CEREBRAL ISCHEMIA,MAM006,PACEMAKER AND DEFIBRILLATOR INTERROGATION,047,TRANSIENT ISCHEMIA,01,DISEASES AND DISORDERS OF THE NERVOUS SYSTEM,2,Moderate,Moderate,Medical,Medicare,Medicare,Private Health Insurance,,,Y,55726.68,6032.66
Long Island,Suffolk,5123000,000885,Long Island Community Hospital,70 or Older,117,M,White,Not Span/Hispanic,2,Emergency,Home or Self Care,2020,NVS012,TRANSIENT CEREBRAL ISCHEMIA,,,047,TRANSIENT ISCHEMIA,01,DISEASES AND DISORDERS OF THE NERVOUS SYSTEM,2,Moderate,Minor,Medical,Medicare,,,,,Y,45149.75,5247.7
Long Island,Suffolk,5123000,000885,Long Island Community Hospital,70 or Older,117,M,White,Not Span/Hispanic,15,Emergency,Skilled Nursing Home,2020,NVS012,TRANSIENT CEREBRAL ISCHEMIA,,,047,TRANSIENT ISCHEMIA,01,DISEASES AND DISORDERS OF THE NERVOUS SYSTEM,3,Major,Moderate,Medical,Medicare,Medicare,Blue Cross/Blue Shield,,,Y,157962.27,25438.27
Long Island,Suffolk,5123000,000885,Long Island Community Hospital,70 or Older,117,M,White,Not Span/Hispanic,2,Emergency,Home or Self Care,2020,NVS012,TRANSIENT CEREBRAL ISCHEMIA,OTR004,ISOLATION PROCEDURES,047,TRANSIENT ISCHEMIA,01,DISEASES AND DISORDERS OF THE NERVOUS SYSTEM,3,Major,Major,Medical,Medicare,,,,,Y,58240.17,6177.04
Long Island,Suffolk,5123000,000885,Long Island Community Hospital,50 to 69,119,M,Black/African American,Not Span/Hispanic,2,Emergency,Home or Self Care,2020,NVS012,TRANSIENT CEREBRAL ISCHEMIA,,,047,TRANSIENT ISCHEMIA,01,DISEASES AND DISORDERS OF THE NERVOUS SYSTEM,3,Major,Major,Medical,Medicare,Medicare,Blue Cross/Blue Shield,,,Y,50737.03,7211.53
Long Island,Suffolk,5123000,000885,Long Island Community Hospital,70 or Older,117,F,White,Not Span/Hispanic,3,Emergency,Home w/ Home Health Services,2020,NVS012,TRANSIENT CEREBRAL ISCHEMIA,,,047,TRANSIENT ISCHEMIA,01,DISEASES AND DISORDERS OF THE NERVOUS SYSTEM,3,Major,Moderate,Medical,Medicare,Medicare,Private Health Insurance,,,Y,65843.05,8076.76
Long Island,Suffolk,5123000,000885,Long Island Community Hospital,50 to 69,119,M,White,Not Span/Hispanic,2,Emergency,Home or Self Care,2020,NVS012,TRANSIENT CEREBRAL ISCHEMIA,ADM005,ADMINISTRATION OF THROMBOLYTICS AND PLATELET INHIBITORS,047,TRANSIENT ISCHEMIA,01,DISEASES AND DISORDERS OF THE NERVOUS SYSTEM,1,Minor,Minor,Medical,Self-Pay,,,,,Y,143025.48,25304.31
