Hospital Service Area,Hospital County,Operating Certificate Number,Permanent Facility Id,Facility Name,Age Group,Zip Code - 3 digits,Gender,Race,Ethnicity,Length of Stay,Type of Admission,Patient Disposition,Discharge Year,CCS Diagnosis Code,CCS Diagnosis Description,CCS Procedure Code,CCS Procedure Description,APR DRG Code,APR DRG Description,APR MDC Code,APR MDC Description,APR Severity of Illness Code,APR Severity of Illness Description,APR Risk of Mortality,APR Medical Surgical Description,Payment Typology 1,Payment Typology 2,Payment Typology 3,Birth Weight,Abortion Edit Indicator,Emergency Department Indicator,Total Charges,Total Costs
Long Island,Nassau,2908000,000511,NYU Winthrop Hospital,50 to 69,117,M,White,Not Span/Hispanic,14,Emergency,Home w/ Home Health Services,2017,158,Chronic kidney disease,174,OT NON-OR THER PRC SKIN,470,Chronic Kidney Disease,11,Diseases and Disorders of the Kidney and Urinary Tract,3,Major,Extreme,Medical,Medicare,Medicare,Private Health Insurance,,N,Y,111039.71,24960.02
Long Island,Nassau,2908000,000511,NYU Winthrop Hospital,30 to 49,110,F,Black/African American,Not Span/Hispanic,3,Emergency,Home or Self Care,2017,099,Hypertension with complications and secondary hypertension,058,HEMODIALYSIS,470,Chronic Kidney Disease,11,Diseases and Disorders of the Kidney and Urinary Tract,2,Moderate,Minor,Medical,Private Health Insurance,Medicare,Medicare,,N,Y,39094.47,7289.01
Long Island,Nassau,2908000,000511,NYU Winthrop Hospital,50 to 69,110,F,Black/African American,Not Span/Hispanic,3,Emergency,Home w/ Home Health Services,2017,099,Hypertension with complications and secondary hypertension,058,HEMODIALYSIS,470,Chronic Kidney Disease,11,Diseases and Disorders of the Kidney and Urinary Tract,2,Moderate,Moderate,Medical,Blue Cross/Blue Shield,Medicare,Medicare,,N,Y,49869.20,9279.10
Long Island,Nassau,2908000,000511,NYU Winthrop Hospital,70 or Older,OOS,M,White,Not Span/Hispanic,7,Emergency,Home or Self Care,2017,099,Hypertension with complications and secondary hypertension,070,UP GASTRO ENDOSC/BIOPSY,470,Chronic Kidney Disease,11,Diseases and Disorders of the Kidney and Urinary Tract,2,Moderate,Moderate,Medical,Medicare,Medicare,Blue Cross/Blue Shield,,N,Y,160924.09,33138.11
Long Island,Nassau,2908000,000511,NYU Winthrop Hospital,50 to 69,110,M,Black/African American,Not Span/Hispanic,3,Emergency,Home or Self Care,2017,099,Hypertension with complications and secondary hypertension,058,HEMODIALYSIS,470,Chronic Kidney Disease,11,Diseases and Disorders of the Kidney and Urinary Tract,2,Moderate,Minor,Medical,Private Health Insurance,,,,N,Y,38540.30,6023.17
Long Island,Nassau,2908000,000511,NYU Winthrop Hospital,70 or Older,110,M,White,Not Span/Hispanic,2,Emergency,Home or Self Care,2017,099,Hypertension with complications and secondary hypertension,058,HEMODIALYSIS,470,Chronic Kidney Disease,11,Diseases and Disorders of the Kidney and Urinary Tract,3,Major,Major,Medical,Medicare,Medicare,Blue Cross/Blue Shield,,N,Y,28350.40,5179.29
Long Island,Nassau,2908000,000511,NYU Winthrop Hospital,50 to 69,115,M,Black/African American,Not Span/Hispanic,5,Emergency,Home w/ Home Health Services,2017,099,Hypertension with complications and secondary hypertension,058,HEMODIALYSIS,470,Chronic Kidney Disease,11,Diseases and Disorders of the Kidney and Urinary Tract,2,Moderate,Moderate,Medical,Medicaid,Medicaid,,,N,Y,97882.05,21583.81
Long Island,Nassau,2908000,000511,NYU Winthrop Hospital,50 to 69,115,M,White,Not Span/Hispanic,3,Emergency,Home or Self Care,2017,099,Hypertension with complications and secondary hypertension,058,HEMODIALYSIS,470,Chronic Kidney Disease,11,Diseases and Disorders of the Kidney and Urinary Tract,2,Moderate,Moderate,Medical,Medicare,Private Health Insurance,,,N,Y,35638.05,6508.84
Long Island,Nassau,2908000,000511,NYU Winthrop Hospital,50 to 69,115,M,Black/African American,Not Span/Hispanic,3,Emergency,Home or Self Care,2017,099,Hypertension with complications and secondary hypertension,000,NO PROC,470,Chronic Kidney Disease,11,Diseases and Disorders of the Kidney and Urinary Tract,1,Minor,Moderate,Medical,Medicaid,Medicaid,,,N,Y,55122.31,12151.01
Long Island,Nassau,2908000,000511,NYU Winthrop Hospital,30 to 49,115,M,Black/African American,Not Span/Hispanic,9,Emergency,Home w/ Home Health Services,2017,161,Other diseases of kidney and ureters,054,OT VASC CATH; NOT HEART,470,Chronic Kidney Disease,11,Diseases and Disorders of the Kidney and Urinary Tract,3,Major,Major,Medical,Medicare,Medicare,Private Health Insurance,,N,Y,118332.67,23525.35
Long Island,Nassau,2908000,000511,NYU Winthrop Hospital,70 or Older,115,F,White,Not Span/Hispanic,8,Emergency,Home w/ Home Health Services,2017,099,Hypertension with complications and secondary hypertension,000,NO PROC,470,Chronic Kidney Disease,11,Diseases and Disorders of the Kidney and Urinary Tract,4,Extreme,Extreme,Medical,Medicare,Medicare,Private Health Insurance,,N,Y,52030.84,11850.58
Long Island,Nassau,2908000,000511,NYU Winthrop Hospital,50 to 69,117,F,White,Not Span/Hispanic,1,Emergency,Left Against Medical Advice,2017,099,Hypertension with complications and secondary hypertension,058,HEMODIALYSIS,470,Chronic Kidney Disease,11,Diseases and Disorders of the Kidney and Urinary Tract,2,Moderate,Moderate,Medical,Medicare,Medicare,Private Health Insurance,,N,Y,10922.89,2171.89
Long Island,Nassau,2908000,000511,NYU Winthrop Hospital,30 to 49,115,M,Black/African American,Not Span/Hispanic,3,Emergency,Home or Self Care,2017,099,Hypertension with complications and secondary hypertension,222,BLOOD TRANSFUSION,470,Chronic Kidney Disease,11,Diseases and Disorders of the Kidney and Urinary Tract,3,Major,Major,Medical,Medicare,Medicare,,,N,Y,72742.26,10260.37
Long Island,Nassau,2908000,000511,NYU Winthrop Hospital,30 to 49,115,M,Black/African American,Not Span/Hispanic,1,Emergency,Left Against Medical Advice,2017,099,Hypertension with complications and secondary hypertension,058,HEMODIALYSIS,470,Chronic Kidney Disease,11,Diseases and Disorders of the Kidney and Urinary Tract,3,Major,Moderate,Medical,Medicare,Medicare,Private Health Insurance,,N,Y,14268.93,2561.80
Long Island,Nassau,2908000,000511,NYU Winthrop Hospital,50 to 69,,M,Black/African American,Not Span/Hispanic,1,Emergency,Left Against Medical Advice,2017,099,Hypertension with complications and secondary hypertension,058,HEMODIALYSIS,470,Chronic Kidney Disease,11,Diseases and Disorders of the Kidney and Urinary Tract,2,Moderate,Moderate,Medical,Medicare,Medicare,Blue Cross/Blue Shield,,N,Y,11097.98,2410.83
Long Island,Nassau,2908000,000511,NYU Winthrop Hospital,30 to 49,115,F,White,Spanish/Hispanic,3,Emergency,Home or Self Care,2017,099,Hypertension with complications and secondary hypertension,058,HEMODIALYSIS,470,Chronic Kidney Disease,11,Diseases and Disorders of the Kidney and Urinary Tract,2,Moderate,Minor,Medical,Medicare,Medicare,Medicaid,,N,Y,58000.01,13069.27
Long Island,Nassau,2908000,000511,NYU Winthrop Hospital,50 to 69,117,F,Black/African American,Not Span/Hispanic,4,Emergency,Home or Self Care,2017,099,Hypertension with complications and secondary hypertension,058,HEMODIALYSIS,470,Chronic Kidney Disease,11,Diseases and Disorders of the Kidney and Urinary Tract,3,Major,Major,Medical,Medicare,Medicare,,,N,Y,43295.18,8467.00
Long Island,Nassau,2908000,000511,NYU Winthrop Hospital,70 or Older,115,M,White,Not Span/Hispanic,1,Emergency,Home or Self Care,2017,099,Hypertension with complications and secondary hypertension,000,NO PROC,470,Chronic Kidney Disease,11,Diseases and Disorders of the Kidney and Urinary Tract,1,Minor,Minor,Medical,Private Health Insurance,Medicare,Medicare,,N,Y,33796.52,6995.39
Long Island,Nassau,2908000,000511,NYU Winthrop Hospital,30 to 49,115,M,White,Spanish/Hispanic,1,Elective,Left Against Medical Advice,2017,099,Hypertension with complications and secondary hypertension,000,NO PROC,470,Chronic Kidney Disease,11,Diseases and Disorders of the Kidney and Urinary Tract,2,Moderate,Minor,Medical,Medicaid,,,,N,Y,8293.00,1990.28
Long Island,Nassau,2908000,000511,NYU Winthrop Hospital,50 to 69,115,F,Black/African American,Not Span/Hispanic,2,Emergency,Home or Self Care,2017,099,Hypertension with complications and secondary hypertension,058,HEMODIALYSIS,470,Chronic Kidney Disease,11,Diseases and Disorders of the Kidney and Urinary Tract,2,Moderate,Minor,Medical,Medicaid,Medicaid,,,N,Y,29540.06,5304.32
Long Island,Nassau,2908000,000511,NYU Winthrop Hospital,30 to 49,117,M,Other Race,Spanish/Hispanic,1,Emergency,Home or Self Care,2017,158,Chronic kidney disease,000,NO PROC,470,Chronic Kidney Disease,11,Diseases and Disorders of the Kidney and Urinary Tract,2,Moderate,Minor,Medical,Private Health Insurance,,,,N,Y,13481.94,2297.96
Long Island,Nassau,2908000,000511,NYU Winthrop Hospital,70 or Older,115,M,White,Not Span/Hispanic,1,Emergency,Left Against Medical Advice,2017,099,Hypertension with complications and secondary hypertension,000,NO PROC,470,Chronic Kidney Disease,11,Diseases and Disorders of the Kidney and Urinary Tract,3,Major,Major,Medical,Miscellaneous/Other,,,,N,Y,22526.50,5023.91
Long Island,Nassau,2908000,000511,NYU Winthrop Hospital,70 or Older,118,M,Other Race,Spanish/Hispanic,5,Emergency,Home or Self Care,2017,099,Hypertension with complications and secondary hypertension,174,OT NON-OR THER PRC SKIN,470,Chronic Kidney Disease,11,Diseases and Disorders of the Kidney and Urinary Tract,3,Major,Major,Medical,Medicare,Medicare,,,N,Y,85344.32,19271.70
Long Island,Nassau,2908000,000511,NYU Winthrop Hospital,30 to 49,115,F,Black/African American,Not Span/Hispanic,4,Emergency,Home or Self Care,2017,099,Hypertension with complications and secondary hypertension,058,HEMODIALYSIS,470,Chronic Kidney Disease,11,Diseases and Disorders of the Kidney and Urinary Tract,2,Moderate,Moderate,Medical,Medicaid,,,,N,Y,54503.66,9100.04
Long Island,Nassau,2908000,000511,NYU Winthrop Hospital,70 or Older,117,M,White,Unknown,5,Elective,Skilled Nursing Home,2017,099,Hypertension with complications and secondary hypertension,058,HEMODIALYSIS,470,Chronic Kidney Disease,11,Diseases and Disorders of the Kidney and Urinary Tract,4,Extreme,Major,Medical,Medicare,Medicare,,,N,Y,76873.97,14083.22
Long Island,Nassau,2908000,000511,NYU Winthrop Hospital,70 or Older,118,M,Other Race,Spanish/Hispanic,5,Emergency,Home w/ Home Health Services,2017,099,Hypertension with complications and secondary hypertension,058,HEMODIALYSIS,470,Chronic Kidney Disease,11,Diseases and Disorders of the Kidney and Urinary Tract,3,Major,Major,Medical,Medicare,Medicare,,,N,Y,98273.92,22784.53
Long Island,Nassau,2908000,000511,NYU Winthrop Hospital,50 to 69,OOS,F,Black/African American,Not Span/Hispanic,3,Emergency,Home w/ Home Health Services,2017,099,Hypertension with complications and secondary hypertension,058,HEMODIALYSIS,470,Chronic Kidney Disease,11,Diseases and Disorders of the Kidney and Urinary Tract,3,Major,Moderate,Medical,Medicare,Medicare,,,N,Y,49372.18,9295.06
Long Island,Nassau,2908000,000511,NYU Winthrop Hospital,30 to 49,114,F,Black/African American,Not Span/Hispanic,6,Emergency,Home or Self Care,2017,099,Hypertension with complications and secondary hypertension,000,NO PROC,470,Chronic Kidney Disease,11,Diseases and Disorders of the Kidney and Urinary Tract,1,Minor,Moderate,Medical,Blue Cross/Blue Shield,Private Health Insurance,,,N,Y,55646.00,11147.03
Long Island,Nassau,2908000,000511,NYU Winthrop Hospital,50 to 69,115,M,Other Race,Not Span/Hispanic,4,Emergency,Home or Self Care,2017,099,Hypertension with complications and secondary hypertension,070,UP GASTRO ENDOSC/BIOPSY,470,Chronic Kidney Disease,11,Diseases and Disorders of the Kidney and Urinary Tract,3,Major,Major,Medical,Medicare,Medicare,,,N,Y,132008.78,27203.64
Long Island,Nassau,2908000,000511,NYU Winthrop Hospital,70 or Older,117,M,White,Not Span/Hispanic,4,Emergency,Home w/ Home Health Services,2017,099,Hypertension with complications and secondary hypertension,058,HEMODIALYSIS,470,Chronic Kidney Disease,11,Diseases and Disorders of the Kidney and Urinary Tract,3,Major,Moderate,Medical,Medicare,Medicare,,,N,Y,44636.80,8824.70
Long Island,Nassau,2908000,000511,NYU Winthrop Hospital,30 to 49,115,M,Black/African American,Not Span/Hispanic,1,Emergency,Home or Self Care,2017,099,Hypertension with complications and secondary hypertension,058,HEMODIALYSIS,470,Chronic Kidney Disease,11,Diseases and Disorders of the Kidney and Urinary Tract,3,Major,Moderate,Medical,Medicare,Medicare,,,N,Y,13692.71,2830.27
Long Island,Nassau,2908000,000511,NYU Winthrop Hospital,70 or Older,117,M,White,Not Span/Hispanic,6,Emergency,Home w/ Home Health Services,2017,099,Hypertension with complications and secondary hypertension,058,HEMODIALYSIS,470,Chronic Kidney Disease,11,Diseases and Disorders of the Kidney and Urinary Tract,2,Moderate,Moderate,Medical,Medicare,Medicare,Private Health Insurance,,N,Y,124907.25,27681.80
Long Island,Nassau,2908000,000511,NYU Winthrop Hospital,70 or Older,117,F,White,Not Span/Hispanic,3,Emergency,Home or Self Care,2017,099,Hypertension with complications and secondary hypertension,000,NO PROC,470,Chronic Kidney Disease,11,Diseases and Disorders of the Kidney and Urinary Tract,2,Moderate,Major,Medical,Medicare,Medicare,,,N,Y,32234.02,6477.05
Long Island,Nassau,2908000,000511,NYU Winthrop Hospital,50 to 69,114,M,Black/African American,Not Span/Hispanic,5,Emergency,Home or Self Care,2017,099,Hypertension with complications and secondary hypertension,058,HEMODIALYSIS,470,Chronic Kidney Disease,11,Diseases and Disorders of the Kidney and Urinary Tract,2,Moderate,Moderate,Medical,Private Health Insurance,,,,N,Y,68462.71,12327.81
Long Island,Nassau,2908000,000511,NYU Winthrop Hospital,70 or Older,117,F,White,Not Span/Hispanic,2,Emergency,Home or Self Care,2017,099,Hypertension with complications and secondary hypertension,058,HEMODIALYSIS,470,Chronic Kidney Disease,11,Diseases and Disorders of the Kidney and Urinary Tract,2,Moderate,Major,Medical,Medicare,Medicare,Private Health Insurance,,N,Y,40713.29,6559.68
Long Island,Nassau,2908000,000511,NYU Winthrop Hospital,50 to 69,115,M,White,Spanish/Hispanic,4,Emergency,Home or Self Care,2017,099,Hypertension with complications and secondary hypertension,058,HEMODIALYSIS,470,Chronic Kidney Disease,11,Diseases and Disorders of the Kidney and Urinary Tract,3,Major,Moderate,Medical,Medicare,Medicare,Medicaid,,N,Y,44545.20,8619.79
Long Island,Nassau,2908000,000511,NYU Winthrop Hospital,50 to 69,115,F,Black/African American,Not Span/Hispanic,4,Emergency,Home or Self Care,2017,099,Hypertension with complications and secondary hypertension,058,HEMODIALYSIS,470,Chronic Kidney Disease,11,Diseases and Disorders of the Kidney and Urinary Tract,2,Moderate,Minor,Medical,Medicare,Medicare,,,N,Y,85280.10,14993.23
Long Island,Nassau,2908000,000511,NYU Winthrop Hospital,70 or Older,117,M,White,Not Span/Hispanic,4,Emergency,Home or Self Care,2017,099,Hypertension with complications and secondary hypertension,049,OTHER OR HEART PRCS,470,Chronic Kidney Disease,11,Diseases and Disorders of the Kidney and Urinary Tract,2,Moderate,Moderate,Medical,Medicare,Medicare,Private Health Insurance,,N,Y,81134.70,19398.70
Long Island,Nassau,2908000,000511,NYU Winthrop Hospital,50 to 69,115,F,Black/African American,Not Span/Hispanic,3,Emergency,Home or Self Care,2017,099,Hypertension with complications and secondary hypertension,058,HEMODIALYSIS,470,Chronic Kidney Disease,11,Diseases and Disorders of the Kidney and Urinary Tract,2,Moderate,Moderate,Medical,Medicare,Medicare,,,N,Y,76939.54,15365.89
Long Island,Nassau,2908000,000511,NYU Winthrop Hospital,70 or Older,OOS,F,White,Not Span/Hispanic,6,Emergency,Home or Self Care,2017,099,Hypertension with complications and secondary hypertension,058,HEMODIALYSIS,470,Chronic Kidney Disease,11,Diseases and Disorders of the Kidney and Urinary Tract,3,Major,Moderate,Medical,Medicare,Medicare,Private Health Insurance,,N,Y,116844.33,26064.62
Long Island,Nassau,2908000,000511,NYU Winthrop Hospital,50 to 69,114,M,Black/African American,Not Span/Hispanic,5,Emergency,Home or Self Care,2017,099,Hypertension with complications and secondary hypertension,000,NO PROC,470,Chronic Kidney Disease,11,Diseases and Disorders of the Kidney and Urinary Tract,3,Major,Major,Medical,Private Health Insurance,,,,N,Y,50527.00,10599.05
Long Island,Nassau,2908000,000511,NYU Winthrop Hospital,30 to 49,113,F,Black/African American,Not Span/Hispanic,2,Emergency,Home or Self Care,2017,099,Hypertension with complications and secondary hypertension,000,NO PROC,470,Chronic Kidney Disease,11,Diseases and Disorders of the Kidney and Urinary Tract,2,Moderate,Minor,Medical,Blue Cross/Blue Shield,,,,N,Y,47925.94,10633.49
Long Island,Nassau,2908000,000511,NYU Winthrop Hospital,70 or Older,117,M,White,Not Span/Hispanic,8,Emergency,Home w/ Home Health Services,2017,099,Hypertension with complications and secondary hypertension,058,HEMODIALYSIS,470,Chronic Kidney Disease,11,Diseases and Disorders of the Kidney and Urinary Tract,3,Major,Major,Medical,Medicare,Medicare,,,N,Y,112707.01,25089.37
Long Island,Nassau,2908000,000511,NYU Winthrop Hospital,50 to 69,115,M,Black/African American,Not Span/Hispanic,5,Emergency,Home w/ Home Health Services,2017,099,Hypertension with complications and secondary hypertension,058,HEMODIALYSIS,470,Chronic Kidney Disease,11,Diseases and Disorders of the Kidney and Urinary Tract,3,Major,Moderate,Medical,Medicare,Medicare,Private Health Insurance,,N,Y,81593.45,18694.88
Long Island,Nassau,2908000,000511,NYU Winthrop Hospital,70 or Older,115,M,White,Not Span/Hispanic,5,Emergency,Home w/ Home Health Services,2017,099,Hypertension with complications and secondary hypertension,065,BONE MARROW BIOPSY,470,Chronic Kidney Disease,11,Diseases and Disorders of the Kidney and Urinary Tract,2,Moderate,Moderate,Medical,Medicare,Medicare,,,N,Y,88363.75,13868.16
Long Island,Nassau,2908000,000511,NYU Winthrop Hospital,50 to 69,115,M,Black/African American,Not Span/Hispanic,8,Emergency,Home w/ Home Health Services,2017,099,Hypertension with complications and secondary hypertension,058,HEMODIALYSIS,470,Chronic Kidney Disease,11,Diseases and Disorders of the Kidney and Urinary Tract,3,Major,Moderate,Medical,Medicare,Medicare,Blue Cross/Blue Shield,,N,Y,98824.35,19432.04
Long Island,Nassau,2908000,000511,NYU Winthrop Hospital,18 to 29,118,F,Other Race,Not Span/Hispanic,3,Emergency,Home or Self Care,2017,099,Hypertension with complications and secondary hypertension,058,HEMODIALYSIS,470,Chronic Kidney Disease,11,Diseases and Disorders of the Kidney and Urinary Tract,2,Moderate,Minor,Medical,Private Health Insurance,Self-Pay,,,N,Y,75156.36,18961.11
Long Island,Nassau,2908000,000511,NYU Winthrop Hospital,70 or Older,116,F,White,Not Span/Hispanic,10,Emergency,Skilled Nursing Home,2017,099,Hypertension with complications and secondary hypertension,222,BLOOD TRANSFUSION,470,Chronic Kidney Disease,11,Diseases and Disorders of the Kidney and Urinary Tract,3,Major,Major,Medical,Medicare,Medicare,Medicaid,,N,Y,168759.48,44528.92
Long Island,Nassau,2908000,000511,NYU Winthrop Hospital,50 to 69,115,M,Black/African American,Not Span/Hispanic,7,Emergency,Home w/ Home Health Services,2017,099,Hypertension with complications and secondary hypertension,222,BLOOD TRANSFUSION,470,Chronic Kidney Disease,11,Diseases and Disorders of the Kidney and Urinary Tract,3,Major,Moderate,Medical,Medicare,Medicare,Medicaid,,N,Y,76308.31,15138.06
Long Island,Nassau,2908000,000511,NYU Winthrop Hospital,50 to 69,115,M,Black/African American,Not Span/Hispanic,13,Emergency,Skilled Nursing Home,2017,099,Hypertension with complications and secondary hypertension,063,OT NON-OR THER CARDIO,470,Chronic Kidney Disease,11,Diseases and Disorders of the Kidney and Urinary Tract,3,Major,Major,Medical,Medicare,Medicare,Blue Cross/Blue Shield,,N,Y,215484.46,37470.17
