Hospital Service Area,Hospital County,Operating Certificate Number,Permanent Facility Id,Facility Name,Age Group,Zip Code - 3 digits,Gender,Race,Ethnicity,Length of Stay,Type of Admission,Patient Disposition,Discharge Year,CCS Diagnosis Code,CCS Diagnosis Description,CCS Procedure Code,CCS Procedure Description,APR DRG Code,APR DRG Description,APR MDC Code,APR MDC Description,APR Severity of Illness Code,APR Severity of Illness Description,APR Risk of Mortality,APR Medical Surgical Description,Payment Typology 1,Payment Typology 2,Payment Typology 3,Birth Weight,Abortion Edit Indicator,Emergency Department Indicator,Total Charges,Total Costs
New York City,Richmond,7004003,001737,Staten Island University Hospital Prince's Bay,70 or Older,103,M,White,Not Span/Hispanic,6,Emergency,Skilled Nursing Home,2018,GEN003,CHRONIC KIDNEY DISEASE,ADM001,TRANSFUSION OF BLOOD AND BLOOD PRODUCTS,470,CHRONIC KIDNEY DISEASE,11,DISEASES AND DISORDERS OF THE KIDNEY AND URINARY TRACT,3,Major,Major,Medical,Federal/State/Local/VA,Medicare,Private Health Insurance,,,true,48874.4,12365.2
New York City,Queens,7003007,001633,Queens Hospital Center,50 to 69,114,M,Other Race,Unknown,7,Emergency,Home w/ Home Health Services,2018,GEN003,CHRONIC KIDNEY DISEASE,ESA001,HEMODIALYSIS,470,CHRONIC KIDNEY DISEASE,11,DISEASES AND DISORDERS OF THE KIDNEY AND URINARY TRACT,2,Moderate,Moderate,Medical,Medicaid,,,,,true,40171.94,21450.57
New York City,Richmond,7004010,001738,Richmond University Medical Center,50 to 69,103,M,White,Not Span/Hispanic,1,Emergency,Left Against Medical Advice,2018,GEN003,CHRONIC KIDNEY DISEASE,,,470,CHRONIC KIDNEY DISEASE,11,DISEASES AND DISORDERS OF THE KIDNEY AND URINARY TRACT,2,Moderate,Minor,Medical,Medicaid,Medicaid,Self-Pay,,,true,8299.99,2127.14
New York City,Manhattan,7002001,001438,Bellevue Hospital Center,30 to 49,112,F,Other Race,Spanish/Hispanic,10,Elective,Home or Self Care,2018,GEN003,CHRONIC KIDNEY DISEASE,MAM005,MEASUREMENT DURING CARDIAC CATHETERIZATION,470,CHRONIC KIDNEY DISEASE,11,DISEASES AND DISORDERS OF THE KIDNEY AND URINARY TRACT,2,Moderate,Minor,Medical,Medicaid,,,,,false,57097.06,37946.71
Capital/Adirond,Albany,0101000,000001,Albany Medical Center Hospital,50 to 69,122,M,Black/African American,Not Span/Hispanic,2,Emergency,Home or Self Care,2018,GEN003,CHRONIC KIDNEY DISEASE,ESA001,HEMODIALYSIS,470,CHRONIC KIDNEY DISEASE,11,DISEASES AND DISORDERS OF THE KIDNEY AND URINARY TRACT,2,Moderate,Moderate,Medical,"Managed Care, Unspecified",,,,,true,16012.37,4197.51
Long Island,Nassau,2953000,000563,St. Francis Hospital & Heart Center,50 to 69,110,M,White,Not Span/Hispanic,8,Emergency,Skilled Nursing Home,2018,GEN003,CHRONIC KIDNEY DISEASE,IMG005,MAGNETIC RESONANCE IMAGING (MRI),470,CHRONIC KIDNEY DISEASE,11,DISEASES AND DISORDERS OF THE KIDNEY AND URINARY TRACT,2,Moderate,Moderate,Medical,Private Health Insurance,,,,,true,72802,14505.78
New York City,Manhattan,7002032,001469,Mount Sinai Morningside,30 to 49,100,M,Other Race,Spanish/Hispanic,2,Elective,Home or Self Care,2018,GEN006,OTHER SPECIFIED AND UNSPECIFIED DISEASES OF KIDNEY AND URETERS,ADM021,"ADMINISTRATION OF THERAPEUTIC SUBSTANCES, NEC",470,CHRONIC KIDNEY DISEASE,11,DISEASES AND DISORDERS OF THE KIDNEY AND URINARY TRACT,2,Moderate,Moderate,Medical,Medicare,Medicaid,Self-Pay,,,false,25936.61,6750.66
New York City,Queens,7003003,001629,Jamaica Hospital Medical Center,50 to 69,114,M,White,Spanish/Hispanic,4,Emergency,Home or Self Care,2018,GEN003,CHRONIC KIDNEY DISEASE,CAR024,VENOUS AND ARTERIAL CATHETER PLACEMENT,470,CHRONIC KIDNEY DISEASE,11,DISEASES AND DISORDERS OF THE KIDNEY AND URINARY TRACT,2,Moderate,Minor,Medical,Medicaid,,,,,true,29242,12721.3
New York City,Bronx,7000008,001172,Lincoln Medical & Mental Health Center,50 to 69,104,F,Other Race,Not Span/Hispanic,10,Emergency,Home w/ Home Health Services,2018,GEN003,CHRONIC KIDNEY DISEASE,ESA001,HEMODIALYSIS,470,CHRONIC KIDNEY DISEASE,11,DISEASES AND DISORDERS OF THE KIDNEY AND URINARY TRACT,2,Moderate,Minor,Medical,Medicaid,,,,,true,50806.3,30004.02
Long Island,Suffolk,5155000,000938,Peconic Bay Medical Center,70 or Older,119,M,Black/African American,Not Span/Hispanic,1,Emergency,Left Against Medical Advice,2018,GEN003,CHRONIC KIDNEY DISEASE,ESA001,HEMODIALYSIS,470,CHRONIC KIDNEY DISEASE,11,DISEASES AND DISORDERS OF THE KIDNEY AND URINARY TRACT,2,Moderate,Moderate,Medical,Medicare,Medicaid,,,,true,17427.74,4176.17
New York City,Kings,7001033,001315,Kingsbrook Jewish Medical Center,30 to 49,112,M,Other Race,Not Span/Hispanic,17,Emergency,Short-term Hospital,2018,GEN003,CHRONIC KIDNEY DISEASE,CAR024,VENOUS AND ARTERIAL CATHETER PLACEMENT,470,CHRONIC KIDNEY DISEASE,11,DISEASES AND DISORDERS OF THE KIDNEY AND URINARY TRACT,2,Moderate,Moderate,Medical,Medicaid,Self-Pay,,,,true,121119,46759.61
Long Island,Nassau,2951001,000541,North Shore University Hospital,30 to 49,114,F,Other Race,Not Span/Hispanic,1,Emergency,Home or Self Care,2018,GEN003,CHRONIC KIDNEY DISEASE,ADM012,CHEMOTHERAPY,470,CHRONIC KIDNEY DISEASE,11,DISEASES AND DISORDERS OF THE KIDNEY AND URINARY TRACT,2,Moderate,Moderate,Medical,Private Health Insurance,,,,,true,12831.77,2634.04
Long Island,Suffolk,5151001,000245,Stony Brook University Hospital,50 to 69,117,M,Other Race,Spanish/Hispanic,19,Emergency,Home or Self Care,2018,GEN003,CHRONIC KIDNEY DISEASE,ESA001,HEMODIALYSIS,470,CHRONIC KIDNEY DISEASE,11,DISEASES AND DISORDERS OF THE KIDNEY AND URINARY TRACT,3,Major,Major,Medical,Medicaid,,,,,true,157792.13,52465.87
Hudson Valley,Putnam,3950000,000752,Putnam Hospital,70 or Older,105,M,White,Not Span/Hispanic,14,Emergency,Skilled Nursing Home,2018,GEN003,CHRONIC KIDNEY DISEASE,CAR025,PLACEMENT OF TUNNELED OR IMPLANTABLE PORTION OF A VASCULAR ACCESS DEVICE,470,CHRONIC KIDNEY DISEASE,11,DISEASES AND DISORDERS OF THE KIDNEY AND URINARY TRACT,4,Extreme,Major,Medical,Medicare,Federal/State/Local/VA,,,,true,71309.55,33773.37
Long Island,Nassau,2952005,000552,Plainview Hospital,70 or Older,117,M,White,Not Span/Hispanic,2,Emergency,Home or Self Care,2018,GEN003,CHRONIC KIDNEY DISEASE,,,470,CHRONIC KIDNEY DISEASE,11,DISEASES AND DISORDERS OF THE KIDNEY AND URINARY TRACT,2,Moderate,Minor,Medical,Medicare,Blue Cross/Blue Shield,,,,true,18096.83,3991.31
Central NY,Onondaga,3301007,000635,University Hospital SUNY Health Science Center,70 or Older,132,M,Black/African American,Not Span/Hispanic,6,Emergency,Home w/ Home Health Services,2018,GEN003,CHRONIC KIDNEY DISEASE,CAR025,PLACEMENT OF TUNNELED OR IMPLANTABLE PORTION OF A VASCULAR ACCESS DEVICE,470,CHRONIC KIDNEY DISEASE,11,DISEASES AND DISORDERS OF THE KIDNEY AND URINARY TRACT,3,Major,Major,Medical,Medicare,,,,,false,49228.8,14721.43
New York City,Manhattan,7002054,001464,New York-Presbyterian Hospital - Columbia Presbyterian Center,50 to 69,113,F,Other Race,Not Span/Hispanic,3,Emergency,Home or Self Care,2018,GEN003,CHRONIC KIDNEY DISEASE,ESA001,HEMODIALYSIS,470,CHRONIC KIDNEY DISEASE,11,DISEASES AND DISORDERS OF THE KIDNEY AND URINARY TRACT,3,Major,Moderate,Medical,Medicare,Medicaid,Medicaid,,,true,47861.93,11034.77
New York City,Kings,7001016,001301,Kings County Hospital Center,70 or Older,112,M,Black/African American,Not Span/Hispanic,6,Emergency,Home or Self Care,2018,GEN003,CHRONIC KIDNEY DISEASE,ESA001,HEMODIALYSIS,470,CHRONIC KIDNEY DISEASE,11,DISEASES AND DISORDERS OF THE KIDNEY AND URINARY TRACT,3,Major,Major,Medical,Medicare,,,,,true,36719.14,26083.85
Hudson Valley,Westchester,5957001,001139,Westchester Medical Center,30 to 49,125,M,White,Not Span/Hispanic,1,Urgent,Home or Self Care,2018,GEN003,CHRONIC KIDNEY DISEASE,,,470,CHRONIC KIDNEY DISEASE,11,DISEASES AND DISORDERS OF THE KIDNEY AND URINARY TRACT,2,Moderate,Moderate,Medical,Medicare,,,,,false,13915.58,2576.75
New York City,Kings,7001016,001301,Kings County Hospital Center,50 to 69,112,M,Black/African American,Not Span/Hispanic,1,Emergency,Left Against Medical Advice,2018,GEN003,CHRONIC KIDNEY DISEASE,,,470,CHRONIC KIDNEY DISEASE,11,DISEASES AND DISORDERS OF THE KIDNEY AND URINARY TRACT,3,Major,Moderate,Medical,Medicaid,Medicaid,,,,true,7341.04,5214.79
New York City,Kings,7001016,001301,Kings County Hospital Center,30 to 49,116,M,Black/African American,Not Span/Hispanic,1,Emergency,Home or Self Care,2018,GEN003,CHRONIC KIDNEY DISEASE,ESA001,HEMODIALYSIS,470,CHRONIC KIDNEY DISEASE,11,DISEASES AND DISORDERS OF THE KIDNEY AND URINARY TRACT,2,Moderate,Moderate,Medical,Medicare,Medicaid,,,,true,6880.56,4887.68
New York City,Kings,7002002,001324,Mount Sinai Brooklyn,70 or Older,112,M,Black/African American,Not Span/Hispanic,6,Emergency,Home or Self Care,2018,GEN003,CHRONIC KIDNEY DISEASE,IMG008,ULTRASONOGRAPHY,470,CHRONIC KIDNEY DISEASE,11,DISEASES AND DISORDERS OF THE KIDNEY AND URINARY TRACT,1,Minor,Minor,Medical,Medicare,Miscellaneous/Other,Self-Pay,,,true,67553.92,11620.35
New York City,Queens,7003010,001637,New York - Presbyterian/Queens,70 or Older,113,M,White,Not Span/Hispanic,6,Emergency,Skilled Nursing Home,2018,GEN003,CHRONIC KIDNEY DISEASE,ADM001,TRANSFUSION OF BLOOD AND BLOOD PRODUCTS,470,CHRONIC KIDNEY DISEASE,11,DISEASES AND DISORDERS OF THE KIDNEY AND URINARY TRACT,3,Major,Major,Medical,Medicare,Self-Pay,,,,true,50588.21,14080.82
Long Island,Nassau,2950002,000528,Nassau University Medical Center,70 or Older,115,F,Black/African American,Not Span/Hispanic,12,Emergency,Home or Self Care,2018,GEN003,CHRONIC KIDNEY DISEASE,ESA001,HEMODIALYSIS,470,CHRONIC KIDNEY DISEASE,11,DISEASES AND DISORDERS OF THE KIDNEY AND URINARY TRACT,4,Extreme,Extreme,Medical,Medicaid,Self-Pay,,,,false,92642.3,38039.08
Hudson Valley,Westchester,5957001,001139,Westchester Medical Center,50 to 69,105,F,White,Not Span/Hispanic,5,Emergency,Home or Self Care,2018,GEN003,CHRONIC KIDNEY DISEASE,ESA001,HEMODIALYSIS,470,CHRONIC KIDNEY DISEASE,11,DISEASES AND DISORDERS OF THE KIDNEY AND URINARY TRACT,3,Major,Moderate,Medical,Medicare,Medicaid,,,,true,85399.87,15095.53
Hudson Valley,Westchester,5907001,001097,SJRH - St Johns Division,70 or Older,104,M,White,Not Span/Hispanic,1,Emergency,Home w/ Home Health Services,2018,GEN003,CHRONIC KIDNEY DISEASE,ESA001,HEMODIALYSIS,470,CHRONIC KIDNEY DISEASE,11,DISEASES AND DISORDERS OF THE KIDNEY AND URINARY TRACT,3,Major,Major,Medical,Medicare,Blue Cross/Blue Shield,,,,true,12044.11,6325.71
New York City,Richmond,7004003,001740,Staten Island University Hosp-North,70 or Older,103,F,White,Not Span/Hispanic,1,Emergency,Home or Self Care,2018,GEN003,CHRONIC KIDNEY DISEASE,,,470,CHRONIC KIDNEY DISEASE,11,DISEASES AND DISORDERS OF THE KIDNEY AND URINARY TRACT,3,Major,Major,Medical,Private Health Insurance,Medicare,Self-Pay,,,true,21866.55,3273.7
New York City,Bronx,7000006,003058,Montefiore Med Center - Jack D Weiler Hosp of A Einstein College Div,30 to 49,104,F,Other Race,Spanish/Hispanic,2,Emergency,Home or Self Care,2018,GEN003,CHRONIC KIDNEY DISEASE,ESA001,HEMODIALYSIS,470,CHRONIC KIDNEY DISEASE,11,DISEASES AND DISORDERS OF THE KIDNEY AND URINARY TRACT,2,Moderate,Minor,Medical,Medicaid,,,,,true,30718.12,5222.23
Central NY,Onondaga,3301007,000635,University Hospital SUNY Health Science Center,50 to 69,132,F,White,Not Span/Hispanic,1,Emergency,Home or Self Care,2018,GEN003,CHRONIC KIDNEY DISEASE,,,470,CHRONIC KIDNEY DISEASE,11,DISEASES AND DISORDERS OF THE KIDNEY AND URINARY TRACT,2,Moderate,Moderate,Medical,Federal/State/Local/VA,,,,,false,9734.8,2159.06
New York City,Kings,7001033,001315,Kingsbrook Jewish Medical Center,70 or Older,112,F,Black/African American,Not Span/Hispanic,6,Emergency,Home w/ Home Health Services,2018,GEN003,CHRONIC KIDNEY DISEASE,ADM021,"ADMINISTRATION OF THERAPEUTIC SUBSTANCES, NEC",470,CHRONIC KIDNEY DISEASE,11,DISEASES AND DISORDERS OF THE KIDNEY AND URINARY TRACT,3,Major,Major,Medical,Medicare,Medicare,Medicaid,,,true,51124,16155.73
Hudson Valley,Westchester,5957001,001139,Westchester Medical Center,30 to 49,105,M,Other Race,Unknown,1,Emergency,Court/Law Enforcement,2018,GEN003,CHRONIC KIDNEY DISEASE,ESA001,HEMODIALYSIS,470,CHRONIC KIDNEY DISEASE,11,DISEASES AND DISORDERS OF THE KIDNEY AND URINARY TRACT,2,Moderate,Moderate,Medical,Department of Corrections,,,,,true,22887.99,3705.15
Capital/Adirond,Albany,0101004,000005,St. Peter's Hospital,50 to 69,121,F,Black/African American,Not Span/Hispanic,2,Emergency,Home or Self Care,2018,GEN003,CHRONIC KIDNEY DISEASE,ESA001,HEMODIALYSIS,470,CHRONIC KIDNEY DISEASE,11,DISEASES AND DISORDERS OF THE KIDNEY AND URINARY TRACT,3,Major,Major,Medical,Medicare,Private Health Insurance,,,,true,21196,5917.83
Capital/Adirond,Albany,0101000,000001,Albany Medical Center Hospital,30 to 49,138,F,White,Not Span/Hispanic,1,Emergency,Home or Self Care,2018,GEN003,CHRONIC KIDNEY DISEASE,ESA001,HEMODIALYSIS,470,CHRONIC KIDNEY DISEASE,11,DISEASES AND DISORDERS OF THE KIDNEY AND URINARY TRACT,2,Moderate,Moderate,Medical,Medicare,,,,,true,10897.2,2711.41
Long Island,Suffolk,5154000,000924,South Shore University Hospital,50 to 69,117,M,Black/African American,Not Span/Hispanic,1,Emergency,Skilled Nursing Home,2018,GEN003,CHRONIC KIDNEY DISEASE,ADM001,TRANSFUSION OF BLOOD AND BLOOD PRODUCTS,470,CHRONIC KIDNEY DISEASE,11,DISEASES AND DISORDERS OF THE KIDNEY AND URINARY TRACT,2,Moderate,Minor,Medical,Medicare,Medicaid,,,,true,15321.53,3123.54
Western NY,Niagara,3102000,000574,Niagara Falls Memorial Medical Center,30 to 49,143,M,White,Not Span/Hispanic,2,Emergency,Home or Self Care,2018,GEN003,CHRONIC KIDNEY DISEASE,ESA001,HEMODIALYSIS,470,CHRONIC KIDNEY DISEASE,11,DISEASES AND DISORDERS OF THE KIDNEY AND URINARY TRACT,2,Moderate,Moderate,Medical,Medicare,Medicaid,Medicaid,,,true,8443.25,3866.5
New York City,Bronx,7000006,003058,Montefiore Med Center - Jack D Weiler Hosp of A Einstein College Div,30 to 49,104,M,White,Not Span/Hispanic,1,Emergency,Left Against Medical Advice,2018,GEN003,CHRONIC KIDNEY DISEASE,ADM001,TRANSFUSION OF BLOOD AND BLOOD PRODUCTS,470,CHRONIC KIDNEY DISEASE,11,DISEASES AND DISORDERS OF THE KIDNEY AND URINARY TRACT,3,Major,Moderate,Medical,Medicare,,,,,true,22263.35,3987.11
New York City,Kings,7001021,001306,New York - Presbyterian Brooklyn Methodist Hospital,70 or Older,112,F,Black/African American,Not Span/Hispanic,4,Emergency,Home w/ Home Health Services,2018,GEN006,OTHER SPECIFIED AND UNSPECIFIED DISEASES OF KIDNEY AND URETERS,ESA001,HEMODIALYSIS,470,CHRONIC KIDNEY DISEASE,11,DISEASES AND DISORDERS OF THE KIDNEY AND URINARY TRACT,3,Major,Major,Medical,Medicare,Medicaid,Self-Pay,,,true,31000.22,9202.57
,,,,Redacted for Confidentiality,30 to 49,,F,Multi-racial,Unknown,2,Emergency,Left Against Medical Advice,2018,GEN003,CHRONIC KIDNEY DISEASE,ESA001,HEMODIALYSIS,470,CHRONIC KIDNEY DISEASE,11,DISEASES AND DISORDERS OF THE KIDNEY AND URINARY TRACT,3,Major,Moderate,Medical,Medicare,Medicaid,Self-Pay,,,true,29404.77,4963.07
New York City,Queens,7003003,001629,Jamaica Hospital Medical Center,50 to 69,112,F,Black/African American,Not Span/Hispanic,8,Emergency,Home or Self Care,2018,GEN003,CHRONIC KIDNEY DISEASE,ESA001,HEMODIALYSIS,470,CHRONIC KIDNEY DISEASE,11,DISEASES AND DISORDERS OF THE KIDNEY AND URINARY TRACT,3,Major,Major,Medical,Medicare,Medicaid,,,,true,47532,21382.6
New York City,Kings,7001046,001309,Interfaith Medical Center,50 to 69,112,F,Black/African American,Not Span/Hispanic,8,Emergency,Skilled Nursing Home,2018,GEN003,CHRONIC KIDNEY DISEASE,ESA001,HEMODIALYSIS,470,CHRONIC KIDNEY DISEASE,11,DISEASES AND DISORDERS OF THE KIDNEY AND URINARY TRACT,2,Moderate,Moderate,Medical,Medicaid,Medicaid,,,,false,60656.61,20129.58
New York City,Queens,7003004,001638,Long Island Jewish Forest Hills,50 to 69,115,F,Other Race,Not Span/Hispanic,1,Emergency,Home w/ Home Health Services,2018,GEN003,CHRONIC KIDNEY DISEASE,ADM001,TRANSFUSION OF BLOOD AND BLOOD PRODUCTS,470,CHRONIC KIDNEY DISEASE,11,DISEASES AND DISORDERS OF THE KIDNEY AND URINARY TRACT,2,Moderate,Minor,Medical,Medicare,Medicare,Medicaid,,,true,19304.28,5612.71
New York City,Manhattan,7002054,001464,New York-Presbyterian Hospital - Columbia Presbyterian Center,50 to 69,104,M,Other Race,Spanish/Hispanic,3,Emergency,Home or Self Care,2018,GEN003,CHRONIC KIDNEY DISEASE,ESA001,HEMODIALYSIS,470,CHRONIC KIDNEY DISEASE,11,DISEASES AND DISORDERS OF THE KIDNEY AND URINARY TRACT,2,Moderate,Moderate,Medical,Medicare,Medicare,Medicaid,,,true,63156.49,25374.79
Long Island,Nassau,2952006,000551,St. Joseph Hospital,50 to 69,117,M,White,Not Span/Hispanic,1,Emergency,Home or Self Care,2018,GEN003,CHRONIC KIDNEY DISEASE,ESA001,HEMODIALYSIS,470,CHRONIC KIDNEY DISEASE,11,DISEASES AND DISORDERS OF THE KIDNEY AND URINARY TRACT,2,Moderate,Moderate,Medical,Medicare,Private Health Insurance,,,,true,16466.14,3064.82
New York City,Queens,7003004,003376,Cohen Children's Medical Center,0 to 17,117,M,White,Not Span/Hispanic,2,Urgent,Home or Self Care,2018,GEN003,CHRONIC KIDNEY DISEASE,,,470,CHRONIC KIDNEY DISEASE,11,DISEASES AND DISORDERS OF THE KIDNEY AND URINARY TRACT,2,Moderate,Moderate,Medical,Private Health Insurance,Medicare,Medicaid,,,false,22611.92,5964.18
New York City,Manhattan,7002032,001469,Mount Sinai Morningside,50 to 69,100,F,Other Race,Spanish/Hispanic,2,Emergency,Skilled Nursing Home,2018,GEN003,CHRONIC KIDNEY DISEASE,ADM001,TRANSFUSION OF BLOOD AND BLOOD PRODUCTS,470,CHRONIC KIDNEY DISEASE,11,DISEASES AND DISORDERS OF THE KIDNEY AND URINARY TRACT,3,Major,Major,Medical,Medicare,Medicaid,Self-Pay,,,true,26495.12,7294.83
Long Island,Nassau,2901000,000490,Glen Cove Hospital,70 or Older,115,F,White,Not Span/Hispanic,10,Emergency,Skilled Nursing Home,2018,GEN003,CHRONIC KIDNEY DISEASE,,,470,CHRONIC KIDNEY DISEASE,11,DISEASES AND DISORDERS OF THE KIDNEY AND URINARY TRACT,3,Major,Major,Medical,Medicare,Medicare,,,,true,63256.65,16491.43
Hudson Valley,Westchester,5907002,001098,St. Joseph's Medical Center,50 to 69,107,M,Other Race,Unknown,6,Emergency,Home or Self Care,2018,GEN003,CHRONIC KIDNEY DISEASE,ESA001,HEMODIALYSIS,470,CHRONIC KIDNEY DISEASE,11,DISEASES AND DISORDERS OF THE KIDNEY AND URINARY TRACT,3,Major,Major,Medical,Medicaid,,,,,true,20046.12,13447.59
New York City,Queens,7003004,001630,Long Island Jewish Medical Center,70 or Older,114,M,Other Race,Not Span/Hispanic,5,Emergency,Home or Self Care,2018,GEN003,CHRONIC KIDNEY DISEASE,ESA001,HEMODIALYSIS,470,CHRONIC KIDNEY DISEASE,11,DISEASES AND DISORDERS OF THE KIDNEY AND URINARY TRACT,3,Major,Major,Medical,Medicare,Self-Pay,,,,false,53219.84,10022.52
New York City,Bronx,7000006,003058,Montefiore Med Center - Jack D Weiler Hosp of A Einstein College Div,50 to 69,104,F,White,Spanish/Hispanic,2,Emergency,Home or Self Care,2018,GEN003,CHRONIC KIDNEY DISEASE,ADM015,ADMINISTRATION OF ANTIBIOTICS,470,CHRONIC KIDNEY DISEASE,11,DISEASES AND DISORDERS OF THE KIDNEY AND URINARY TRACT,3,Major,Moderate,Medical,Medicaid,,,,,true,18084.12,2399.62
New York City,Queens,7003007,001633,Queens Hospital Center,50 to 69,113,M,Other Race,Spanish/Hispanic,38,Emergency,Home w/ Home Health Services,2018,GEN003,CHRONIC KIDNEY DISEASE,CAR025,PLACEMENT OF TUNNELED OR IMPLANTABLE PORTION OF A VASCULAR ACCESS DEVICE,470,CHRONIC KIDNEY DISEASE,11,DISEASES AND DISORDERS OF THE KIDNEY AND URINARY TRACT,3,Major,Major,Medical,Medicaid,,,,,true,265913.65,141989.65
New York City,Richmond,7004003,001737,Staten Island University Hospital Prince's Bay,70 or Older,103,M,White,Not Span/Hispanic,5,Emergency,Skilled Nursing Home,2018,GEN003,CHRONIC KIDNEY DISEASE,ADM001,TRANSFUSION OF BLOOD AND BLOOD PRODUCTS,470,CHRONIC KIDNEY DISEASE,11,DISEASES AND DISORDERS OF THE KIDNEY AND URINARY TRACT,3,Major,Major,Medical,Federal/State/Local/VA,Medicare,Private Health Insurance,,,true,36545.3,9558.49
New York City,Bronx,7000006,001169,Montefiore Medical Center - Henry & Lucy Moses Div,30 to 49,104,F,Black/African American,Not Span/Hispanic,1,Emergency,Home or Self Care,2018,GEN003,CHRONIC KIDNEY DISEASE,,,470,CHRONIC KIDNEY DISEASE,11,DISEASES AND DISORDERS OF THE KIDNEY AND URINARY TRACT,2,Moderate,Moderate,Medical,Medicare,Medicaid,,,,false,22477.35,4131.67
New York City,Kings,7002002,001324,Mount Sinai Brooklyn,50 to 69,112,M,Black/African American,Unknown,1,Emergency,Home w/ Home Health Services,2018,GEN003,CHRONIC KIDNEY DISEASE,ESA001,HEMODIALYSIS,470,CHRONIC KIDNEY DISEASE,11,DISEASES AND DISORDERS OF THE KIDNEY AND URINARY TRACT,2,Moderate,Minor,Medical,Private Health Insurance,Self-Pay,,,,true,22804.85,4662.87
New York City,Queens,7003004,001630,Long Island Jewish Medical Center,50 to 69,112,M,Other Race,Not Span/Hispanic,9,Emergency,Home or Self Care,2018,GEN003,CHRONIC KIDNEY DISEASE,ADM001,TRANSFUSION OF BLOOD AND BLOOD PRODUCTS,470,CHRONIC KIDNEY DISEASE,11,DISEASES AND DISORDERS OF THE KIDNEY AND URINARY TRACT,2,Moderate,Moderate,Medical,Medicaid,Self-Pay,,,,false,128274.44,45380.59
New York City,Manhattan,7002054,003975,New York Presbyterian Hospital - Allen Hospital,50 to 69,104,F,Black/African American,Not Span/Hispanic,10,Emergency,Left Against Medical Advice,2018,GEN003,CHRONIC KIDNEY DISEASE,ESA001,HEMODIALYSIS,470,CHRONIC KIDNEY DISEASE,11,DISEASES AND DISORDERS OF THE KIDNEY AND URINARY TRACT,3,Major,Major,Medical,Medicaid,Medicaid,Self-Pay,,,true,118946.91,28675.57
Capital/Adirond,Albany,0101004,000005,St. Peter's Hospital,30 to 49,122,F,Other Race,Not Span/Hispanic,6,Emergency,Home or Self Care,2018,GEN003,CHRONIC KIDNEY DISEASE,GIS006,PARACENTESIS,470,CHRONIC KIDNEY DISEASE,11,DISEASES AND DISORDERS OF THE KIDNEY AND URINARY TRACT,3,Major,Moderate,Medical,Medicare,Medicaid,,,,true,34344.96,13313.09
New York City,Kings,7001009,001294,Coney Island Hospital,50 to 69,112,M,Other Race,Not Span/Hispanic,4,Emergency,Home or Self Care,2018,GEN003,CHRONIC KIDNEY DISEASE,URN002,KIDNEY AND OTHER URINARY TRACT BIOPSY (NON-ENDOSCOPIC),470,CHRONIC KIDNEY DISEASE,11,DISEASES AND DISORDERS OF THE KIDNEY AND URINARY TRACT,2,Moderate,Minor,Medical,Medicaid,,,,,true,32548.96,18218.6
Long Island,Suffolk,5154000,000924,South Shore University Hospital,30 to 49,117,M,Black/African American,Not Span/Hispanic,1,Emergency,Left Against Medical Advice,2018,GEN003,CHRONIC KIDNEY DISEASE,ESA001,HEMODIALYSIS,470,CHRONIC KIDNEY DISEASE,11,DISEASES AND DISORDERS OF THE KIDNEY AND URINARY TRACT,2,Moderate,Moderate,Medical,Medicare,Medicaid,,,,true,22764.1,4260.59
Long Island,Suffolk,5149000,000895,John T Mather Memorial Hospital of Port Jefferson New York Inc,30 to 49,117,M,Other Race,Not Span/Hispanic,1,Emergency,Home or Self Care,2018,GEN003,CHRONIC KIDNEY DISEASE,ESA001,HEMODIALYSIS,470,CHRONIC KIDNEY DISEASE,11,DISEASES AND DISORDERS OF THE KIDNEY AND URINARY TRACT,2,Moderate,Moderate,Medical,Private Health Insurance,,,,,true,12202.2,3285.19
New York City,Queens,7001024,001635,St Johns Episcopal Hospital So Shore,70 or Older,116,F,Black/African American,Not Span/Hispanic,3,Emergency,Home or Self Care,2018,GEN003,CHRONIC KIDNEY DISEASE,ESA001,HEMODIALYSIS,470,CHRONIC KIDNEY DISEASE,11,DISEASES AND DISORDERS OF THE KIDNEY AND URINARY TRACT,2,Moderate,Moderate,Medical,Medicare,Medicare,Medicaid,,,true,20946.74,6090.43
New York City,Queens,7003004,001638,Long Island Jewish Forest Hills,70 or Older,114,F,Black/African American,Not Span/Hispanic,3,Emergency,Home w/ Home Health Services,2018,GEN003,CHRONIC KIDNEY DISEASE,ADM001,TRANSFUSION OF BLOOD AND BLOOD PRODUCTS,470,CHRONIC KIDNEY DISEASE,11,DISEASES AND DISORDERS OF THE KIDNEY AND URINARY TRACT,3,Major,Moderate,Medical,Medicare,Medicare,Medicaid,,,true,46382.82,11869.15
New York City,Queens,7003004,001638,Long Island Jewish Forest Hills,50 to 69,116,F,Black/African American,Not Span/Hispanic,2,Emergency,Home or Self Care,2018,GEN003,CHRONIC KIDNEY DISEASE,ADM001,TRANSFUSION OF BLOOD AND BLOOD PRODUCTS,470,CHRONIC KIDNEY DISEASE,11,DISEASES AND DISORDERS OF THE KIDNEY AND URINARY TRACT,3,Major,Moderate,Medical,Private Health Insurance,,,,,true,31614.97,9115.65